\relax 
\providecommand\hyper@newdestlabel[2]{}
\providecommand\HyperFirstAtBeginDocument{\AtBeginDocument}
\HyperFirstAtBeginDocument{\ifx\hyper@anchor\@undefined
\global\let\oldcontentsline\contentsline
\gdef\contentsline#1#2#3#4{\oldcontentsline{#1}{#2}{#3}}
\global\let\oldnewlabel\newlabel
\gdef\newlabel#1#2{\newlabelxx{#1}#2}
\gdef\newlabelxx#1#2#3#4#5#6{\oldnewlabel{#1}{{#2}{#3}}}
\AtEndDocument{\ifx\hyper@anchor\@undefined
\let\contentsline\oldcontentsline
\let\newlabel\oldnewlabel
\fi}
\fi}
\global\let\hyper@last\relax 
\gdef\HyperFirstAtBeginDocument#1{#1}
\providecommand\HyField@AuxAddToFields[1]{}
\providecommand\HyField@AuxAddToCoFields[2]{}
\babel@aux{english}{}
\newlabel{index::doc}{{}{1}{}{section*.2}{}}
\@writefile{toc}{\contentsline {chapter}{\numberline {1}Contents}{3}{chapter.1}}
\@writefile{lof}{\addvspace {10\p@ }}
\@writefile{lot}{\addvspace {10\p@ }}
\newlabel{index:contents}{{1}{3}{Contents}{chapter.1}{}}
\newlabel{EV3:module-source}{{1}{3}{Contents}{section*.3}{}}
\@writefile{toc}{\contentsline {section}{\numberline {1.1}EV3}{3}{section.1.1}}
\newlabel{EV3:ev3}{{1.1}{3}{EV3}{section.1.1}{}}
\newlabel{EV3::doc}{{1.1}{3}{EV3}{section.1.1}{}}
\newlabel{EV3:source.EV3}{{1.1}{3}{EV3}{section*.4}{}}
\newlabel{EV3:source.EV3.motorA}{{1.1}{3}{}{section*.5}{}}
\newlabel{EV3:source.EV3.motorB}{{1.1}{3}{}{section*.6}{}}
\newlabel{EV3:source.EV3.motorC}{{1.1}{4}{}{section*.7}{}}
\newlabel{EV3:source.EV3.motorD}{{1.1}{4}{}{section*.8}{}}
\newlabel{EV3:source.EV3.sensor1}{{1.1}{4}{}{section*.9}{}}
\newlabel{EV3:source.EV3.sensor2}{{1.1}{4}{}{section*.10}{}}
\newlabel{EV3:source.EV3.sensor3}{{1.1}{4}{}{section*.11}{}}
\newlabel{EV3:source.EV3.sensor4}{{1.1}{4}{}{section*.12}{}}
\newlabel{EV3:source.EV3.debug}{{1.1}{4}{}{section*.13}{}}
\newlabel{EV3:source.EV3.batteryMode}{{1.1}{4}{}{section*.14}{}}
\newlabel{EV3:source.EV3.batteryValue}{{1.1}{4}{}{section*.15}{}}
\newlabel{EV3:source.EV3.isConnected}{{1.1}{4}{}{section*.16}{}}
\newlabel{EV3:source.EV3.beep}{{1.1}{5}{}{section*.17}{}}
\newlabel{EV3:source.EV3.connect}{{1.1}{5}{}{section*.18}{}}
\newlabel{EV3:source.EV3.disconnect}{{1.1}{5}{}{section*.19}{}}
\newlabel{EV3:source.EV3.playTone}{{1.1}{6}{}{section*.20}{}}
\newlabel{EV3:source.EV3.setProperties}{{1.1}{6}{}{section*.21}{}}
\newlabel{EV3:source.EV3.stopTone}{{1.1}{6}{}{section*.22}{}}
\newlabel{EV3:source.EV3.tonePlayed}{{1.1}{6}{}{section*.23}{}}
\newlabel{Motor:module-source}{{1.1}{7}{EV3}{section*.24}{}}
\@writefile{toc}{\contentsline {section}{\numberline {1.2}Motor}{7}{section.1.2}}
\newlabel{Motor:motor}{{1.2}{7}{Motor}{section.1.2}{}}
\newlabel{Motor::doc}{{1.2}{7}{Motor}{section.1.2}{}}
\newlabel{Motor:source.Motor}{{1.2}{7}{Motor}{section*.25}{}}
\newlabel{Motor:source.Motor.power}{{1.2}{7}{}{section*.26}{}}
\newlabel{Motor:source.Motor.speedRegulation}{{1.2}{7}{}{section*.27}{}}
\newlabel{Motor:source.Motor.smoothStart}{{1.2}{8}{}{section*.28}{}}
\newlabel{Motor:source.Motor.smoothStop}{{1.2}{8}{}{section*.29}{}}
\newlabel{Motor:source.Motor.limitValue}{{1.2}{8}{}{section*.30}{}}
\newlabel{Motor:source.Motor.limitMode}{{1.2}{8}{}{section*.31}{}}
\newlabel{Motor:source.Motor.brakeMode}{{1.2}{8}{}{section*.32}{}}
\newlabel{Motor:source.Motor.debug}{{1.2}{8}{}{section*.33}{}}
\newlabel{Motor:source.Motor.isRunning}{{1.2}{8}{}{section*.34}{}}
\newlabel{Motor:source.Motor.tachoCount}{{1.2}{8}{}{section*.35}{}}
\newlabel{Motor:source.Motor.currentSpeed}{{1.2}{8}{}{section*.36}{}}
\newlabel{Motor:source.Motor.type}{{1.2}{8}{}{section*.37}{}}
\newlabel{Motor:source.Motor.internalReset}{{1.2}{8}{}{section*.38}{}}
\newlabel{Motor:source.Motor.resetTachoCount}{{1.2}{9}{}{section*.39}{}}
\newlabel{Motor:source.Motor.setBrake}{{1.2}{9}{}{section*.40}{}}
\newlabel{Motor:source.Motor.setProperties}{{1.2}{9}{}{section*.41}{}}
\newlabel{Motor:source.Motor.start}{{1.2}{10}{}{section*.42}{}}
\newlabel{Motor:source.Motor.stop}{{1.2}{10}{}{section*.43}{}}
\newlabel{Motor:source.Motor.syncedStart}{{1.2}{10}{}{section*.44}{}}
\newlabel{Motor:source.Motor.syncedStop}{{1.2}{10}{}{section*.45}{}}
\newlabel{Motor:source.Motor.waitFor}{{1.2}{11}{}{section*.46}{}}
\newlabel{Sensor:module-source}{{1.2}{11}{Motor}{section*.47}{}}
\@writefile{toc}{\contentsline {section}{\numberline {1.3}Sensor}{11}{section.1.3}}
\newlabel{Sensor:sensor}{{1.3}{11}{Sensor}{section.1.3}{}}
\newlabel{Sensor::doc}{{1.3}{11}{Sensor}{section.1.3}{}}
\newlabel{Sensor:source.Sensor}{{1.3}{11}{Sensor}{section*.48}{}}
\newlabel{Sensor:source.Sensor.mode}{{1.3}{12}{}{section*.49}{}}
\newlabel{Sensor:source.Sensor.debug}{{1.3}{15}{}{section*.50}{}}
\newlabel{Sensor:source.Sensor.value}{{1.3}{15}{}{section*.51}{}}
\newlabel{Sensor:source.Sensor.type}{{1.3}{15}{}{section*.52}{}}
\newlabel{Sensor:source.Sensor.reset}{{1.3}{15}{}{section*.53}{}}
\newlabel{Sensor:source.Sensor.setProperties}{{1.3}{15}{}{section*.54}{}}
\newlabel{hid:module-source}{{1.3}{16}{Sensor}{section*.55}{}}
\@writefile{toc}{\contentsline {section}{\numberline {1.4}hidapi}{16}{section.1.4}}
\newlabel{hid:hidapi}{{1.4}{16}{hidapi}{section.1.4}{}}
\newlabel{hid::doc}{{1.4}{16}{hidapi}{section.1.4}{}}
\newlabel{hid:source.hidapi}{{1.4}{16}{hidapi}{section*.56}{}}
\newlabel{hid:source.hidapi.handle}{{1.4}{17}{}{section*.57}{}}
\newlabel{hid:source.hidapi.vendorID}{{1.4}{17}{}{section*.58}{}}
\newlabel{hid:source.hidapi.productID}{{1.4}{17}{}{section*.59}{}}
\newlabel{hid:source.hidapi.nReadBuffer}{{1.4}{17}{}{section*.60}{}}
\newlabel{hid:source.hidapi.nWriteBuffer}{{1.4}{17}{}{section*.61}{}}
\newlabel{hid:source.hidapi.slib}{{1.4}{17}{}{section*.62}{}}
\newlabel{hid:source.hidapi.sheader}{{1.4}{17}{}{section*.63}{}}
\newlabel{hid:source.hidapi.close}{{1.4}{17}{}{section*.64}{}}
\newlabel{hid:source.hidapi.enumerate}{{1.4}{17}{}{section*.65}{}}
\newlabel{hid:source.hidapi.error}{{1.4}{18}{}{section*.66}{}}
\newlabel{hid:source.hidapi.exit}{{1.4}{18}{}{section*.67}{}}
\newlabel{hid:source.hidapi.getHIDInfoString}{{1.4}{18}{}{section*.68}{}}
\newlabel{hid:source.hidapi.getManufacturersString}{{1.4}{18}{}{section*.69}{}}
\newlabel{hid:source.hidapi.getProductString}{{1.4}{18}{}{section*.70}{}}
\newlabel{hid:source.hidapi.getSerialNumberString}{{1.4}{18}{}{section*.71}{}}
\newlabel{hid:source.hidapi.init}{{1.4}{18}{}{section*.72}{}}
\newlabel{hid:source.hidapi.open}{{1.4}{18}{}{section*.73}{}}
\newlabel{hid:source.hidapi.read}{{1.4}{19}{}{section*.74}{}}
\newlabel{hid:source.hidapi.read_timeout}{{1.4}{19}{}{section*.75}{}}
\newlabel{hid:source.hidapi.setNonBlocking}{{1.4}{19}{}{section*.76}{}}
\newlabel{hid:source.hidapi.write}{{1.4}{19}{}{section*.77}{}}
\newlabel{usbBrickIO:module-source}{{1.4}{19}{hidapi}{section*.78}{}}
\@writefile{toc}{\contentsline {section}{\numberline {1.5}usbBrickIO}{20}{section.1.5}}
\newlabel{usbBrickIO:usbbrickio}{{1.5}{20}{usbBrickIO}{section.1.5}{}}
\newlabel{usbBrickIO::doc}{{1.5}{20}{usbBrickIO}{section.1.5}{}}
\newlabel{usbBrickIO:source.usbBrickIO}{{1.5}{20}{usbBrickIO}{section*.79}{}}
\newlabel{usbBrickIO:source.usbBrickIO.debug}{{1.5}{20}{}{section*.80}{}}
\newlabel{usbBrickIO:source.usbBrickIO.vendorID}{{1.5}{20}{}{section*.81}{}}
\newlabel{usbBrickIO:source.usbBrickIO.productID}{{1.5}{20}{}{section*.82}{}}
\newlabel{usbBrickIO:source.usbBrickIO.nReadBuffer}{{1.5}{20}{}{section*.83}{}}
\newlabel{usbBrickIO:source.usbBrickIO.nWriteBuffer}{{1.5}{20}{}{section*.84}{}}
\newlabel{usbBrickIO:source.usbBrickIO.timeOut}{{1.5}{20}{}{section*.85}{}}
\newlabel{usbBrickIO:source.usbBrickIO.close}{{1.5}{20}{}{section*.86}{}}
\newlabel{usbBrickIO:source.usbBrickIO.open}{{1.5}{21}{}{section*.87}{}}
\newlabel{usbBrickIO:source.usbBrickIO.read}{{1.5}{21}{}{section*.88}{}}
\newlabel{usbBrickIO:source.usbBrickIO.setProperties}{{1.5}{21}{}{section*.89}{}}
\newlabel{usbBrickIO:source.usbBrickIO.write}{{1.5}{21}{}{section*.90}{}}
\newlabel{btBrickIO:module-source}{{1.5}{21}{usbBrickIO}{section*.91}{}}
\@writefile{toc}{\contentsline {section}{\numberline {1.6}btBrickIO}{21}{section.1.6}}
\newlabel{btBrickIO:btbrickio}{{1.6}{21}{btBrickIO}{section.1.6}{}}
\newlabel{btBrickIO::doc}{{1.6}{21}{btBrickIO}{section.1.6}{}}
\newlabel{btBrickIO:source.btBrickIO}{{1.6}{21}{btBrickIO}{section*.92}{}}
\newlabel{btBrickIO:source.btBrickIO.debug}{{1.6}{21}{}{section*.93}{}}
\newlabel{btBrickIO:source.btBrickIO.serialPort}{{1.6}{22}{}{section*.94}{}}
\newlabel{btBrickIO:source.btBrickIO.deviceName}{{1.6}{22}{}{section*.95}{}}
\newlabel{btBrickIO:source.btBrickIO.channel}{{1.6}{22}{}{section*.96}{}}
\newlabel{btBrickIO:source.btBrickIO.timeOut}{{1.6}{22}{}{section*.97}{}}
\newlabel{btBrickIO:source.btBrickIO.backend}{{1.6}{22}{}{section*.98}{}}
\newlabel{btBrickIO:source.btBrickIO.close}{{1.6}{22}{}{section*.99}{}}
\newlabel{btBrickIO:source.btBrickIO.open}{{1.6}{22}{}{section*.100}{}}
\newlabel{btBrickIO:source.btBrickIO.read}{{1.6}{22}{}{section*.101}{}}
\newlabel{btBrickIO:source.btBrickIO.setProperties}{{1.6}{22}{}{section*.102}{}}
\newlabel{btBrickIO:source.btBrickIO.write}{{1.6}{22}{}{section*.103}{}}
\@writefile{toc}{\contentsline {chapter}{MATLAB Module Index}{25}{section*.104}}
\@writefile{toc}{\contentsline {chapter}{Index}{27}{section*.105}}
