<?xml version="1.0" encoding="UTF-8" standalone="no"?>
<svg
   sodipodi:docname="legos_logo_simple.svg"
   inkscape:version="1.3.2 (091e20ef0f, 2023-11-25)"
   width="12.266222mm"
   height="22mm"
   viewBox="0 0 12.266222 22"
   version="1.1"
   id="svg118"
   inkscape:export-filename="D:\Research\LEGOS\Doc\Logo\legos.png"
   inkscape:export-xdpi="96"
   inkscape:export-ydpi="96"
   xmlns:inkscape="http://www.inkscape.org/namespaces/inkscape"
   xmlns:sodipodi="http://sodipodi.sourceforge.net/DTD/sodipodi-0.dtd"
   xmlns="http://www.w3.org/2000/svg"
   xmlns:svg="http://www.w3.org/2000/svg"
   xmlns:rdf="http://www.w3.org/1999/02/22-rdf-syntax-ns#"
   xmlns:cc="http://creativecommons.org/ns#"
   xmlns:dc="http://purl.org/dc/elements/1.1/">
  <defs
     id="defs112" />
  <sodipodi:namedview
     id="base"
     pagecolor="#ffffff"
     bordercolor="#666666"
     borderopacity="1.0"
     inkscape:pageopacity="0.0"
     inkscape:pageshadow="2"
     inkscape:zoom="2.8"
     inkscape:cx="14.285714"
     inkscape:cy="124.82143"
     inkscape:document-units="mm"
     inkscape:current-layer="text139"
     inkscape:document-rotation="0"
     showgrid="false"
     inkscape:window-width="2560"
     inkscape:window-height="1378"
     inkscape:window-x="0"
     inkscape:window-y="0"
     inkscape:window-maximized="1"
     inkscape:showpageshadow="2"
     inkscape:pagecheckerboard="0"
     inkscape:deskcolor="#d1d1d1" />
  <metadata
     id="metadata115">
    <rdf:RDF>
      <cc:Work
         rdf:about="">
        <dc:format>image/svg+xml</dc:format>
        <dc:type
           rdf:resource="http://purl.org/dc/dcmitype/StillImage" />
      </cc:Work>
    </rdf:RDF>
  </metadata>
  <g
     id="g127"
     inkscape:groupmode="layer"
     inkscape:label="F.SilkS"
     transform="translate(-24.067673,-69.496089)"
     style="display:inline">
    <g
       aria-label="LEG   S"
       id="text139"
       style="font-size:24.2798px;stroke-width:0.606995" />
    <g
       inkscape:export-ydpi="96"
       inkscape:export-xdpi="96"
       transform="matrix(-0.1850461,0,0,0.28536914,46.856343,28.260705)"
       id="g2539">
      <path
         id="path2545"
         d="m 111.07904,144.4984 v 0.21179 h 0.84717 z m 0.84717,0 -16.308154,2.66344 -6.216373,1.1464 -1.40822,2.96758 -2.880402,7.201 -10.886225,27.53326 H 82.9104 l 3.490793,-0.21773 1.793474,-2.5356 3.568098,-5.71844 12.327065,-19.90867 c 18.2772,7.6498 19.08647,33.98981 3.6005,44.6833 -3.50308,2.4189 -7.58944,4.19501 -11.86048,4.62898 -1.469429,0.14931 -2.970838,0.36153 -4.447679,0.18722 -0.875346,-0.10335 -2.322324,-0.55003 -3.140909,-0.13724 -1.097094,0.55321 -2.05038,2.03979 -2.849692,2.95093 -1.594387,1.81762 -3.421748,3.5268 -4.810906,5.50665 16.139781,4.54616 33.822056,-3.46453 40.145816,-19.27328 4.55929,-11.39813 2.4225,-24.76934 -5.59582,-34.09888 -2.33355,-2.71535 -5.62208,-6.08908 -9.13469,-7.201 l 4.40702,-7.20101 z m 0.2118,0 0.21179,0.21179 -0.21179,-0.21179 m -2.32974,0.21179 v 0.2118 h 0.63538 l -0.63538,-0.2118 m -1.27076,0.2118 v 0.21179 h 0.63538 l -0.63538,-0.21179 m 3.3887,0 0.2118,0.21179 -0.2118,-0.21179 m -4.87126,0.21179 v 0.2118 h 0.63538 l -0.63538,-0.2118 m -1.27077,0.2118 v 0.21179 h 0.63538 l -0.63538,-0.21179 m -1.27077,0.21179 v 0.2118 h 0.63539 l -0.63539,-0.2118 m 6.98921,0 0.2118,0.2118 -0.2118,-0.2118 m -8.47177,0.2118 v 0.21179 h 0.63539 l -0.63539,-0.21179 m -1.27076,0.21179 v 0.21179 h 0.63538 l -0.63538,-0.21179 m 9.53074,0 0.21179,0.21179 -0.21179,-0.21179 m -10.80151,0.21179 v 0.2118 h 0.63539 l -0.63539,-0.2118 m -1.482556,0.2118 v 0.21179 h 0.635383 l -0.635383,-0.21179 m -1.270766,0.21179 v 0.2118 h 0.635383 l -0.635383,-0.2118 m 13.131242,0 0.2118,0.2118 -0.2118,-0.2118 m -14.402007,0.2118 v 0.21179 h 0.635383 l -0.635383,-0.21179 m -1.48256,0.21179 v 0.2118 h 0.847177 l -0.847177,-0.2118 m 15.672777,0 -0.2118,0.42359 0.2118,-0.42359 m -16.943543,0.2118 v 0.21179 h 0.635383 l -0.635383,-0.21179 m -1.270765,0.21179 v 0.21179 h 0.635383 l -0.635383,-0.21179 m -1.48256,0.21179 v 0.2118 h 0.847177 l -0.847177,-0.2118 m 19.273278,0 0.21179,0.2118 -0.21179,-0.2118 m -20.544043,0.2118 v 0.21179 h 0.635382 l -0.635382,-0.21179 m -0.635383,0.42359 0.211794,0.21179 -0.211794,-0.21179 m 20.755836,0 0.2118,0.21179 -0.2118,-0.21179 m -20.96763,0.42359 0.211794,0.21179 -0.211794,-0.21179 m 20.75584,0 -0.2118,0.42358 0.2118,-0.42358 m -20.897107,0.56479 0.07074,0.14118 -0.07074,-0.14118 m 20.473517,0.0706 0.21179,0.21179 -0.21179,-0.21179 m -20.755839,0.42359 0.211794,0.21179 -0.211794,-0.21179 m 20.332249,0.21179 0.21179,0.2118 -0.21179,-0.2118 m -20.473516,0.353 0.07074,0.14118 -0.07074,-0.14118 m 20.261726,0.0706 -0.2118,0.42359 0.2118,-0.42359 m -23.509167,0.42359 c -2.757773,0.8721 -5.561294,1.26617 -8.259976,2.42028 -7.256495,3.10329 -13.243601,8.91374 -16.676997,16.00582 -6.01516,12.42491 -3.457669,27.93884 6.299079,37.69938 2.439086,2.44008 5.985729,5.92579 9.530741,6.56562 l -4.447679,8.04818 h 0.211794 c 2.794265,-3.66785 6.199641,-6.95193 9.283154,-10.37791 6.599721,-7.33275 13.197112,-14.66824 19.767821,-22.02661 3.58271,-4.01223 8.49782,-8.0503 11.18993,-12.70766 H 99.430352 l -5.038585,0.21773 -1.99129,2.74739 -3.983426,6.56563 h 3.600502 l -10.589712,18.4261 c -15.524053,-6.68931 -18.90628,-27.26174 -8.894533,-39.81732 1.73182,-2.17187 3.828838,-3.97672 6.141207,-5.50585 2.267046,-1.49906 4.105208,-1.79229 5.16778,-4.44849 0.433755,-1.08445 1.427917,-2.6437 1.186048,-3.81229 m 2.96512,0 0.211794,0.21179 -0.211794,-0.21179 m 20.120457,0.21179 0.21179,0.2118 -0.21179,-0.2118 m -20.332252,0.42359 0.211795,0.2118 -0.211795,-0.2118 m 19.908662,0.2118 0.21179,0.21179 -0.21179,-0.21179 m -20.120456,0.21179 0.211794,0.21179 -0.211794,-0.21179 m 19.908656,0.21179 -0.21179,0.42359 0.21179,-0.42359 m -20.12045,0.42359 0.211794,0.2118 -0.211794,-0.2118 m 19.69687,0.2118 0.21179,0.21179 -0.21179,-0.21179 m -19.908664,0.21179 0.211794,0.21179 -0.211794,-0.21179 m 19.485074,0.42359 0.21179,0.21179 -0.21179,-0.21179 m -19.696869,0.21179 0.211795,0.2118 -0.211795,-0.2118 m 19.485069,0.2118 -0.21179,0.42359 0.21179,-0.42359 m -19.696863,0.21179 0.211794,0.2118 -0.211794,-0.2118 m 19.343803,0.56479 0.0707,0.14119 -0.0707,-0.14119 m -19.555597,0.0706 0.211794,0.2118 -0.211794,-0.2118 m 19.908657,0.2118 0.2118,0.21179 -0.2118,-0.21179 m -20.120451,0.21179 0.211794,0.2118 -0.211794,-0.2118 m 20.544041,0 0.42359,0.42359 -0.42359,-0.42359 m 0.63538,0.42359 0.2118,0.2118 -0.2118,-0.2118 m -21.391216,0.2118 0.211795,0.21179 -0.211795,-0.21179 m 22.026606,0.21179 0.21179,0.21179 -0.21179,-0.21179 m -22.2384,0.21179 0.211794,0.2118 -0.211794,-0.2118 m 22.87378,0.2118 0.21179,0.21179 -0.21179,-0.21179 m -23.085574,0.42359 0.211794,0.21179 -0.211794,-0.21179 m 23.720954,0 0.42359,0.42359 -0.42359,-0.42359 m -23.932748,0.42359 0.211794,0.21179 -0.211794,-0.21179 m 24.779928,0.21179 0.42359,0.42359 -0.42359,-0.42359 m -5.93024,0.21179 0.21179,0.2118 -0.21179,-0.2118 m -19.061483,0.2118 0.211795,0.21179 -0.211795,-0.21179 m 18.637893,0 0.2118,0.21179 -0.2118,-0.21179 m 0.84718,0 0.21179,0.21179 -0.21179,-0.21179 m 0.42359,0.21179 0.21179,0.2118 -0.21179,-0.2118 m -20.120457,0.2118 0.211794,0.21179 -0.211794,-0.21179 m 20.544047,0 0.21179,0.21179 -0.21179,-0.21179 m 5.71844,0 0.63538,0.63538 -0.63538,-0.63538 m -7.83639,0.21179 0.2118,0.2118 -0.2118,-0.2118 m 2.75333,0.2118 0.21179,0.21179 -0.21179,-0.21179 m -21.391221,0.21179 0.211794,0.21179 -0.211794,-0.21179 m 18.426101,0 -0.2118,0.42359 0.2118,-0.42359 m 3.38871,0 0.42359,0.42359 -0.42359,-0.42359 m -22.026606,0.42359 0.211795,0.21179 -0.211795,-0.21179 m 22.661986,0 0.42359,0.42359 -0.42359,-0.42359 m -4.44768,0.21179 0.21179,0.2118 -0.21179,-0.2118 m 5.08306,0.2118 0.42359,0.42359 -0.42359,-0.42359 m -23.50916,0.21179 0.211794,0.2118 -0.211794,-0.2118 m 18.00251,0.2118 0.2118,0.21179 -0.2118,-0.21179 m -18.143777,0.35299 0.07074,0.14119 -0.07074,-0.14119 m 24.497607,-0.1412 0.63538,0.63538 -0.63538,-0.63538 m -6.56562,0.21179 -0.2118,0.42359 0.2118,-0.42359 m -18.214308,0.42359 0.211794,0.2118 -0.211794,-0.2118 m 17.790718,0.2118 0.21179,0.21179 -0.21179,-0.21179 m -18.002513,0.21179 0.211795,0.2118 -0.211795,-0.2118 m 26.474283,0.2118 1.90615,1.90614 -1.90615,-1.90614 m 4.44768,0 0.84718,0.84717 -0.84718,-0.84717 m -13.34304,0.21179 0.21179,0.21179 -0.21179,-0.21179 m -17.790717,0.21179 0.211794,0.2118 -0.211794,-0.2118 m 17.578927,0.2118 -0.2118,0.42359 0.2118,-0.42359 m -17.720194,0.353 0.07074,0.14111 -0.07074,-0.14111 m 17.296604,0.28238 0.21179,0.2118 -0.21179,-0.2118 m -17.578925,0.2118 0.211794,0.21179 -0.211794,-0.21179 m 32.828105,0 0.42359,0.42358 -0.42359,-0.42358 m -32.969372,0.56485 0.07074,0.14106 -0.07074,-0.14106 m 17.296602,-0.14127 0.21179,0.2118 -0.21179,-0.2118 m -0.21179,0.42359 -0.211799,0.42359 0.211799,-0.42359 m 16.51995,0 0.42359,0.42359 -0.42359,-0.42359 m -33.887084,0.2118 0.211794,0.21179 -0.211794,-0.21179 m 29.862994,0 0.63538,0.63538 -0.63538,-0.63538 m -30.004261,0.56485 0.07074,0.14106 -0.07074,-0.14106 m 17.084808,-0.14126 0.211794,0.21179 -0.211794,-0.21179 m 17.578923,0.21179 0.21179,0.21179 -0.21179,-0.21179 m -34.946052,0.42359 0.211794,0.21179 -0.211794,-0.21179 m 16.94354,0 0.211794,0.21179 -0.211794,-0.21179 m 14.402012,0.21179 0.21179,0.2118 -0.21179,-0.2118 m 4.02409,0 0.21179,0.2118 -0.21179,-0.2118 m -35.510909,0.35306 0.07074,0.14106 -0.07074,-0.14106 m 16.873013,-0.14126 -0.211794,0.42359 0.211794,-0.42359 m 15.037396,0.42359 0.42358,0.42358 -0.42358,-0.42358 m 4.02409,0 0.21179,0.21179 -0.21179,-0.21179 m -36.216821,0.21179 0.211794,0.21179 -0.211794,-0.21179 m 16.731746,0 0.211795,0.21179 -0.211795,-0.21179 m 19.696865,0.21179 0.42359,0.42359 -0.42359,-0.42359 m -36.569878,0.35307 0.07074,0.14105 -0.07074,-0.14105 m 32.757578,-0.14127 0.42359,0.42359 -0.42359,-0.42359 m -16.308153,0.21179 0.211794,0.2118 -0.211794,-0.2118 m 20.544043,0.2118 0.21179,0.21179 -0.21179,-0.21179 m -37.275789,0.21179 0.211794,0.2118 -0.211794,-0.2118 m 16.519952,0 -0.211795,0.42359 0.211795,-0.42359 m 16.943537,0 0.2118,0.2118 -0.2118,-0.2118 m 4.02409,0.2118 0.2118,0.21179 -0.2118,-0.21179 m -37.628846,0.35306 0.07074,0.14105 -0.07074,-0.14105 m 33.816556,-0.14127 0.42359,0.42359 -0.42359,-0.42359 m -17.578926,0.21179 0.211794,0.2118 -0.211794,-0.2118 m 21.603016,0 0.21179,0.2118 -0.21179,-0.2118 m -38.122968,0.42359 0.211794,0.2118 -0.211794,-0.2118 m 34.522468,0 0.21179,0.2118 -0.21179,-0.2118 m 3.81229,0 0.2118,0.2118 -0.2118,-0.2118 m -22.238394,0.2118 0.211794,0.21179 -0.211794,-0.21179 m 18.637894,0.21179 0.21179,0.2118 -0.21179,-0.2118 m 3.8123,0 0.21179,0.2118 -0.21179,-0.2118 m -38.758352,0.2118 0.211794,0.21179 -0.211794,-0.21179 m 16.096363,0 -0.211794,0.42358 0.211794,-0.42358 m 19.061479,0.21179 0.2118,0.21179 -0.2118,-0.21179 m 3.8123,0 0.2118,0.21179 -0.2118,-0.21179 m -39.181936,0.21179 0.211794,0.2118 -0.211794,-0.2118 m 15.884569,0.2118 0.211794,0.21179 -0.211794,-0.21179 m 19.696867,0 0.21179,0.21179 -0.21179,-0.21179 m 3.8123,0 0.21179,0.21179 -0.21179,-0.21179 m -39.535003,0.35306 0.07074,0.14105 -0.07074,-0.14105 m 15.814042,0.0705 -0.211795,0.42359 0.211795,-0.42359 m 20.120451,0 0.2118,0.21179 -0.2118,-0.21179 m 3.8123,0 0.21179,0.21179 -0.21179,-0.21179 m -40.029115,0.42359 0.211794,0.21179 -0.211794,-0.21179 m 36.428615,0 0.21179,0.21179 -0.21179,-0.21179 m 3.81229,0 0.2118,0.21179 -0.2118,-0.21179 m -24.56813,0.21179 0.211794,0.21179 -0.211794,-0.21179 m -15.884569,0.42359 0.211794,0.21179 -0.211794,-0.21179 m 36.852199,0 0.2118,0.21179 -0.2118,-0.21179 m 3.8123,0 0.21179,0.21179 -0.21179,-0.21179 m -25.203518,0.21179 0.211794,0.2118 -0.211794,-0.2118 m -15.672775,0.2118 0.211794,0.21179 -0.211794,-0.21179 m 37.275793,0 0.21179,0.21179 -0.21179,-0.21179 m 3.81229,0 0.2118,0.21179 -0.2118,-0.21179 m -25.838897,0.42359 0.211794,0.21179 -0.211794,-0.21179 m -15.460981,0.21179 0.211795,0.21179 -0.211795,-0.21179 m 37.699378,0 0.21179,0.21179 -0.21179,-0.21179 m 3.8123,0 0.21179,0.21179 -0.21179,-0.21179 m -26.262491,0.21179 0.211794,0.2118 -0.211794,-0.2118 m -15.460981,0.2118 0.211794,0.21179 -0.211794,-0.21179 m 42.005792,0.14126 0.0707,0.14106 -0.0707,-0.14106 m -3.88283,0.0705 0.2118,0.2118 -0.2118,-0.2118 m -23.08557,0.2118 0.211794,0.21179 -0.211794,-0.21179 m -15.249186,0.21179 0.211794,0.21179 -0.211794,-0.21179 m 42.429376,0.14127 0.0707,0.14105 -0.0707,-0.14105 m -3.81229,0.21179 0.0707,0.14106 -0.0707,-0.14106 m -38.82888,0.0705 0.211794,0.21179 -0.211794,-0.21179 m 15.037392,0 0.211794,0.21179 -0.211794,-0.21179 m 27.815578,0.35306 0.0707,0.14106 -0.0707,-0.14106 m -28.027373,0.0705 0.211795,0.21179 -0.211795,-0.21179 m -15.037392,0.21179 0.211795,0.2118 -0.211795,-0.2118 m 39.181935,0 0.2118,0.2118 -0.2118,-0.2118 m -39.393729,0.42359 0.211794,0.21179 -0.211794,-0.21179 m 14.825598,0 0.211794,0.21179 -0.211794,-0.21179 m 28.662751,0.14127 0.0707,0.14105 -0.0707,-0.14105 m -28.874545,0.28232 -0.211795,0.42359 0.211795,-0.42359 m 25.062245,0.14127 0.0707,0.14105 -0.0707,-0.14105 m -39.887843,0.0705 0.211794,0.2118 -0.211794,-0.2118 m 43.911943,0.35306 0.0707,0.14106 -0.0707,-0.14106 m -44.123737,0.0705 0.211794,0.2118 -0.211794,-0.2118 m 14.613803,0 -0.211794,0.42359 0.211794,-0.42359 m 25.627104,0.2118 v 0.63538 h 0.2118 l -0.2118,-0.63538 m -40.452702,0.42358 0.211795,0.2118 -0.211795,-0.2118 m 14.40201,0 0.211794,0.2118 -0.211794,-0.2118 m 30.145312,0.14127 0.0707,0.14106 -0.0707,-0.14106 m -44.759116,0.28232 0.211794,0.2118 -0.211794,-0.2118 m 14.190215,0.2118 0.211794,0.21179 -0.211794,-0.21179 m 26.686081,0.21179 v 1.05897 h 0.21179 l -0.21179,-1.05897 m -41.08809,0.2118 0.211794,0.21179 -0.211794,-0.21179 m 14.190215,0 0.211794,0.21179 -0.211794,-0.21179 m 30.992485,0.14126 0.0707,0.14106 -0.0707,-0.14106 m -45.394494,0.28232 0.211794,0.2118 -0.211794,-0.2118 m 13.97842,0.2118 0.211795,0.21179 -0.211795,-0.21179 m -14.190215,0.42359 0.211795,0.21179 -0.211795,-0.21179 m 13.978421,0 -0.211794,0.42359 0.211794,-0.42359 m 31.769138,0 v 0.84717 h 0.21179 l -0.21179,-0.84717 m -45.959353,0.42359 0.211794,0.21179 -0.211794,-0.21179 m 13.766627,0.21179 0.211794,0.21179 -0.211794,-0.21179 m -13.978421,0.42359 0.211794,0.21179 -0.211794,-0.21179 m 42.147057,0 v 2.75332 h 0.21179 l -0.21179,-2.75332 m -28.592225,0.21179 0.211794,0.2118 -0.211794,-0.2118 m -13.766626,0.2118 0.211794,0.21179 -0.211794,-0.21179 m 13.554832,0.21179 -0.211794,0.42359 0.211794,-0.42359 m 33.039899,0 v 1.48256 h 0.2118 l -0.2118,-1.48256 m -46.806526,0.42359 0.211795,0.21179 -0.211795,-0.21179 m 13.343038,0.21179 0.211795,0.2118 -0.211795,-0.2118 m -13.484304,0.35307 0.07074,0.14105 -0.07074,-0.14105 m 13.060716,0.28232 0.211794,0.21179 -0.211794,-0.21179 m -13.343038,0.21179 0.211794,0.2118 -0.211794,-0.2118 m 13.131244,0.2118 -0.211795,0.42358 0.211795,-0.42358 m -13.272511,0.35306 0.07074,0.14105 -0.07074,-0.14105 m 12.848922,0.28232 0.211794,0.21179 -0.211794,-0.21179 m -13.131244,0.21179 0.211795,0.2118 -0.211795,-0.2118 m -0.141203,0.56486 0.07061,0.14105 -0.07061,-0.14105 m 12.848859,-0.14127 0.211794,0.2118 -0.211794,-0.2118 m -0.211795,0.42359 -0.211794,0.42359 0.211794,-0.42359 m 30.710172,0 v 0.84718 h 0.21179 l -0.21179,-0.84718 m -43.629621,0.21179 0.211794,0.2118 -0.211794,-0.2118 m -0.141203,0.56486 0.07061,0.14105 -0.07061,-0.14105 m 12.637064,-0.14127 0.211794,0.2118 -0.211794,-0.2118 m -12.91945,0.63539 0.211794,0.21179 -0.211794,-0.21179 m 12.495861,0 0.211795,0.21179 -0.211795,-0.21179 m -12.637064,0.56485 0.07061,0.14106 -0.07061,-0.14106 m 12.42527,-0.14127 -0.211794,0.42359 0.211794,-0.42359 m 31.557343,0 v 0.63539 h 0.2118 l -0.2118,-0.63539 m 4.65947,0.2118 v 1.48256 h 0.2118 l -0.2118,-1.48256 m -4.80074,0.98844 0.0707,0.14106 -0.0707,-0.14106 m -0.21179,0.84718 0.0707,0.14105 -0.0707,-0.14105 m 4.80074,0.49412 v 0.84717 h 0.21179 l -0.21179,-0.84717 m -5.01253,0.35306 0.0707,0.14105 -0.0707,-0.14105 m -0.2118,0.63538 0.0707,0.14105 -0.0707,-0.14105 m -0.21179,0.63538 0.0707,0.14106 -0.0707,-0.14106 m 5.22433,-0.14126 v 0.63538 h 0.21179 l -0.21179,-0.63538 m -5.43613,0.77664 0.0707,0.14106 -0.0707,-0.14106 m 5.22433,0.28233 v 0.63538 h 0.2118 l -0.2118,-0.63538 m -5.50665,0.21179 0.2118,0.2118 -0.2118,-0.2118 m -0.21179,0.42359 0.21179,0.21179 -0.21179,-0.21179 m 5.57718,0.56485 0.0707,0.14106 -0.0707,-0.14106 m -5.78898,0.0705 0.2118,0.2118 -0.2118,-0.2118 m -0.21179,0.42359 0.21179,0.2118 -0.21179,-0.2118 m 5.71844,0.2118 0.2118,0.21179 -0.2118,-0.21179 m -5.93024,0.21179 0.2118,0.21179 -0.2118,-0.21179 m -0.21179,0.42359 0.21179,0.21179 -0.21179,-0.21179 m 6.00077,0.14126 0.0707,0.14106 -0.0707,-0.14106 m -6.21256,0.28233 0.21179,0.21179 -0.21179,-0.21179 m 5.93023,0.42358 0.2118,0.2118 -0.2118,-0.2118 m -6.35382,0.2118 0.21179,0.21179 -0.21179,-0.21179 m -0.2118,0.42359 0.2118,0.21179 -0.2118,-0.21179 m 6.35383,0 0.21179,0.21179 -0.21179,-0.21179 m -0.14127,0.56485 0.0707,0.14106 -0.0707,-0.14106 m -6.63615,0.0705 0.2118,0.21179 -0.2118,-0.21179 m 6.35383,0.42359 0.2118,0.21179 -0.2118,-0.21179 m -6.77741,0.21179 0.21179,0.2118 -0.21179,-0.2118 m 6.56562,0.42359 0.21179,0.2118 -0.21179,-0.2118 m -6.98921,0.2118 -0.2118,0.42358 0.2118,-0.42358 m 6.77741,0.21179 0.2118,0.21179 -0.2118,-0.21179 m -0.21179,0.42359 0.21179,0.21179 -0.21179,-0.21179 m -7.20101,0.21179 -0.42358,0.63539 0.42358,-0.63539 m 6.98922,0.42359 0.21179,0.2118 -0.21179,-0.2118 m -0.2118,0.42359 0.2118,0.21179 -0.2118,-0.21179 m -0.21179,0.42359 0.21179,0.21179 -0.21179,-0.21179 m -0.2118,0.42359 0.2118,0.21179 -0.2118,-0.21179 m -8.04818,0.21179 -0.42359,0.63538 0.42359,-0.63538 m 7.62459,0.42359 0.2118,0.21179 -0.2118,-0.21179 m -0.21179,0.42359 0.21179,0.21179 -0.21179,-0.21179 m -0.21179,0.42359 0.21179,0.21179 -0.21179,-0.21179 m -9.10716,0.42359 -0.42359,0.63538 0.42359,-0.63538 m 8.68357,0.21179 0.21179,0.21179 -0.21179,-0.21179 m -0.2118,0.42359 -0.21179,0.42359 0.21179,-0.42359 m -9.53074,0.21179 -0.21179,0.42359 0.21179,-0.42359 m 9.10715,0.42359 -0.21179,0.42359 0.21179,-0.42359 m -9.95433,0.2118 0.2118,0.21179 -0.2118,-0.21179 m -0.63538,0.42358 0.2118,0.2118 -0.2118,-0.2118 m 10.16613,0 -0.2118,0.42359 0.2118,-0.42359 m -10.80151,0.42359 0.21179,0.2118 -0.21179,-0.2118 m -0.42359,0.2118 0.21179,0.21179 -0.21179,-0.21179 m 10.58971,0.21179 -0.21179,0.42359 0.21179,-0.42359 m -11.22509,0.2118 0.21179,0.21179 -0.21179,-0.21179 m -0.42359,0.21179 0.21179,0.21179 -0.21179,-0.21179 m -0.42359,0.21179 0.21179,0.2118 -0.21179,-0.2118 m -0.42359,0.2118 0.2118,0.21179 -0.2118,-0.21179 m 11.86048,0 -0.63538,0.84718 0.63538,-0.84718 m -12.28407,0.21179 0.2118,0.2118 -0.2118,-0.2118 m -0.63538,0.2118 0.21179,0.21179 -0.21179,-0.21179 m -0.42359,0.21179 0.2118,0.2118 -0.2118,-0.2118 m -0.49411,0.28232 0.14105,0.0707 -0.14105,-0.0707 m -0.56486,0.14127 0.21179,0.21179 -0.21179,-0.21179 m -0.63538,0.21179 0.21179,0.2118 -0.21179,-0.2118 m -0.705912,0.28233 0.141052,0.0707 -0.141052,-0.0707 m -0.77665,0.14126 0.211794,0.2118 -0.211794,-0.2118 m 15.037392,0 -1.69435,1.90615 1.69435,-1.90615 m -16.096363,0.2118 v 0.21179 h 0.635383 l -0.635383,-0.21179 m -1.058971,0.21179 v 0.2118 h 0.635382 l -0.635382,-0.2118 m -8.048182,0.2118 v 0.21179 h 0.635383 l -0.635383,-0.21179 m 6.565622,0 v 0.21179 h 0.847177 l -0.847177,-0.21179 m -4.659474,0.21179 v 0.21179 h 3.388708 l -3.388708,-0.21179 m -3.388708,0.42359 -1.058971,1.27076 1.058971,-1.27076 m 23.720956,1.48256 -0.42359,0.63538 0.42359,-0.63538 m -25.838898,0.84718 -0.635383,0.84717 0.635383,-0.84717 m 24.779928,0 -0.21179,0.42358 0.21179,-0.42358 m -0.84718,0.63538 -0.21179,0.42359 0.21179,-0.42359 m -0.84717,0.63538 0.21179,0.2118 -0.21179,-0.2118 m -0.63539,0.42359 0.2118,0.21179 -0.2118,-0.21179 m -24.144543,0.21179 -1.058971,1.27077 1.058971,-1.27077 m 23.509163,0.2118 0.21179,0.21179 -0.21179,-0.21179 m -0.42359,0.21179 0.2118,0.2118 -0.2118,-0.2118 m -0.63538,0.42359 0.21179,0.2118 -0.21179,-0.2118 m -0.42359,0.2118 0.21179,0.21179 -0.21179,-0.21179 m -0.42359,0.21179 0.2118,0.21179 -0.2118,-0.21179 m -0.42359,0.21179 0.2118,0.2118 -0.2118,-0.2118 m -0.42359,0.2118 0.2118,0.21179 -0.2118,-0.21179 m -0.42358,0.21179 0.21179,0.2118 -0.21179,-0.2118 m -22.238401,0.2118 -1.058971,1.27076 1.058971,-1.27076 m 21.814811,0 0.21179,0.21179 -0.21179,-0.21179 m -0.42359,0.21179 0.21179,0.21179 -0.21179,-0.21179 m -0.63538,0.21179 0.21179,0.2118 -0.21179,-0.2118 m -0.42359,0.2118 0.21179,0.21179 -0.21179,-0.21179 m -0.49412,0.28232 0.14106,0.0707 -0.14106,-0.0707 m -0.56485,0.14127 0.21179,0.21179 -0.21179,-0.21179 m -0.63539,0.21179 0.2118,0.2118 -0.2118,-0.2118 m -0.705907,0.28232 0.141055,0.0707 -0.141055,-0.0707 m -19.061483,0.2118 0.141055,0.0707 -0.141055,-0.0707 m 18.426101,0 0.141055,0.0707 -0.141055,-0.0707 m -17.578924,0.21179 0.141055,0.0707 -0.141055,-0.0707 m 16.731747,0 0.141055,0.0707 -0.141055,-0.0707 m -15.88457,0.2118 0.141055,0.0707 -0.141055,-0.0707 m 15.037393,0 0.141055,0.0707 -0.141055,-0.0707 m -14.331482,0.14126 v 0.2118 h 0.635382 l -0.635382,-0.2118 m 13.131244,0 v 0.2118 h 0.635382 l -0.635382,-0.2118 m -11.719212,0.28233 0.141055,0.0707 -0.141055,-0.0707 m 10.448446,-0.0705 v 0.21179 h 0.847177 l -0.847177,-0.21179 m -9.318947,0.21179 v 0.2118 h 1.058971 l -1.058971,-0.2118 m 7.836387,0 v 0.2118 h 0.847177 l -0.847177,-0.2118 m -5.50665,0.2118 v 0.21179 h 4.02409 z"
         style="fill:#f5911d;stroke:none;stroke-width:0.211794" />
      <path
         id="path2541"
         d="m 111.07904,144.4984 v 0.21179 h 0.84717 z"
         style="fill:#f5911d;stroke:none;stroke-width:0.211794" />
    </g>
  </g>
</svg>
