@startuml sequenz-ml-fahrweise-reset
skinparam backgroundColor SeaShell

actor "Op1:Operator" as Op
control "ControlComponent" as PFK
collections "MLOperationMode" as OpMode
collections "MLModel" as ML

autonumber
Op ->> PFK++: SetVar(".CMD","Op1;RESET;")
deactivate PFK

OpMode ->> PFK++: GetVar("/EXST.value")
activate OpMode
autonumber stop
return "RESETTING;"
autonumber resume
OpMode ->> PFK --: SetVar("/SC.value", "IDLE")

activate PFK
PFK ->> OpMode--: SetVar("/Skills/<OpModeName>.actimode", 0) 

Op ->> PFK ++: GetVar("/EXST.value", "/OPMODE.value")
activate Op
autonumber stop
return "IDLE;; NONE;;"
autonumber resume
deactivate Op

autonumber stop
opt
    Op ->> PFK++: SetVar(".CMD","Op1;FREE;")
    deactivate PFK

    Op ->> PFK ++: GetVar("/OCCUPIER.value")
    activate Op
    return "NONE;"
    deactivate Op
end

@enduml