@startuml sequenz-ml-fahrweise-auswahl
skinparam backgroundColor SeaShell

actor "Op1:Operator" as Op
control "ControlComponent" as PFK
collections "MLOperationMode" as OpMode
collections "MLModel" as ML

opt
    Op ->> PFK++: SetVar(".CMD","Op1;OCCUPY;")
    deactivate PFK

    Op ->> PFK ++: GetVar("/OCCUPIER.value")
    activate Op
    return "Op1;"
    deactivate Op
end

autonumber
Op ->> PFK ++: SetVar(".CMD","Op1;<OpModeName>;")
PFK ->> OpMode--: SetVar("/Skills/<OpModeName>.actimode", 1) 
activate OpMode
OpMode ->> PFK --: SetVar("/MLSC.value", "IDLE")

Op ->> PFK++: GetVar("/OPMODE.value")
activate Op
autonumber stop
return "<OpModeName>;"
autonumber resume
deactivate Op

ML ->> PFK++: GetVar("/OPMODE.value")
activate ML
autonumber stop
return "<OpModeName>;"
autonumber resume
note over ML: Start Unity executable\nand instanciate or enable Agent
ML->>ML: Start()
ML ->> PFK--: SetVar("/MLSC.value", "STARTING")

OpMode ->> PFK++: GetVar("/MLSC.value")
activate OpMode
autonumber stop
return "STARTING;"
autonumber resume
OpMode ->> PFK --: SetVar("/WORKST.value", "READY")

Op ->> PFK ++: GetVar("/WORKST.value")
activate Op
autonumber stop
return "READY;"
autonumber resume
deactivate Op

@enduml