<?xml version="1.0" encoding="UTF-8" standalone="no"?><svg xmlns="http://www.w3.org/2000/svg" xmlns:xlink="http://www.w3.org/1999/xlink" contentScriptType="application/ecmascript" contentStyleType="text/css" height="541px" preserveAspectRatio="none" style="width:703px;height:541px;background:#FFF5EE;" version="1.1" viewBox="0 0 703 541" width="703px" zoomAndPan="magnify"><defs><filter height="300%" id="fdjj32df0lqd5" width="300%" x="-1" y="-1"><feGaussianBlur result="blurOut" stdDeviation="2.0"/><feColorMatrix in="blurOut" result="blurOut2" type="matrix" values="0 0 0 0 0 0 0 0 0 0 0 0 0 0 0 0 0 0 .4 0"/><feOffset dx="4.0" dy="4.0" in="blurOut2" result="blurOut3"/><feBlend in="SourceGraphic" in2="blurOut3" mode="normal"/></filter></defs><g><rect fill="#FFFFFF" filter="url(#fdjj32df0lqd5)" height="30.3516" style="stroke:#A80036;stroke-width:1.0;" width="10" x="47" y="407.7734"/><rect fill="#FFFFFF" filter="url(#fdjj32df0lqd5)" height="30" style="stroke:#A80036;stroke-width:1.0;" width="10" x="260" y="121.9609"/><rect fill="#FFFFFF" filter="url(#fdjj32df0lqd5)" height="30.3516" style="stroke:#A80036;stroke-width:1.0;" width="10" x="260" y="182.3125"/><rect fill="#FFFFFF" filter="url(#fdjj32df0lqd5)" height="30.3516" style="stroke:#A80036;stroke-width:1.0;" width="10" x="260" y="316.7188"/><rect fill="#FFFFFF" filter="url(#fdjj32df0lqd5)" height="30.3516" style="stroke:#A80036;stroke-width:1.0;" width="10" x="260" y="407.7734"/><rect fill="#FFFFFF" filter="url(#fdjj32df0lqd5)" height="60.7031" style="stroke:#A80036;stroke-width:1.0;" width="10" x="486" y="316.7188"/><rect fill="#FFFFFF" filter="url(#fdjj32df0lqd5)" height="104.0547" style="stroke:#A80036;stroke-width:1.0;" width="10" x="605" y="182.3125"/><line style="stroke:#A80036;stroke-width:1.0;stroke-dasharray:5.0,5.0;" x1="52" x2="52" y1="89.6094" y2="456.125"/><line style="stroke:#A80036;stroke-width:1.0;stroke-dasharray:5.0,5.0;" x1="264.5" x2="264.5" y1="89.6094" y2="456.125"/><line style="stroke:#A80036;stroke-width:1.0;stroke-dasharray:5.0,5.0;" x1="490.5" x2="490.5" y1="89.6094" y2="456.125"/><line style="stroke:#A80036;stroke-width:1.0;stroke-dasharray:5.0,5.0;" x1="609.5" x2="609.5" y1="89.6094" y2="456.125"/><text fill="#000000" font-family="sans-serif" font-size="14" lengthAdjust="spacing" textLength="88" x="5" y="86.5332">Op1:Operator</text><ellipse cx="52" cy="15" fill="#FEFECE" filter="url(#fdjj32df0lqd5)" rx="8" ry="8" style="stroke:#A80036;stroke-width:2.0;"/><path d="M52,23 L52,50 M39,31 L65,31 M52,50 L39,65 M52,50 L65,65 " fill="none" filter="url(#fdjj32df0lqd5)" style="stroke:#A80036;stroke-width:2.0;"/><text fill="#000000" font-family="sans-serif" font-size="14" lengthAdjust="spacing" textLength="88" x="5" y="469.6582">Op1:Operator</text><ellipse cx="52" cy="482.7344" fill="#FEFECE" filter="url(#fdjj32df0lqd5)" rx="8" ry="8" style="stroke:#A80036;stroke-width:2.0;"/><path d="M52,490.7344 L52,517.7344 M39,498.7344 L65,498.7344 M52,517.7344 L39,532.7344 M52,517.7344 L65,532.7344 " fill="none" filter="url(#fdjj32df0lqd5)" style="stroke:#A80036;stroke-width:2.0;"/><text fill="#000000" font-family="sans-serif" font-size="14" lengthAdjust="spacing" textLength="119" x="202.5" y="86.5332">ControlComponent</text><ellipse cx="265" cy="56" fill="#FEFECE" filter="url(#fdjj32df0lqd5)" rx="12" ry="12" style="stroke:#A80036;stroke-width:2.0;"/><polygon fill="#A80036" points="261,44,267,39,265,44,267,49,261,44" style="stroke:#A80036;stroke-width:1.0;"/><text fill="#000000" font-family="sans-serif" font-size="14" lengthAdjust="spacing" textLength="119" x="202.5" y="469.6582">ControlComponent</text><ellipse cx="265" cy="488.7344" fill="#FEFECE" filter="url(#fdjj32df0lqd5)" rx="12" ry="12" style="stroke:#A80036;stroke-width:2.0;"/><polygon fill="#A80036" points="261,476.7344,267,471.7344,265,476.7344,267,481.7344,261,476.7344" style="stroke:#A80036;stroke-width:1.0;"/><rect fill="#FEFECE" filter="url(#fdjj32df0lqd5)" height="31.6094" style="stroke:#A80036;stroke-width:1.5;" width="131" x="425.5" y="49"/><rect fill="#FEFECE" filter="url(#fdjj32df0lqd5)" height="31.6094" style="stroke:#A80036;stroke-width:1.5;" width="131" x="421.5" y="53"/><text fill="#000000" font-family="sans-serif" font-size="14" lengthAdjust="spacing" textLength="117" x="428.5" y="74.5332">MLOperationMode</text><rect fill="#FEFECE" filter="url(#fdjj32df0lqd5)" height="31.6094" style="stroke:#A80036;stroke-width:1.5;" width="131" x="425.5" y="455.125"/><rect fill="#FEFECE" filter="url(#fdjj32df0lqd5)" height="31.6094" style="stroke:#A80036;stroke-width:1.5;" width="131" x="421.5" y="459.125"/><text fill="#000000" font-family="sans-serif" font-size="14" lengthAdjust="spacing" textLength="117" x="428.5" y="480.6582">MLOperationMode</text><rect fill="#FEFECE" filter="url(#fdjj32df0lqd5)" height="31.6094" style="stroke:#A80036;stroke-width:1.5;" width="71" x="574.5" y="49"/><rect fill="#FEFECE" filter="url(#fdjj32df0lqd5)" height="31.6094" style="stroke:#A80036;stroke-width:1.5;" width="71" x="570.5" y="53"/><text fill="#000000" font-family="sans-serif" font-size="14" lengthAdjust="spacing" textLength="57" x="577.5" y="74.5332">MLModel</text><rect fill="#FEFECE" filter="url(#fdjj32df0lqd5)" height="31.6094" style="stroke:#A80036;stroke-width:1.5;" width="71" x="574.5" y="455.125"/><rect fill="#FEFECE" filter="url(#fdjj32df0lqd5)" height="31.6094" style="stroke:#A80036;stroke-width:1.5;" width="71" x="570.5" y="459.125"/><text fill="#000000" font-family="sans-serif" font-size="14" lengthAdjust="spacing" textLength="57" x="577.5" y="480.6582">MLModel</text><rect fill="#FFFFFF" filter="url(#fdjj32df0lqd5)" height="30.3516" style="stroke:#A80036;stroke-width:1.0;" width="10" x="47" y="407.7734"/><rect fill="#FFFFFF" filter="url(#fdjj32df0lqd5)" height="30" style="stroke:#A80036;stroke-width:1.0;" width="10" x="260" y="121.9609"/><rect fill="#FFFFFF" filter="url(#fdjj32df0lqd5)" height="30.3516" style="stroke:#A80036;stroke-width:1.0;" width="10" x="260" y="182.3125"/><rect fill="#FFFFFF" filter="url(#fdjj32df0lqd5)" height="30.3516" style="stroke:#A80036;stroke-width:1.0;" width="10" x="260" y="316.7188"/><rect fill="#FFFFFF" filter="url(#fdjj32df0lqd5)" height="30.3516" style="stroke:#A80036;stroke-width:1.0;" width="10" x="260" y="407.7734"/><rect fill="#FFFFFF" filter="url(#fdjj32df0lqd5)" height="60.7031" style="stroke:#A80036;stroke-width:1.0;" width="10" x="486" y="316.7188"/><rect fill="#FFFFFF" filter="url(#fdjj32df0lqd5)" height="104.0547" style="stroke:#A80036;stroke-width:1.0;" width="10" x="605" y="182.3125"/><line style="stroke:#A80036;stroke-width:1.0;" x1="258" x2="248" y1="121.9609" y2="117.9609"/><line style="stroke:#A80036;stroke-width:1.0;" x1="258" x2="248" y1="121.9609" y2="125.9609"/><line style="stroke:#A80036;stroke-width:1.0;" x1="52" x2="259" y1="121.9609" y2="121.9609"/><text fill="#000000" font-family="sans-serif" font-size="13" font-weight="bold" lengthAdjust="spacing" textLength="7" x="59" y="117.1045">1</text><text fill="#000000" font-family="sans-serif" font-size="13" lengthAdjust="spacing" textLength="178" x="70" y="117.1045">SetVar(".CMD","Op1;START;")</text><line style="stroke:#A80036;stroke-width:1.0;" x1="270" x2="280" y1="182.3125" y2="178.3125"/><line style="stroke:#A80036;stroke-width:1.0;" x1="270" x2="280" y1="182.3125" y2="186.3125"/><line style="stroke:#A80036;stroke-width:1.0;" x1="270" x2="604" y1="182.3125" y2="182.3125"/><text fill="#000000" font-family="sans-serif" font-size="13" font-weight="bold" lengthAdjust="spacing" textLength="7" x="287" y="177.4561">2</text><text fill="#000000" font-family="sans-serif" font-size="13" lengthAdjust="spacing" textLength="128" x="298" y="177.4561">GetVar("/EXST.value")</text><line style="stroke:#A80036;stroke-width:1.0;" x1="603" x2="593" y1="212.6641" y2="208.6641"/><line style="stroke:#A80036;stroke-width:1.0;" x1="603" x2="593" y1="212.6641" y2="216.6641"/><line style="stroke:#A80036;stroke-width:1.0;stroke-dasharray:2.0,2.0;" x1="265" x2="604" y1="212.6641" y2="212.6641"/><text fill="#000000" font-family="sans-serif" font-size="13" lengthAdjust="spacing" textLength="77" x="272" y="207.8076">"STARTING;"</text><line style="stroke:#A80036;stroke-width:1.0;" x1="615" x2="657" y1="243.0156" y2="243.0156"/><line style="stroke:#A80036;stroke-width:1.0;" x1="657" x2="657" y1="243.0156" y2="256.0156"/><line style="stroke:#A80036;stroke-width:1.0;" x1="616" x2="657" y1="256.0156" y2="256.0156"/><line style="stroke:#A80036;stroke-width:1.0;" x1="616" x2="626" y1="256.0156" y2="252.0156"/><line style="stroke:#A80036;stroke-width:1.0;" x1="616" x2="626" y1="256.0156" y2="260.0156"/><text fill="#000000" font-family="sans-serif" font-size="13" font-weight="bold" lengthAdjust="spacing" textLength="7" x="622" y="238.1592">3</text><text fill="#000000" font-family="sans-serif" font-size="13" lengthAdjust="spacing" textLength="63" x="633" y="238.1592">active=true</text><line style="stroke:#A80036;stroke-width:1.0;" x1="265" x2="275" y1="286.3672" y2="282.3672"/><line style="stroke:#A80036;stroke-width:1.0;" x1="265" x2="275" y1="286.3672" y2="290.3672"/><line style="stroke:#A80036;stroke-width:1.0;" x1="265" x2="609" y1="286.3672" y2="286.3672"/><text fill="#000000" font-family="sans-serif" font-size="13" font-weight="bold" lengthAdjust="spacing" textLength="7" x="282" y="281.5107">4</text><text fill="#000000" font-family="sans-serif" font-size="13" lengthAdjust="spacing" textLength="204" x="293" y="281.5107">SetVar("/MLSC.value","EXECUTE")</text><line style="stroke:#A80036;stroke-width:1.0;" x1="270" x2="280" y1="316.7188" y2="312.7188"/><line style="stroke:#A80036;stroke-width:1.0;" x1="270" x2="280" y1="316.7188" y2="320.7188"/><line style="stroke:#A80036;stroke-width:1.0;" x1="270" x2="485" y1="316.7188" y2="316.7188"/><text fill="#000000" font-family="sans-serif" font-size="13" font-weight="bold" lengthAdjust="spacing" textLength="7" x="287" y="311.8623">5</text><text fill="#000000" font-family="sans-serif" font-size="13" lengthAdjust="spacing" textLength="132" x="298" y="311.8623">GetVar("/MLSC.value")</text><line style="stroke:#A80036;stroke-width:1.0;" x1="484" x2="474" y1="347.0703" y2="343.0703"/><line style="stroke:#A80036;stroke-width:1.0;" x1="484" x2="474" y1="347.0703" y2="351.0703"/><line style="stroke:#A80036;stroke-width:1.0;stroke-dasharray:2.0,2.0;" x1="265" x2="485" y1="347.0703" y2="347.0703"/><text fill="#000000" font-family="sans-serif" font-size="13" lengthAdjust="spacing" textLength="73" x="272" y="342.2139">"EXECUTE;"</text><line style="stroke:#A80036;stroke-width:1.0;" x1="265" x2="275" y1="377.4219" y2="373.4219"/><line style="stroke:#A80036;stroke-width:1.0;" x1="265" x2="275" y1="377.4219" y2="381.4219"/><line style="stroke:#A80036;stroke-width:1.0;" x1="265" x2="490" y1="377.4219" y2="377.4219"/><text fill="#000000" font-family="sans-serif" font-size="13" font-weight="bold" lengthAdjust="spacing" textLength="7" x="282" y="372.5654">6</text><text fill="#000000" font-family="sans-serif" font-size="13" lengthAdjust="spacing" textLength="186" x="293" y="372.5654">SetVar("/SC.value","EXECUTE")</text><line style="stroke:#A80036;stroke-width:1.0;" x1="258" x2="248" y1="407.7734" y2="403.7734"/><line style="stroke:#A80036;stroke-width:1.0;" x1="258" x2="248" y1="407.7734" y2="411.7734"/><line style="stroke:#A80036;stroke-width:1.0;" x1="57" x2="259" y1="407.7734" y2="407.7734"/><text fill="#000000" font-family="sans-serif" font-size="13" font-weight="bold" lengthAdjust="spacing" textLength="7" x="64" y="402.917">7</text><text fill="#000000" font-family="sans-serif" font-size="13" lengthAdjust="spacing" textLength="128" x="75" y="402.917">GetVar("/EXST.value")</text><line style="stroke:#A80036;stroke-width:1.0;" x1="52" x2="62" y1="438.125" y2="434.125"/><line style="stroke:#A80036;stroke-width:1.0;" x1="52" x2="62" y1="438.125" y2="442.125"/><line style="stroke:#A80036;stroke-width:1.0;stroke-dasharray:2.0,2.0;" x1="52" x2="264" y1="438.125" y2="438.125"/><text fill="#000000" font-family="sans-serif" font-size="13" lengthAdjust="spacing" textLength="73" x="69" y="433.2686">"EXECUTE;"</text><!--MD5=[d7de5ed90357d27a5c58e80b9be2a0dd]
@startuml sequenz-ml-fahrweise-start
skinparam backgroundColor SeaShell

actor "Op1:Operator" as Op
control "ControlComponent" as PFK
collections "MLOperationMode" as OpMode
collections "MLModel" as ML

autonumber
Op ->> PFK++: SetVar(".CMD","Op1;START;")
deactivate PFK

ML ->> PFK ++: GetVar("/EXST.value")
activate ML
autonumber stop
return "STARTING;"
autonumber resume
ML->>ML: active=true
ML ->> PFK - -: SetVar("/MLSC.value","EXECUTE")

OpMode ->> PFK++: GetVar("/MLSC.value")
activate OpMode
autonumber stop
return "EXECUTE;"
autonumber resume
OpMode ->> PFK - -: SetVar("/SC.value","EXECUTE")

Op ->> PFK ++: GetVar("/EXST.value")
activate Op
autonumber stop
return "EXECUTE;"
autonumber resume
deactivate Op

@enduml

PlantUML version 1.2021.00(Sun Jan 10 11:25:05 CET 2021)
(GPL source distribution)
Java Runtime: Java(TM) SE Runtime Environment
JVM: Java HotSpot(TM) 64-Bit Server VM
Default Encoding: Cp1252
Language: de
Country: DE
--></g></svg>