<?xml version="1.0" encoding="UTF-8" standalone="no"?><svg xmlns="http://www.w3.org/2000/svg" xmlns:xlink="http://www.w3.org/1999/xlink" contentScriptType="application/ecmascript" contentStyleType="text/css" height="1498px" preserveAspectRatio="none" style="width:842px;height:1498px;background:#FFF5EE;" version="1.1" viewBox="0 0 842 1498" width="842px" zoomAndPan="magnify"><defs><filter height="300%" id="fzqc2hyoug66y" width="300%" x="-1" y="-1"><feGaussianBlur result="blurOut" stdDeviation="2.0"/><feColorMatrix in="blurOut" result="blurOut2" type="matrix" values="0 0 0 0 0 0 0 0 0 0 0 0 0 0 0 0 0 0 .4 0"/><feOffset dx="4.0" dy="4.0" in="blurOut2" result="blurOut3"/><feBlend in="SourceGraphic" in2="blurOut3" mode="normal"/></filter></defs><g><rect fill="#FFFFFF" filter="url(#fzqc2hyoug66y)" height="30.3516" style="stroke:#A80036;stroke-width:1.0;" width="10" x="93.5" y="169.0156"/><rect fill="#FFFFFF" filter="url(#fzqc2hyoug66y)" height="30.3516" style="stroke:#A80036;stroke-width:1.0;" width="10" x="93.5" y="333.125"/><rect fill="#FFFFFF" filter="url(#fzqc2hyoug66y)" height="30.3516" style="stroke:#A80036;stroke-width:1.0;" width="10" x="93.5" y="675.3438"/><rect fill="#FFFFFF" filter="url(#fzqc2hyoug66y)" height="30.3516" style="stroke:#A80036;stroke-width:1.0;" width="10" x="93.5" y="736.0469"/><rect fill="#FFFFFF" filter="url(#fzqc2hyoug66y)" height="30.3516" style="stroke:#A80036;stroke-width:1.0;" width="10" x="93.5" y="1171.6719"/><rect fill="#FFFFFF" filter="url(#fzqc2hyoug66y)" height="30.3516" style="stroke:#A80036;stroke-width:1.0;" width="10" x="93.5" y="1262.7266"/><rect fill="#FFFFFF" filter="url(#fzqc2hyoug66y)" height="30.3516" style="stroke:#A80036;stroke-width:1.0;" width="10" x="93.5" y="1353.7813"/><rect fill="#FFFFFF" filter="url(#fzqc2hyoug66y)" height="133.7578" style="stroke:#A80036;stroke-width:1.0;" width="10" x="435.5" y="169.0156"/><rect fill="#FFFFFF" filter="url(#fzqc2hyoug66y)" height="311.8672" style="stroke:#A80036;stroke-width:1.0;" width="10" x="435.5" y="333.125"/><rect fill="#FFFFFF" filter="url(#fzqc2hyoug66y)" height="60.7031" style="stroke:#A80036;stroke-width:1.0;" width="10" x="435.5" y="1171.6719"/><rect fill="#FFFFFF" filter="url(#fzqc2hyoug66y)" height="60.7031" style="stroke:#A80036;stroke-width:1.0;" width="10" x="435.5" y="1262.7266"/><rect fill="#FFFFFF" filter="url(#fzqc2hyoug66y)" height="60.7031" style="stroke:#A80036;stroke-width:1.0;" width="10" x="435.5" y="1353.7813"/><rect fill="#FFFFFF" filter="url(#fzqc2hyoug66y)" height="465.9766" style="stroke:#A80036;stroke-width:1.0;" width="10" x="565.5" y="675.3438"/><rect fill="#FFF5EE" filter="url(#fzqc2hyoug66y)" height="1350.875" style="stroke:#000000;stroke-width:2.0;" width="819.5" x="9" y="71.6094"/><line style="stroke:#A80036;stroke-width:1.0;stroke-dasharray:5.0,5.0;" x1="98" x2="98" y1="54.6094" y2="1439.4844"/><line style="stroke:#A80036;stroke-width:1.0;stroke-dasharray:5.0,5.0;" x1="440" x2="440" y1="54.6094" y2="1439.4844"/><line style="stroke:#A80036;stroke-width:1.0;stroke-dasharray:5.0,5.0;" x1="570" x2="570" y1="54.6094" y2="1439.4844"/><line style="stroke:#A80036;stroke-width:1.0;stroke-dasharray:5.0,5.0;" x1="781.5" x2="781.5" y1="54.6094" y2="1439.4844"/><text fill="#000000" font-family="sans-serif" font-size="14" lengthAdjust="spacing" textLength="119" x="36" y="51.5332">ControlComponent</text><ellipse cx="98.5" cy="21" fill="#FEFECE" filter="url(#fzqc2hyoug66y)" rx="12" ry="12" style="stroke:#A80036;stroke-width:2.0;"/><polygon fill="#A80036" points="94.5,9,100.5,4,98.5,9,100.5,14,94.5,9" style="stroke:#A80036;stroke-width:1.0;"/><text fill="#000000" font-family="sans-serif" font-size="14" lengthAdjust="spacing" textLength="119" x="36" y="1453.0176">ControlComponent</text><ellipse cx="98.5" cy="1472.0938" fill="#FEFECE" filter="url(#fzqc2hyoug66y)" rx="12" ry="12" style="stroke:#A80036;stroke-width:2.0;"/><polygon fill="#A80036" points="94.5,1460.0938,100.5,1455.0938,98.5,1460.0938,100.5,1465.0938,94.5,1460.0938" style="stroke:#A80036;stroke-width:1.0;"/><rect fill="#FEFECE" filter="url(#fzqc2hyoug66y)" height="31.6094" style="stroke:#A80036;stroke-width:1.5;" width="131" x="375" y="14"/><rect fill="#FEFECE" filter="url(#fzqc2hyoug66y)" height="31.6094" style="stroke:#A80036;stroke-width:1.5;" width="131" x="371" y="18"/><text fill="#000000" font-family="sans-serif" font-size="14" lengthAdjust="spacing" textLength="117" x="378" y="39.5332">MLOperationMode</text><rect fill="#FEFECE" filter="url(#fzqc2hyoug66y)" height="31.6094" style="stroke:#A80036;stroke-width:1.5;" width="131" x="375" y="1438.4844"/><rect fill="#FEFECE" filter="url(#fzqc2hyoug66y)" height="31.6094" style="stroke:#A80036;stroke-width:1.5;" width="131" x="371" y="1442.4844"/><text fill="#000000" font-family="sans-serif" font-size="14" lengthAdjust="spacing" textLength="117" x="378" y="1464.0176">MLOperationMode</text><rect fill="#FEFECE" filter="url(#fzqc2hyoug66y)" height="31.6094" style="stroke:#A80036;stroke-width:1.5;" width="71" x="535" y="14"/><rect fill="#FEFECE" filter="url(#fzqc2hyoug66y)" height="31.6094" style="stroke:#A80036;stroke-width:1.5;" width="71" x="531" y="18"/><text fill="#000000" font-family="sans-serif" font-size="14" lengthAdjust="spacing" textLength="57" x="538" y="39.5332">MLModel</text><rect fill="#FEFECE" filter="url(#fzqc2hyoug66y)" height="31.6094" style="stroke:#A80036;stroke-width:1.5;" width="71" x="535" y="1438.4844"/><rect fill="#FEFECE" filter="url(#fzqc2hyoug66y)" height="31.6094" style="stroke:#A80036;stroke-width:1.5;" width="71" x="531" y="1442.4844"/><text fill="#000000" font-family="sans-serif" font-size="14" lengthAdjust="spacing" textLength="57" x="538" y="1464.0176">MLModel</text><rect fill="#FEFECE" filter="url(#fzqc2hyoug66y)" height="31.6094" style="stroke:#A80036;stroke-width:1.5;" width="70" x="744.5" y="18"/><text fill="#000000" font-family="sans-serif" font-size="14" lengthAdjust="spacing" textLength="56" x="751.5" y="39.5332">MLAgent</text><rect fill="#FEFECE" filter="url(#fzqc2hyoug66y)" height="31.6094" style="stroke:#A80036;stroke-width:1.5;" width="70" x="744.5" y="1438.4844"/><text fill="#000000" font-family="sans-serif" font-size="14" lengthAdjust="spacing" textLength="56" x="751.5" y="1460.0176">MLAgent</text><rect fill="#FFFFFF" filter="url(#fzqc2hyoug66y)" height="30.3516" style="stroke:#A80036;stroke-width:1.0;" width="10" x="93.5" y="169.0156"/><rect fill="#FFFFFF" filter="url(#fzqc2hyoug66y)" height="30.3516" style="stroke:#A80036;stroke-width:1.0;" width="10" x="93.5" y="333.125"/><rect fill="#FFFFFF" filter="url(#fzqc2hyoug66y)" height="30.3516" style="stroke:#A80036;stroke-width:1.0;" width="10" x="93.5" y="675.3438"/><rect fill="#FFFFFF" filter="url(#fzqc2hyoug66y)" height="30.3516" style="stroke:#A80036;stroke-width:1.0;" width="10" x="93.5" y="736.0469"/><rect fill="#FFFFFF" filter="url(#fzqc2hyoug66y)" height="30.3516" style="stroke:#A80036;stroke-width:1.0;" width="10" x="93.5" y="1171.6719"/><rect fill="#FFFFFF" filter="url(#fzqc2hyoug66y)" height="30.3516" style="stroke:#A80036;stroke-width:1.0;" width="10" x="93.5" y="1262.7266"/><rect fill="#FFFFFF" filter="url(#fzqc2hyoug66y)" height="30.3516" style="stroke:#A80036;stroke-width:1.0;" width="10" x="93.5" y="1353.7813"/><rect fill="#FFFFFF" filter="url(#fzqc2hyoug66y)" height="133.7578" style="stroke:#A80036;stroke-width:1.0;" width="10" x="435.5" y="169.0156"/><rect fill="#FFFFFF" filter="url(#fzqc2hyoug66y)" height="311.8672" style="stroke:#A80036;stroke-width:1.0;" width="10" x="435.5" y="333.125"/><rect fill="#FFFFFF" filter="url(#fzqc2hyoug66y)" height="60.7031" style="stroke:#A80036;stroke-width:1.0;" width="10" x="435.5" y="1171.6719"/><rect fill="#FFFFFF" filter="url(#fzqc2hyoug66y)" height="60.7031" style="stroke:#A80036;stroke-width:1.0;" width="10" x="435.5" y="1262.7266"/><rect fill="#FFFFFF" filter="url(#fzqc2hyoug66y)" height="60.7031" style="stroke:#A80036;stroke-width:1.0;" width="10" x="435.5" y="1353.7813"/><rect fill="#FFFFFF" filter="url(#fzqc2hyoug66y)" height="465.9766" style="stroke:#A80036;stroke-width:1.0;" width="10" x="565.5" y="675.3438"/><path d="M9,71.6094 L82,71.6094 L82,79.6094 L72,89.6094 L9,89.6094 L9,71.6094 " fill="#EEEEEE" style="stroke:#000000;stroke-width:1.0;"/><rect fill="none" height="1350.875" style="stroke:#000000;stroke-width:2.0;" width="819.5" x="9" y="71.6094"/><text fill="#000000" font-family="sans-serif" font-size="13" font-weight="bold" lengthAdjust="spacing" textLength="28" x="24" y="86.1045">loop</text><text fill="#000000" font-family="sans-serif" font-size="11" font-weight="bold" lengthAdjust="spacing" textLength="257" x="97" y="85.0283">[while goal not reached or no stop or no abort]</text><path d="M19,94.9609 L19,136.9609 L645,136.9609 L645,104.9609 L635,94.9609 L19,94.9609 " fill="#FBFB77" filter="url(#fzqc2hyoug66y)" style="stroke:#A80036;stroke-width:1.0;"/><path d="M635,94.9609 L635,104.9609 L645,104.9609 L635,94.9609 " fill="#FBFB77" style="stroke:#A80036;stroke-width:1.0;"/><text fill="#000000" font-family="sans-serif" font-size="13" lengthAdjust="spacing" textLength="605" x="25" y="113.4561">A sequence for a palette controlling current, left and right conveyor as example step in the loop is shown.</text><text fill="#000000" font-family="sans-serif" font-size="13" lengthAdjust="spacing" textLength="595" x="25" y="129.8076">In this step the palette moved from current to right conveyor and the ML-Model decides to move it back.</text><line style="stroke:#A80036;stroke-width:1.0;" x1="103.5" x2="113.5" y1="169.0156" y2="165.0156"/><line style="stroke:#A80036;stroke-width:1.0;" x1="103.5" x2="113.5" y1="169.0156" y2="173.0156"/><line style="stroke:#A80036;stroke-width:1.0;" x1="103.5" x2="434.5" y1="169.0156" y2="169.0156"/><text fill="#000000" font-family="sans-serif" font-size="13" font-weight="bold" lengthAdjust="spacing" textLength="7" x="120.5" y="164.1592">1</text><text fill="#000000" font-family="sans-serif" font-size="13" lengthAdjust="spacing" textLength="138" x="131.5" y="164.1592">GetVar("/OEXST.value")</text><line style="stroke:#A80036;stroke-width:1.0;" x1="433.5" x2="423.5" y1="199.3672" y2="195.3672"/><line style="stroke:#A80036;stroke-width:1.0;" x1="433.5" x2="423.5" y1="199.3672" y2="203.3672"/><line style="stroke:#A80036;stroke-width:1.0;stroke-dasharray:2.0,2.0;" x1="98.5" x2="434.5" y1="199.3672" y2="199.3672"/><text fill="#000000" font-family="sans-serif" font-size="13" lengthAdjust="spacing" textLength="204" x="105.5" y="194.5107">"COMPLETE; IDLE; COMPLETE;;"</text><path d="M35,212.3672 L35,271.3672 L504,271.3672 L504,222.3672 L494,212.3672 L35,212.3672 " fill="#FBFB77" filter="url(#fzqc2hyoug66y)" style="stroke:#A80036;stroke-width:1.0;"/><path d="M494,212.3672 L494,222.3672 L504,222.3672 L494,212.3672 " fill="#FBFB77" style="stroke:#A80036;stroke-width:1.0;"/><text fill="#000000" font-family="sans-serif" font-size="13" lengthAdjust="spacing" textLength="281" x="51.5" y="230.8623">Check for "COMPLETE", "STOPPED" or  "IDLE"</text><text fill="#000000" font-family="sans-serif" font-size="13" lengthAdjust="spacing" textLength="375" x="51.5" y="247.2139">if corresponding /OOCCUPIE.value == "&lt;CCName, e.g. PA001&gt;"</text><text fill="#000000" font-family="sans-serif" font-size="13" lengthAdjust="spacing" textLength="423" x="51.5" y="263.5654">Here the values represent the EXST of the current, left and right conveyor.</text><line style="stroke:#A80036;stroke-width:1.0;" x1="98.5" x2="108.5" y1="302.7734" y2="298.7734"/><line style="stroke:#A80036;stroke-width:1.0;" x1="98.5" x2="108.5" y1="302.7734" y2="306.7734"/><line style="stroke:#A80036;stroke-width:1.0;" x1="98.5" x2="439.5" y1="302.7734" y2="302.7734"/><text fill="#000000" font-family="sans-serif" font-size="13" font-weight="bold" lengthAdjust="spacing" textLength="7" x="115.5" y="297.917">2</text><text fill="#000000" font-family="sans-serif" font-size="13" lengthAdjust="spacing" textLength="216" x="126.5" y="297.917">SetVar("/SC.value", "SUSPENDING")</text><line style="stroke:#A80036;stroke-width:1.0;" x1="103.5" x2="113.5" y1="333.125" y2="329.125"/><line style="stroke:#A80036;stroke-width:1.0;" x1="103.5" x2="113.5" y1="333.125" y2="337.125"/><line style="stroke:#A80036;stroke-width:1.0;" x1="103.5" x2="434.5" y1="333.125" y2="333.125"/><text fill="#000000" font-family="sans-serif" font-size="13" font-weight="bold" lengthAdjust="spacing" textLength="7" x="120.5" y="328.2686">3</text><text fill="#000000" font-family="sans-serif" font-size="13" lengthAdjust="spacing" textLength="128" x="131.5" y="328.2686">GetVar("/EXST.value")</text><line style="stroke:#A80036;stroke-width:1.0;" x1="433.5" x2="423.5" y1="363.4766" y2="359.4766"/><line style="stroke:#A80036;stroke-width:1.0;" x1="433.5" x2="423.5" y1="363.4766" y2="367.4766"/><line style="stroke:#A80036;stroke-width:1.0;stroke-dasharray:2.0,2.0;" x1="98.5" x2="434.5" y1="363.4766" y2="363.4766"/><text fill="#000000" font-family="sans-serif" font-size="13" lengthAdjust="spacing" textLength="99" x="105.5" y="358.6201">"SUSPENDING;"</text><line style="stroke:#A80036;stroke-width:1.0;" x1="98.5" x2="108.5" y1="393.8281" y2="389.8281"/><line style="stroke:#A80036;stroke-width:1.0;" x1="98.5" x2="108.5" y1="393.8281" y2="397.8281"/><line style="stroke:#A80036;stroke-width:1.0;" x1="98.5" x2="434.5" y1="393.8281" y2="393.8281"/><text fill="#000000" font-family="sans-serif" font-size="13" font-weight="bold" lengthAdjust="spacing" textLength="7" x="115.5" y="388.9717">4</text><text fill="#000000" font-family="sans-serif" font-size="13" lengthAdjust="spacing" textLength="291" x="126.5" y="388.9717">SetVar("/ORDEROUT.value","{RESET}{}{RESET}")</text><path d="M35,406.8281 L35,465.8281 L504,465.8281 L504,416.8281 L494,406.8281 L35,406.8281 " fill="#FBFB77" filter="url(#fzqc2hyoug66y)" style="stroke:#A80036;stroke-width:1.0;"/><path d="M494,406.8281 L494,416.8281 L504,416.8281 L494,406.8281 " fill="#FBFB77" style="stroke:#A80036;stroke-width:1.0;"/><text fill="#000000" font-family="sans-serif" font-size="13" lengthAdjust="spacing" textLength="345" x="75" y="425.3232">Length of ORDEROUT depends on number of order outputs.</text><text fill="#000000" font-family="sans-serif" font-size="13" lengthAdjust="spacing" textLength="339" x="75" y="441.6748">E.g. current, left and right conveyor of the palette are used.</text><text fill="#000000" font-family="sans-serif" font-size="13" lengthAdjust="spacing" textLength="376" x="75" y="458.0264">Only used (occupied) outputs need to be reseted in a regular run.</text><line style="stroke:#A80036;stroke-width:1.0;" x1="98.5" x2="108.5" y1="497.2344" y2="493.2344"/><line style="stroke:#A80036;stroke-width:1.0;" x1="98.5" x2="108.5" y1="497.2344" y2="501.2344"/><line style="stroke:#A80036;stroke-width:1.0;" x1="98.5" x2="434.5" y1="497.2344" y2="497.2344"/><text fill="#000000" font-family="sans-serif" font-size="13" font-weight="bold" lengthAdjust="spacing" textLength="7" x="115.5" y="492.3779">5</text><text fill="#000000" font-family="sans-serif" font-size="13" lengthAdjust="spacing" textLength="281" x="126.5" y="492.3779">SetVar("/MLOBSERVE.value","{1}{0}{0}{5}{5}{5}")</text><line style="stroke:#A80036;stroke-width:1.0;" x1="98.5" x2="108.5" y1="527.5859" y2="523.5859"/><line style="stroke:#A80036;stroke-width:1.0;" x1="98.5" x2="108.5" y1="527.5859" y2="531.5859"/><line style="stroke:#A80036;stroke-width:1.0;" x1="98.5" x2="434.5" y1="527.5859" y2="527.5859"/><text fill="#000000" font-family="sans-serif" font-size="13" font-weight="bold" lengthAdjust="spacing" textLength="7" x="115.5" y="522.7295">6</text><text fill="#000000" font-family="sans-serif" font-size="13" lengthAdjust="spacing" textLength="215" x="126.5" y="522.7295">SetVar("/MLENACT.value","{1}{1}{0}")</text><path d="M35,540.5859 L35,582.5859 L504,582.5859 L504,550.5859 L494,540.5859 L35,540.5859 " fill="#FBFB77" filter="url(#fzqc2hyoug66y)" style="stroke:#A80036;stroke-width:1.0;"/><path d="M494,540.5859 L494,550.5859 L504,550.5859 L494,540.5859 " fill="#FBFB77" style="stroke:#A80036;stroke-width:1.0;"/><text fill="#000000" font-family="sans-serif" font-size="13" lengthAdjust="spacing" textLength="229" x="129" y="559.0811">Length of MLOBSERVE and MLENACT</text><text fill="#000000" font-family="sans-serif" font-size="13" lengthAdjust="spacing" textLength="264" x="133" y="575.4326">depend on observation and action space size.</text><line style="stroke:#A80036;stroke-width:1.0;" x1="98.5" x2="108.5" y1="614.6406" y2="610.6406"/><line style="stroke:#A80036;stroke-width:1.0;" x1="98.5" x2="108.5" y1="614.6406" y2="618.6406"/><line style="stroke:#A80036;stroke-width:1.0;" x1="98.5" x2="434.5" y1="614.6406" y2="614.6406"/><text fill="#000000" font-family="sans-serif" font-size="13" font-weight="bold" lengthAdjust="spacing" textLength="7" x="115.5" y="609.7842">7</text><text fill="#000000" font-family="sans-serif" font-size="13" lengthAdjust="spacing" textLength="214" x="126.5" y="609.7842">SetVar("/MLREWARD.value", 0.001f)</text><line style="stroke:#A80036;stroke-width:1.0;" x1="98.5" x2="108.5" y1="644.9922" y2="640.9922"/><line style="stroke:#A80036;stroke-width:1.0;" x1="98.5" x2="108.5" y1="644.9922" y2="648.9922"/><line style="stroke:#A80036;stroke-width:1.0;" x1="98.5" x2="439.5" y1="644.9922" y2="644.9922"/><text fill="#000000" font-family="sans-serif" font-size="13" font-weight="bold" lengthAdjust="spacing" textLength="7" x="115.5" y="640.1357">8</text><text fill="#000000" font-family="sans-serif" font-size="13" lengthAdjust="spacing" textLength="212" x="126.5" y="640.1357">SetVar("/SC.value", "SUSPENDED")</text><line style="stroke:#A80036;stroke-width:1.0;" x1="103.5" x2="113.5" y1="675.3438" y2="671.3438"/><line style="stroke:#A80036;stroke-width:1.0;" x1="103.5" x2="113.5" y1="675.3438" y2="679.3438"/><line style="stroke:#A80036;stroke-width:1.0;" x1="103.5" x2="564.5" y1="675.3438" y2="675.3438"/><text fill="#000000" font-family="sans-serif" font-size="13" font-weight="bold" lengthAdjust="spacing" textLength="7" x="120.5" y="670.4873">9</text><text fill="#000000" font-family="sans-serif" font-size="13" lengthAdjust="spacing" textLength="128" x="131.5" y="670.4873">GetVar("/EXST.value")</text><line style="stroke:#A80036;stroke-width:1.0;" x1="563.5" x2="553.5" y1="705.6953" y2="701.6953"/><line style="stroke:#A80036;stroke-width:1.0;" x1="563.5" x2="553.5" y1="705.6953" y2="709.6953"/><line style="stroke:#A80036;stroke-width:1.0;stroke-dasharray:2.0,2.0;" x1="98.5" x2="564.5" y1="705.6953" y2="705.6953"/><text fill="#000000" font-family="sans-serif" font-size="13" lengthAdjust="spacing" textLength="91" x="105.5" y="700.8389">"SUSPENDED"</text><line style="stroke:#A80036;stroke-width:1.0;" x1="103.5" x2="113.5" y1="736.0469" y2="732.0469"/><line style="stroke:#A80036;stroke-width:1.0;" x1="103.5" x2="113.5" y1="736.0469" y2="740.0469"/><line style="stroke:#A80036;stroke-width:1.0;" x1="103.5" x2="564.5" y1="736.0469" y2="736.0469"/><text fill="#000000" font-family="sans-serif" font-size="13" font-weight="bold" lengthAdjust="spacing" textLength="14" x="120.5" y="731.1904">10</text><text fill="#000000" font-family="sans-serif" font-size="13" lengthAdjust="spacing" textLength="425" x="138.5" y="731.1904">GetVar("/MLOBSERVE.value", "/MLENACT.value", "/MLREWARD.value")</text><line style="stroke:#A80036;stroke-width:1.0;" x1="563.5" x2="553.5" y1="766.3984" y2="762.3984"/><line style="stroke:#A80036;stroke-width:1.0;" x1="563.5" x2="553.5" y1="766.3984" y2="770.3984"/><line style="stroke:#A80036;stroke-width:1.0;stroke-dasharray:2.0,2.0;" x1="98.5" x2="564.5" y1="766.3984" y2="766.3984"/><text fill="#000000" font-family="sans-serif" font-size="13" lengthAdjust="spacing" textLength="193" x="105.5" y="761.542">"1; 0; 0; 5; 5; 5;; 1; 1; 0;; 0.001;;"</text><line style="stroke:#A80036;stroke-width:1.0;" x1="779.5" x2="769.5" y1="796.75" y2="792.75"/><line style="stroke:#A80036;stroke-width:1.0;" x1="779.5" x2="769.5" y1="796.75" y2="800.75"/><line style="stroke:#A80036;stroke-width:1.0;" x1="575.5" x2="780.5" y1="796.75" y2="796.75"/><text fill="#000000" font-family="sans-serif" font-size="13" font-weight="bold" lengthAdjust="spacing" textLength="14" x="582.5" y="791.8936">11</text><text fill="#000000" font-family="sans-serif" font-size="13" lengthAdjust="spacing" textLength="109" x="600.5" y="791.8936">AddReward(0.001f)</text><line style="stroke:#A80036;stroke-width:1.0;" x1="779.5" x2="769.5" y1="827.1016" y2="823.1016"/><line style="stroke:#A80036;stroke-width:1.0;" x1="779.5" x2="769.5" y1="827.1016" y2="831.1016"/><line style="stroke:#A80036;stroke-width:1.0;" x1="575.5" x2="780.5" y1="827.1016" y2="827.1016"/><text fill="#000000" font-family="sans-serif" font-size="13" font-weight="bold" lengthAdjust="spacing" textLength="14" x="582.5" y="822.2451">12</text><text fill="#000000" font-family="sans-serif" font-size="13" lengthAdjust="spacing" textLength="106" x="600.5" y="822.2451">RequestDecision()</text><line style="stroke:#A80036;stroke-width:1.0;" x1="575.5" x2="585.5" y1="873.8047" y2="869.8047"/><line style="stroke:#A80036;stroke-width:1.0;" x1="575.5" x2="585.5" y1="873.8047" y2="877.8047"/><line style="stroke:#A80036;stroke-width:1.0;" x1="575.5" x2="780.5" y1="873.8047" y2="873.8047"/><text fill="#000000" font-family="sans-serif" font-size="13" font-weight="bold" lengthAdjust="spacing" textLength="14" x="592.5" y="860.7725">13</text><text fill="#000000" font-family="sans-serif" font-size="13" lengthAdjust="spacing" textLength="115" x="610.5" y="852.5967">CollectObservations</text><text fill="#000000" font-family="sans-serif" font-size="13" lengthAdjust="spacing" textLength="130" x="610.5" y="868.9482">(VectorSensor sensor)</text><line style="stroke:#A80036;stroke-width:1.0;" x1="575.5" x2="585.5" y1="920.5078" y2="916.5078"/><line style="stroke:#A80036;stroke-width:1.0;" x1="575.5" x2="585.5" y1="920.5078" y2="924.5078"/><line style="stroke:#A80036;stroke-width:1.0;" x1="575.5" x2="780.5" y1="920.5078" y2="920.5078"/><text fill="#000000" font-family="sans-serif" font-size="13" font-weight="bold" lengthAdjust="spacing" textLength="14" x="592.5" y="907.4756">14</text><text fill="#000000" font-family="sans-serif" font-size="13" lengthAdjust="spacing" textLength="148" x="610.5" y="899.2998">WriteDiscreteActionMask</text><text fill="#000000" font-family="sans-serif" font-size="13" lengthAdjust="spacing" textLength="164" x="610.5" y="915.6514">(IDiscreteActionMask mask)</text><line style="stroke:#A80036;stroke-width:1.0;" x1="575.5" x2="585.5" y1="967.2109" y2="963.2109"/><line style="stroke:#A80036;stroke-width:1.0;" x1="575.5" x2="585.5" y1="967.2109" y2="971.2109"/><line style="stroke:#A80036;stroke-width:1.0;" x1="575.5" x2="780.5" y1="967.2109" y2="967.2109"/><text fill="#000000" font-family="sans-serif" font-size="13" font-weight="bold" lengthAdjust="spacing" textLength="14" x="592.5" y="954.1787">15</text><text fill="#000000" font-family="sans-serif" font-size="13" lengthAdjust="spacing" textLength="106" x="610.5" y="946.0029">OnActionReceived</text><text fill="#000000" font-family="sans-serif" font-size="13" lengthAdjust="spacing" textLength="124" x="610.5" y="962.3545">(ActionBuffers action)</text><path d="M534,980.2109 L534,1006.2109 L816,1006.2109 L816,990.2109 L806,980.2109 L534,980.2109 " fill="#FBFB77" filter="url(#fzqc2hyoug66y)" style="stroke:#A80036;stroke-width:1.0;"/><path d="M806,980.2109 L806,990.2109 L816,990.2109 L806,980.2109 " fill="#FBFB77" style="stroke:#A80036;stroke-width:1.0;"/><text fill="#000000" font-family="sans-serif" font-size="13" lengthAdjust="spacing" textLength="248" x="544.75" y="998.7061">action.DiscreteActions.Array = int[3]{2,4,0}</text><line style="stroke:#A80036;stroke-width:1.0;" x1="98.5" x2="108.5" y1="1037.9141" y2="1033.9141"/><line style="stroke:#A80036;stroke-width:1.0;" x1="98.5" x2="108.5" y1="1037.9141" y2="1041.9141"/><line style="stroke:#A80036;stroke-width:1.0;" x1="98.5" x2="564.5" y1="1037.9141" y2="1037.9141"/><text fill="#000000" font-family="sans-serif" font-size="13" font-weight="bold" lengthAdjust="spacing" textLength="14" x="115.5" y="1033.0576">16</text><text fill="#000000" font-family="sans-serif" font-size="13" lengthAdjust="spacing" textLength="224" x="133.5" y="1033.0576">SetVar("/MLDECIDE.value", "{2}{4}{0}")</text><path d="M50,1050.9141 L50,1109.9141 L619,1109.9141 L619,1060.9141 L609,1050.9141 L50,1050.9141 " fill="#FBFB77" filter="url(#fzqc2hyoug66y)" style="stroke:#A80036;stroke-width:1.0;"/><path d="M609,1050.9141 L609,1060.9141 L619,1060.9141 L609,1050.9141 " fill="#FBFB77" style="stroke:#A80036;stroke-width:1.0;"/><text fill="#000000" font-family="sans-serif" font-size="13" lengthAdjust="spacing" textLength="304" x="103.5" y="1069.4092">Length of MLDECIDE depends on action space size.</text><text fill="#000000" font-family="sans-serif" font-size="13" lengthAdjust="spacing" textLength="449" x="103.5" y="1085.7607">E.g. Operation modes for the current, left and right conveyor may be selected:</text><text fill="#000000" font-family="sans-serif" font-size="13" lengthAdjust="spacing" textLength="319" x="103.5" y="1102.1123">Current-&gt;2=BPASS, Left-&gt;4=BTAKE, Right-&gt;0=NONE.</text><line style="stroke:#A80036;stroke-width:1.0;" x1="98.5" x2="108.5" y1="1141.3203" y2="1137.3203"/><line style="stroke:#A80036;stroke-width:1.0;" x1="98.5" x2="108.5" y1="1141.3203" y2="1145.3203"/><line style="stroke:#A80036;stroke-width:1.0;" x1="98.5" x2="569.5" y1="1141.3203" y2="1141.3203"/><text fill="#000000" font-family="sans-serif" font-size="13" font-weight="bold" lengthAdjust="spacing" textLength="14" x="115.5" y="1136.4639">17</text><text fill="#000000" font-family="sans-serif" font-size="13" lengthAdjust="spacing" textLength="252" x="133.5" y="1136.4639">SetVar("/MLSC.value", "UNSUSPENDING")</text><line style="stroke:#A80036;stroke-width:1.0;" x1="103.5" x2="113.5" y1="1171.6719" y2="1167.6719"/><line style="stroke:#A80036;stroke-width:1.0;" x1="103.5" x2="113.5" y1="1171.6719" y2="1175.6719"/><line style="stroke:#A80036;stroke-width:1.0;" x1="103.5" x2="434.5" y1="1171.6719" y2="1171.6719"/><text fill="#000000" font-family="sans-serif" font-size="13" font-weight="bold" lengthAdjust="spacing" textLength="14" x="120.5" y="1166.8154">18</text><text fill="#000000" font-family="sans-serif" font-size="13" lengthAdjust="spacing" textLength="132" x="138.5" y="1166.8154">GetVar("/MLSC.value")</text><line style="stroke:#A80036;stroke-width:1.0;" x1="433.5" x2="423.5" y1="1202.0234" y2="1198.0234"/><line style="stroke:#A80036;stroke-width:1.0;" x1="433.5" x2="423.5" y1="1202.0234" y2="1206.0234"/><line style="stroke:#A80036;stroke-width:1.0;stroke-dasharray:2.0,2.0;" x1="98.5" x2="434.5" y1="1202.0234" y2="1202.0234"/><text fill="#000000" font-family="sans-serif" font-size="13" lengthAdjust="spacing" textLength="117" x="105.5" y="1197.167">"UNSUSPENDING;"</text><line style="stroke:#A80036;stroke-width:1.0;" x1="98.5" x2="108.5" y1="1232.375" y2="1228.375"/><line style="stroke:#A80036;stroke-width:1.0;" x1="98.5" x2="108.5" y1="1232.375" y2="1236.375"/><line style="stroke:#A80036;stroke-width:1.0;" x1="98.5" x2="439.5" y1="1232.375" y2="1232.375"/><text fill="#000000" font-family="sans-serif" font-size="13" font-weight="bold" lengthAdjust="spacing" textLength="14" x="115.5" y="1227.5186">19</text><text fill="#000000" font-family="sans-serif" font-size="13" lengthAdjust="spacing" textLength="234" x="133.5" y="1227.5186">SetVar("/SC.value", "UNSUSPENDING")</text><line style="stroke:#A80036;stroke-width:1.0;" x1="103.5" x2="113.5" y1="1262.7266" y2="1258.7266"/><line style="stroke:#A80036;stroke-width:1.0;" x1="103.5" x2="113.5" y1="1262.7266" y2="1266.7266"/><line style="stroke:#A80036;stroke-width:1.0;" x1="103.5" x2="434.5" y1="1262.7266" y2="1262.7266"/><text fill="#000000" font-family="sans-serif" font-size="13" font-weight="bold" lengthAdjust="spacing" textLength="14" x="120.5" y="1257.8701">20</text><text fill="#000000" font-family="sans-serif" font-size="13" lengthAdjust="spacing" textLength="128" x="138.5" y="1257.8701">GetVar("/EXST.value")</text><line style="stroke:#A80036;stroke-width:1.0;" x1="433.5" x2="423.5" y1="1293.0781" y2="1289.0781"/><line style="stroke:#A80036;stroke-width:1.0;" x1="433.5" x2="423.5" y1="1293.0781" y2="1297.0781"/><line style="stroke:#A80036;stroke-width:1.0;stroke-dasharray:2.0,2.0;" x1="98.5" x2="434.5" y1="1293.0781" y2="1293.0781"/><text fill="#000000" font-family="sans-serif" font-size="13" lengthAdjust="spacing" textLength="117" x="105.5" y="1288.2217">"UNSUSPENDING;"</text><line style="stroke:#A80036;stroke-width:1.0;" x1="98.5" x2="108.5" y1="1323.4297" y2="1319.4297"/><line style="stroke:#A80036;stroke-width:1.0;" x1="98.5" x2="108.5" y1="1323.4297" y2="1327.4297"/><line style="stroke:#A80036;stroke-width:1.0;" x1="98.5" x2="439.5" y1="1323.4297" y2="1323.4297"/><text fill="#000000" font-family="sans-serif" font-size="13" font-weight="bold" lengthAdjust="spacing" textLength="14" x="115.5" y="1318.5732">21</text><text fill="#000000" font-family="sans-serif" font-size="13" lengthAdjust="spacing" textLength="295" x="133.5" y="1318.5732">SetVar("/EXOPMODE.value","{BPASS}{BTAKE}{}")</text><line style="stroke:#A80036;stroke-width:1.0;" x1="103.5" x2="113.5" y1="1353.7813" y2="1349.7813"/><line style="stroke:#A80036;stroke-width:1.0;" x1="103.5" x2="113.5" y1="1353.7813" y2="1357.7813"/><line style="stroke:#A80036;stroke-width:1.0;" x1="103.5" x2="434.5" y1="1353.7813" y2="1353.7813"/><text fill="#000000" font-family="sans-serif" font-size="13" font-weight="bold" lengthAdjust="spacing" textLength="14" x="120.5" y="1348.9248">22</text><text fill="#000000" font-family="sans-serif" font-size="13" lengthAdjust="spacing" textLength="138" x="138.5" y="1348.9248">GetVar("/OEXST.value")</text><line style="stroke:#A80036;stroke-width:1.0;" x1="433.5" x2="423.5" y1="1384.1328" y2="1380.1328"/><line style="stroke:#A80036;stroke-width:1.0;" x1="433.5" x2="423.5" y1="1384.1328" y2="1388.1328"/><line style="stroke:#A80036;stroke-width:1.0;stroke-dasharray:2.0,2.0;" x1="98.5" x2="434.5" y1="1384.1328" y2="1384.1328"/><text fill="#000000" font-family="sans-serif" font-size="13" lengthAdjust="spacing" textLength="176" x="105.5" y="1379.2764">"EXECUTE; EXECUTE; IDLE;"</text><line style="stroke:#A80036;stroke-width:1.0;" x1="98.5" x2="108.5" y1="1414.4844" y2="1410.4844"/><line style="stroke:#A80036;stroke-width:1.0;" x1="98.5" x2="108.5" y1="1414.4844" y2="1418.4844"/><line style="stroke:#A80036;stroke-width:1.0;" x1="98.5" x2="439.5" y1="1414.4844" y2="1414.4844"/><text fill="#000000" font-family="sans-serif" font-size="13" font-weight="bold" lengthAdjust="spacing" textLength="14" x="115.5" y="1409.6279">23</text><text fill="#000000" font-family="sans-serif" font-size="13" lengthAdjust="spacing" textLength="95" x="133.5" y="1409.6279">SC="EXECUTE"</text><!--MD5=[6f60e0264a3dc4b390df834ff7efdd27]
@startuml sequenz-ml-fahrweise-ausführung
skinparam backgroundColor SeaShell

control "ControlComponent" as PFK
collections "MLOperationMode" as OpMode
collections "MLModel" as ML
participant "MLAgent" as Agent

autonumber
loop while goal not reached or no stop or no abort
    note over PFK,ML: A sequence for a palette controlling current, left and right conveyor as example step in the loop is shown.\nIn this step the palette moved from current to right conveyor and the ML-Model decides to move it back.

    OpMode ->> PFK ++: GetVar("/OEXST.value")
    activate OpMode
    autonumber stop
    return "COMPLETE; IDLE; COMPLETE;;"
    note over PFK,OpMode: Check for "COMPLETE", "STOPPED" or  "IDLE"\nif corresponding /OOCCUPIE.value == "<CCName, e.g. PA001>"\nHere the values represent the EXST of the current, left and right conveyor.
    autonumber resume
    OpMode ->> PFK: SetVar("/SC.value", "SUSPENDING")
    deactivate OpMode
    
    OpMode ->> PFK++: GetVar("/EXST.value")
    activate OpMode
    autonumber stop
    return "SUSPENDING;"
    autonumber resume
    OpMode ->> PFK: SetVar("/ORDEROUT.value","{RESET}{}{RESET}")
    note over PFK,OpMode: Length of ORDEROUT depends on number of order outputs.\nE.g. current, left and right conveyor of the palette are used.\nOnly used (occupied) outputs need to be reseted in a regular run.

    OpMode ->> PFK: SetVar("/MLOBSERVE.value","{1}{0}{0}{5}{5}{5}")
    OpMode ->> PFK: SetVar("/MLENACT.value","{1}{1}{0}")
    note over PFK,OpMode: Length of MLOBSERVE and MLENACT\n depend on observation and action space size.
    OpMode ->> PFK: SetVar("/MLREWARD.value", 0.001f)
    OpMode ->> PFK: SetVar("/SC.value", "SUSPENDED")
    deactivate OpMode

    ML ->> PFK++: GetVar("/EXST.value")
    activate ML
    autonumber stop
    return "SUSPENDED"
    autonumber resume
    ML ->> PFK++: GetVar("/MLOBSERVE.value", "/MLENACT.value", "/MLREWARD.value")
    autonumber stop
    return "1; 0; 0; 5; 5; 5;; 1; 1; 0;; 0.001;;"
    autonumber resume
    ML->>Agent: AddReward(0.001f)
    ML->>Agent: RequestDecision()
    Agent->>ML: CollectObservations\n(VectorSensor sensor)
    Agent->>ML: WriteDiscreteActionMask\n(IDiscreteActionMask mask)
    Agent->>ML: OnActionReceived\n(ActionBuffers action)
    note over ML,Agent: action.DiscreteActions.Array = int[3]{2,4,0}
    ML->>PFK: SetVar("/MLDECIDE.value", "{2}{4}{0}")
    note over PFK,ML: Length of MLDECIDE depends on action space size.\nE.g. Operation modes for the current, left and right conveyor may be selected:\nCurrent->2=BPASS, Left->4=BTAKE, Right->0=NONE.
    ML->>PFK- -: SetVar("/MLSC.value", "UNSUSPENDING")

    OpMode ->> PFK++: GetVar("/MLSC.value")
    activate OpMode
    autonumber stop
    return "UNSUSPENDING;"
    autonumber resume
    OpMode ->> PFK- -: SetVar("/SC.value", "UNSUSPENDING")

    OpMode ->> PFK++: GetVar("/EXST.value")
    activate OpMode
    autonumber stop
    return "UNSUSPENDING;"
    autonumber resume
    OpMode ->> PFK- -: SetVar("/EXOPMODE.value","{BPASS}{BTAKE}{}")

    OpMode ->> PFK++: GetVar("/OEXST.value")
    activate OpMode
    autonumber stop
    return "EXECUTE; EXECUTE; IDLE;"
    autonumber resume

    OpMode ->> PFK- -: SC="EXECUTE"
end
@enduml

PlantUML version 1.2021.00(Sun Jan 10 11:25:05 CET 2021)
(GPL source distribution)
Java Runtime: Java(TM) SE Runtime Environment
JVM: Java HotSpot(TM) 64-Bit Server VM
Default Encoding: Cp1252
Language: de
Country: DE
--></g></svg>