{
	"JSON": {
		"ID": "1ee80bc8-0fad-6a58-bacf-07f04e1d939f",
		"label": "",
		"comment": "UUID6 is used"
	},
	"group": {
		"number": "37",
		"author": "Zidane Bürmann",
		"experiment": "Lerneinheit II Kalorimetrie: Küchentisch"
	}
}