{
	"JSON": {
		"ID": "1ee80bdc-d870-6a0e-8bb4-c4e31d9cbde6",
		"label": "",
		"comment": "UUID6 is used"
	},
	"probe": {
            "metadata": {
		"mass_coldwater": "0.104",
		"mass_hotwater": "0.107"
	},
        "info": "Filled two cups with water. The one with cold water from the tube, the other with hot. The masses are indicated in kg."
    }
}