{
	"JSON": {
		"ID": "1ee80bdf-80f2-6edf-9bbc-e64f6fee4201",
		"label": "",
		"comment": "UUID6 is used"
	},
	"probe": {
		"metadata": "define your own metadata here",
		"info": "I filled one cup with hot water. One sensor is used for measuring the temperature from the hot water and the other for the enviromental temperature"
	}
}