{
	"JSON": {
		"ID": "1ee80bdd-fd26-648b-b8b0-3c0fd615b6a4",
		"label": "",
		"comment": "UUID6 is used"
	},
    "comment": "here you can write down something important about this setup file",
    "info": "List below ALL components, you used in your experiment. By using the UUID there is no possibility to mix something up.",
	"setup": {
		"1ee80bc8-0fad-6a58-bacf-07f04e1d939f": {
            "type": "group_info",
			"name": "group_info",
            "comment": ""
        },
		"1ee80bc8-0fb2-6486-a1c6-2b229967fa7a": {
            "type": "instrument",
			"name": "raspberry_pi",
            "comment": ""
        },
		"1ee80bc8-0fb4-67b3-a290-2becf8e923b0": {
            "type": "sensor",
			"name": "sensor 1",
            "comment": ""
        },
		"1ee80bd6-8100-61b5-8a1e-eb20a660622b": {
            "type": "sensor",
			"name": "sensor 2",
            "comment": ""
        },
		"1ee80bdf-80f2-6edf-9bbc-e64f6fee4201": {
            "type": "probe",
			"name": "probe_description",
            "comment": ""
        },
		"add_more_here_if_you_need": {
			"type": "choose your own type, if you miss one",
			"name": "",
			"comment": ""
		}
	}
}