{
	"JSON": {
		"ID": "1ee5ec0a-1830-63f5-ac3e-6f8ce4468546",
		"label": "",
		"comment": "UUID6 is used"
	},
	"group": {
		"number": "Gruppe 1 & Gruppe 13",
		"author": [
			"Fabian Roesch",
			"Yvan Diran NGOUNE SOUNTSA"
			
		],
		"experiment": "calorimetry",
		"testrig_number": "Testrig #4"
	}
}
