{
	"JSON": {
		"ID": "1ee82048-0880-668a-8622-b6bc7d41c645",
		"label": "",
		"comment": "UUID6 is used"
	},
	"probe": {
        "name": "water",
        "cups": "2",
        "amount in ml": "100",
        "comment": "one cup cold water and one cup hot water. measured before and after mixing.",
		"info": "think about all necessary things you should write down, that someone else can understand what you were doing"
	}
}