{
	"JSON": {
		"ID": "1ee82049-caa9-6748-a3a5-dc5191c8ebf5",
		"label": "",
		"comment": "UUID6 is used"
	},
	"group": {
		"number": "12",
		"author": "Young-Min Kong",
		"experiment": "experiment1"
	}
}