188000000000000000000.0	0.0000000000000005339999999999999996850556	20000000000000000000.0	0.0000000000000000300000000000000006055288
1190000000000000000000.0	0.0000000000000002640000000000000003982725	591000000000000000000.0	0.0000000000000000300000000000000006055288
110000000000000016384.0	0.0000000000000025260000000000000251010237	12000000000000000000.0	0.0000000000000000300000000000000006055288
292000000000000000000.0	0.0000000000000001709999999999999929744551	53000000000000000000.0	0.0000000000000000300000000000000006055288
409000000000000000000.0	0.0000000000000002550000000000000020655066	79000000000000000000.0	0.0000000000000000300000000000000006055288
1240000000000000000000.0	0.0000000000000005009999999999999564944407	439000000000000000000.0	0.0000000000000000300000000000000006055288
33000000000000000000.0	0.0000000000000001079999999999999923191422	7000000000000001024.0	0.0000000000000000300000000000000006055288
342000000000000000000.0	0.0000000000000005939999999999999885701614	53000000000000000000.0	0.0000000000000000300000000000000006055288
623000000000000000000.0	0.0000000000000006179999999999999841242038	112000000000000016384.0	0.0000000000000000300000000000000006055288
217000000000000000000.0	0.0000000000000006509999999999999287072055	26000000000000000000.0	0.0000000000000000300000000000000006055288
490000000000000065536.0	0.0000000000000008369999999999999928586469	105000000000000000000.0	0.0000000000000000300000000000000006055288
351000000000000000000.0	0.0000000000000011430000000000000347803001	58000000000000000000.0	0.0000000000000000300000000000000006055288
1110000000000000000000.0	0.0000000000000000600000000000000012110575	144000000000000000000.0	0.0000000000000000300000000000000006055288
1910000000000000262144.0	0.0000000000000000330000000000000000497841	981000000000000000000.0	0.0000000000000000300000000000000006055288
297000000000000000000.0	0.0000000000000027749999999999999296704065	61000000000000000000.0	0.0000000000000000300000000000000006055288
2880000000000000000000.0	0.0000000000000001079999999999999923191422	1400000000000000000000.0	0.0000000000000000300000000000000006055288
426000000000000000000.0	0.0000000000000001919999999999999890842421	102000000000000000000.0	0.0000000000000000300000000000000006055288
277000000000000000000.0	0.0000000000000003270000000000000380314402	49000000000000000000.0	0.0000000000000000300000000000000006055288
617000000000000000000.0	0.0000000000000002610000000000000009540172	53000000000000000000.0	0.0000000000000000300000000000000006055288
449000000000000000000.0	0.0000000000000001170000000000000029778598	42000000000000000000.0	0.0000000000000000300000000000000006055288
534000000000000000000.0	0.0000000000000001889999999999999896399868	132000000000000000000.0	0.0000000000000000300000000000000006055288
3860000000000000000000.0	0.0000000000000000389999999999999989382946	2360000000000000262144.0	0.0000000000000000300000000000000006055288
314000000000000000000.0	0.0000000000000008009999999999999995275833	161000000000000000000.0	0.0000000000000000300000000000000006055288
121000000000000000000.0	0.0000000000000019559999999999998348696783	18000000000000000000.0	0.0000000000000000300000000000000006055288
2370000000000000000000.0	0.0000000000000002640000000000000003982725	1190000000000000000000.0	0.0000000000000000300000000000000006055288
926000000000000000000.0	0.0000000000000007050000000000000173114139	458000000000000000000.0	0.0000000000000000300000000000000006055288
718000000000000000000.0	0.0000000000000002909999999999999953965701	59000000000000000000.0	0.0000000000000000300000000000000006055288
121000000000000000000.0	0.0000000000000013799999999999999415726617	18000000000000000000.0	0.0000000000000000300000000000000006055288
139999999999999983616.0	0.0000000000000012539999999999998663063262	19000000000000000000.0	0.0000000000000000300000000000000006055288
4900000000000000000000.0	0.0000000000000000420000000000000045455258	2450000000000000000000.0	0.0000000000000000300000000000000006055288
