{
	"JSON": {
		"ID": "1ee5305e-4442-69e5-983a-4ea49e1bf973",
		"label": "",
		"comment": "UUID6 is used"
	},
	"part": {
		"name": "shaft_testrig_4",
		"material": "20MnVS",
		"young's modulus": {
			"value": 210000,
			"unit": "N/mm**2"
		},
		"dimensions": {
			"length": {
				"value": 0.75,
				"unit": "meter"
			},
			"diameter": {
				"value": 8,
				"unit": "millimeter"
			}
		}
	}
}