{
	"JSON": {
		"ID": "1ee80a4c-5339-635a-aad3-fe089f6405e9",
		"label": "",
		"comment": "UUID6 is used"
	},
	"group": {
		"number": "14",
		"author": "Vladimir Pascari",
		"experiment": "calorimetry_home"
	}
}