{
    "assembly": {
        "uuid": "kpi-a654b5a3-73f6-4bbe-acf5-e7ade52a101d",
        "properties": {
            "label": "lego car two",
            "manufacturer": "Vincent Jestaedt",
            "comment": "Faster! Harder! Lego!",
            "mass [g]": 182.95999999999995,
            "price [Euro]": 79.13100000000004,
            "delivery time [days]": 12
        },
        "layer": "kpi-SUBASSEMBLY",
        "components": [],
        "assemblies": [
            {
                "assembly": {
                    "uuid": "kpi-ce467be1-c0ce-4a73-aa95-c3b4a8cc6030",
                    "properties": {
                        "label": "inner structure assembly"
                    },
                    "layer": "kpi-SUBASSEMBLY",
                    "components": [],
                    "assemblies": [
                        {
                            "assembly": {
                                "uuid": "kpi-9da2e70c-91b9-4ccc-aca8-ff22be06d67b",
                                "properties": {
                                    "label": "support frame assembly"
                                },
                                "layer": "kpi-SUBASSEMBLY",
                                "components": [
                                    {
                                        "component": {
                                            "uuid": "kpi-fb4458e1-a4a0-4564-a2bb-71817794ffdc",
                                            "properties": {
                                                "label": "pin connector front",
                                                "item number": 55615,
                                                "item description": "Technic, Pin Connector Perpendicular 3 x 3 Bent with 4 Pins",
                                                "category": "frame",
                                                "price [Euro]": 0.1,
                                                "mass [g]": 1.9,
                                                "delivery time [days]": 5,
                                                "data source": "https://www.bricklink.com/v2/catalog/catalogitem.page?P=55615&name=Technic,%20Pin%20Connector%20Perpendicular%203%20x%203%20Bent%20with%204%20Pins&category=%5BTechnic,%20Connector%5D#T=S&O={%22iconly%22:0}",
                                                "dimension [studs]": "4 x 4 x 1"
                                            },
                                            "layer": "kpi-COMPONENT"
                                        }
                                    },
                                    {
                                        "component": {
                                            "uuid": "kpi-b74e8a0e-dbe9-44c6-85af-cee31170695e",
                                            "properties": {
                                                "label": "pin connector back",
                                                "item number": 55615,
                                                "item description": "Technic, Pin Connector Perpendicular 3 x 3 Bent with 4 Pins",
                                                "category": "frame",
                                                "price [Euro]": 0.1,
                                                "mass [g]": 1.9,
                                                "delivery time [days]": 5,
                                                "data source": "https://www.bricklink.com/v2/catalog/catalogitem.page?P=55615&name=Technic,%20Pin%20Connector%20Perpendicular%203%20x%203%20Bent%20with%204%20Pins&category=%5BTechnic,%20Connector%5D#T=S&O={%22iconly%22:0}",
                                                "dimension [studs]": "4 x 4 x 1"
                                            },
                                            "layer": "kpi-COMPONENT"
                                        }
                                    },
                                    {
                                        "component": {
                                            "uuid": "kpi-aec9e196-ab8f-44bc-b01b-03e698303248",
                                            "properties": {
                                                "label": "beam long",
                                                "item number": 32278,
                                                "item description": "Technic, Liftarm Thick 1 x 15",
                                                "category": "frame",
                                                "price [Euro]": 0.05,
                                                "mass [g]": 4.0,
                                                "delivery time [days]": 3,
                                                "data source": "https://www.bricklink.com/v2/catalog/catalogitem.page?P=32278&name=Technic,%20Liftarm%20Thick%201%20x%2015&category=%5BTechnic,%20Liftarm%5D#T=S&O={%22iconly%22:0}",
                                                "dimension [studs]": "1 x 15"
                                            },
                                            "layer": "kpi-COMPONENT"
                                        }
                                    }
                                ],
                                "assemblies": []
                            }
                        },
                        {
                            "assembly": {
                                "uuid": "kpi-da81925e-dc91-4a11-a894-32160d85a976",
                                "properties": {
                                    "label": "battery assembly"
                                },
                                "layer": "kpi-SUBASSEMBLY",
                                "components": [
                                    {
                                        "component": {
                                            "uuid": "kpi-5ac691cf-6cf1-466b-b6ee-99c7bb5f056c",
                                            "properties": {
                                                "label": "motor",
                                                "item number": "8878-1",
                                                "item description": "Power Functions Rechargeable Battery Box",
                                                "category": "battery",
                                                "price [Euro]": 55,
                                                "mass [g]": 83.94,
                                                "delivery time [days]": 8,
                                                "data source": "https://www.bricklink.com/v2/catalog/catalogitem.page?S=8878-1#T=S&O={%22iconly%22:0}",
                                                "output voltage [V]": 7.4,
                                                "dimensions [cm]": "15 x 15 x 3,5"
                                            },
                                            "layer": "kpi-COMPONENT"
                                        }
                                    }
                                ],
                                "assemblies": [
                                    {
                                        "assembly": {
                                            "uuid": "kpi-4a6f255c-063b-4337-9075-38f01cb7a164",
                                            "properties": {
                                                "label": "battery frame assembly"
                                            },
                                            "layer": "kpi-SUBASSEMBLY",
                                            "components": [
                                                {
                                                    "component": {
                                                        "uuid": "kpi-ff999fdc-fa39-4bfa-9be4-821e1a095c9b",
                                                        "properties": {
                                                            "label": "battery frame",
                                                            "item number": 32531,
                                                            "item description": "Technic, Brick 4 x 6 Open Center",
                                                            "category": "frame",
                                                            "price [Euro]": 0.1,
                                                            "mass [g]": 5.0,
                                                            "delivery time [days]": 3,
                                                            "data source": "https://www.bricklink.com/v2/catalog/catalogitem.page?P=32531&idColor=11#T=C&C=11",
                                                            "dimension [studs]": "4 x 6 x 1"
                                                        },
                                                        "layer": "kpi-COMPONENT"
                                                    }
                                                },
                                                {
                                                    "component": {
                                                        "uuid": "kpi-97b3d152-48f9-4fbe-8c03-f90f32f21c53",
                                                        "properties": {
                                                            "label": "pin battery frame front",
                                                            "item number": 3673,
                                                            "item description": "Technic, Pin without Friction Ridges",
                                                            "category": "frame",
                                                            "price [Euro]": 0.01,
                                                            "mass [g]": 0.16,
                                                            "delivery time [days]": 3,
                                                            "data source": "https://www.bricklink.com/v2/catalog/catalogitem.page?P=3673&name=Technic,%20Pin%20without%20Friction%20Ridges&category=%5BTechnic,%20Pin%5D#T=S&O={%22iconly%22:0}",
                                                            "dimension [studs]": 1
                                                        },
                                                        "layer": "kpi-COMPONENT"
                                                    }
                                                },
                                                {
                                                    "component": {
                                                        "uuid": "kpi-3abddfa2-2edd-4f70-bcc5-be53b1b9aebd",
                                                        "properties": {
                                                            "label": "pin battery frame back",
                                                            "item number": 3673,
                                                            "item description": "Technic, Pin without Friction Ridges",
                                                            "category": "frame",
                                                            "price [Euro]": 0.01,
                                                            "mass [g]": 0.16,
                                                            "delivery time [days]": 3,
                                                            "data source": "https://www.bricklink.com/v2/catalog/catalogitem.page?P=3673&name=Technic,%20Pin%20without%20Friction%20Ridges&category=%5BTechnic,%20Pin%5D#T=S&O={%22iconly%22:0}",
                                                            "dimension [studs]": 1
                                                        },
                                                        "layer": "kpi-COMPONENT"
                                                    }
                                                }
                                            ],
                                            "assemblies": []
                                        }
                                    }
                                ]
                            }
                        },
                        {
                            "assembly": {
                                "uuid": "kpi-dba167f0-01e2-4abd-a5be-f608c883cae4",
                                "properties": {
                                    "label": "drive assembly"
                                },
                                "layer": "kpi-SUBASSEMBLY",
                                "components": [],
                                "assemblies": [
                                    {
                                        "assembly": {
                                            "uuid": "kpi-a94d1b02-07bd-4097-8090-7c7fafe1bd67",
                                            "properties": {
                                                "label": "motor assembly"
                                            },
                                            "layer": "kpi-SUBASSEMBLY",
                                            "components": [
                                                {
                                                    "component": {
                                                        "uuid": "kpi-80647ee0-19a4-4fff-8c65-c2e3aee53015",
                                                        "properties": {
                                                            "label": "motor",
                                                            "item number": "8883-1",
                                                            "item description": "Power Functions M-Motor",
                                                            "category": "motor",
                                                            "related items": "8881, 8878, 45517, 88000",
                                                            "idle current [mA]": 65,
                                                            "idle speed [rev per min]": 405,
                                                            "locking torque [Ncm]": 11,
                                                            "price [Euro]": 20,
                                                            "mass [g]": 35.0,
                                                            "delivery time [days]": 5,
                                                            "data source": "https://www.bricklink.com/v2/catalog/catalogitem.page?S=8883-1&name=Power%20Functions%20M-Motor&category=%5BPower%20Functions%5D#T=S&O={%22iconly%22:0}",
                                                            "compatible battery": "8881, 8878, 45517, 88000",
                                                            "input voltage [V]": 9,
                                                            "dimensions [cm]": "13.8 x 11.9 x 2.3",
                                                            "color": "metallic bright red"
                                                        },
                                                        "layer": "kpi-COMPONENT"
                                                    }
                                                },
                                                {
                                                    "component": {
                                                        "uuid": "kpi-28892167-c022-4815-9b19-8a71c115623d",
                                                        "properties": {
                                                            "label": "short axle",
                                                            "item number": 32073,
                                                            "item description": "Axle 5 studs",
                                                            "category": "axle",
                                                            "price [Euro]": 0.001,
                                                            "mass [g]": 0.66,
                                                            "delivery time [days]": 3,
                                                            "data source": "https://www.bricklink.com/v2/catalog/catalogitem.page?P=32073#T=S&O={%22iconly%22:0}",
                                                            "dimension [studs]": 5
                                                        },
                                                        "layer": "kpi-COMPONENT"
                                                    }
                                                },
                                                {
                                                    "component": {
                                                        "uuid": "kpi-a5718f34-65f0-46f2-b23a-e3c5f1d401df",
                                                        "properties": {
                                                            "label": "pin motor support front",
                                                            "item number": 3673,
                                                            "item description": "Technic, Pin without Friction Ridges",
                                                            "category": "frame",
                                                            "price [Euro]": 0.01,
                                                            "mass [g]": 0.16,
                                                            "delivery time [days]": 3,
                                                            "data source": "https://www.bricklink.com/v2/catalog/catalogitem.page?P=3673&name=Technic,%20Pin%20without%20Friction%20Ridges&category=%5BTechnic,%20Pin%5D#T=S&O={%22iconly%22:0}",
                                                            "dimension [studs]": 1
                                                        },
                                                        "layer": "kpi-COMPONENT"
                                                    }
                                                },
                                                {
                                                    "component": {
                                                        "uuid": "kpi-9033e9aa-8e32-49bf-a8d3-32ffd7763d46",
                                                        "properties": {
                                                            "label": "pin motor support back",
                                                            "item number": 3673,
                                                            "item description": "Technic, Pin without Friction Ridges",
                                                            "category": "frame",
                                                            "price [Euro]": 0.01,
                                                            "mass [g]": 0.16,
                                                            "delivery time [days]": 3,
                                                            "data source": "https://www.bricklink.com/v2/catalog/catalogitem.page?P=3673&name=Technic,%20Pin%20without%20Friction%20Ridges&category=%5BTechnic,%20Pin%5D#T=S&O={%22iconly%22:0}",
                                                            "dimension [studs]": 1
                                                        },
                                                        "layer": "kpi-COMPONENT"
                                                    }
                                                }
                                            ],
                                            "assemblies": []
                                        }
                                    },
                                    {
                                        "assembly": {
                                            "uuid": "kpi-8451ba78-1689-4f43-aa68-3968c3002b7e",
                                            "properties": {
                                                "label": "gear assembly"
                                            },
                                            "layer": "kpi-SUBASSEMBLY",
                                            "components": [
                                                {
                                                    "component": {
                                                        "uuid": "kpi-9d81bc05-96e0-4ddf-8ade-8477727d31cd",
                                                        "properties": {
                                                            "label": "small gear",
                                                            "item number": 94925,
                                                            "item description": "Gear 16 Tooth",
                                                            "category": "gear",
                                                            "price [Euro]": 0.2,
                                                            "mass [g]": 0.7,
                                                            "delivery time [days]": 12,
                                                            "data source": "https://www.bricklink.com/v2/catalog/catalogitem.page?P=94925#T=C"
                                                        },
                                                        "layer": "kpi-COMPONENT"
                                                    }
                                                },
                                                {
                                                    "component": {
                                                        "uuid": "kpi-a3a230f8-6e82-4ec8-91b5-8e027bcf76a6",
                                                        "properties": {
                                                            "label": "big gear",
                                                            "item number": 3648,
                                                            "item description": "Gear 24 Tooth",
                                                            "category": "gear",
                                                            "price [Euro]": 0.32,
                                                            "mass [g]": 1.17,
                                                            "delivery time [days]": 11,
                                                            "data source": "https://www.bricklink.com/v2/catalog/catalogitem.page?P=3648#T=C"
                                                        },
                                                        "layer": "kpi-COMPONENT"
                                                    }
                                                }
                                            ],
                                            "assemblies": []
                                        }
                                    }
                                ]
                            }
                        }
                    ]
                }
            },
            {
                "assembly": {
                    "uuid": "kpi-44d2b089-517e-4cb5-af81-9dc6039bed6b",
                    "properties": {
                        "label": "undercarriage assembly"
                    },
                    "layer": "kpi-SUBASSEMBLY",
                    "components": [
                        {
                            "component": {
                                "uuid": "kpi-ee9f41de-14d3-4d18-a023-eb02b223a47b",
                                "properties": {
                                    "label": "main frame",
                                    "item number": 39790,
                                    "item description": "Technic, Liftarm, Modified Frame Thick 11 x 15 Open Center",
                                    "category": "frame",
                                    "price [Euro]": 2.19,
                                    "mass [g]": 12.96,
                                    "delivery time [days]": 3,
                                    "data source": "https://www.bricklink.com/v2/catalog/catalogitem.page?P=39790#T=C",
                                    "dimension [studs]": "11 x 15 x 1"
                                },
                                "layer": "kpi-COMPONENT"
                            }
                        }
                    ],
                    "assemblies": [
                        {
                            "assembly": {
                                "uuid": "kpi-6f5213d6-9b74-4df6-ab68-9bf5365204ec",
                                "properties": {
                                    "label": "front axle assembly"
                                },
                                "layer": "kpi-SUBASSEMBLY",
                                "components": [
                                    {
                                        "component": {
                                            "uuid": "kpi-4f035136-1bd4-4ce1-ab52-999d7b8ee17c",
                                            "properties": {
                                                "label": "long axle front",
                                                "item number": 50451,
                                                "item description": "Axle 16 studs",
                                                "category": "axle",
                                                "price [Euro]": 0.75,
                                                "mass [g]": 2.37,
                                                "delivery time [days]": 3,
                                                "data source": "https://www.bricklink.com/v2/catalog/catalogitem.page?P=50451#T=S&O={%22iconly%22:0}",
                                                "dimension [studs]": 16
                                            },
                                            "layer": "kpi-COMPONENT"
                                        }
                                    }
                                ],
                                "assemblies": [
                                    {
                                        "assembly": {
                                            "uuid": "kpi-e69df899-3fad-4e81-8232-27227a7e2eff",
                                            "properties": {
                                                "label": "front wheel left assembly",
                                                "assembly_method": "stick together like lego blocks"
                                            },
                                            "layer": "kpi-SUBASSEMBLY",
                                            "components": [
                                                {
                                                    "component": {
                                                        "uuid": "kpi-69cf7cec-e639-47f3-96ff-8c2265a822f2",
                                                        "properties": {
                                                            "label": "front wheel left",
                                                            "item number": "56904c02",
                                                            "item description": "wheel 43,2",
                                                            "category": "wheel",
                                                            "related items": 30699,
                                                            "price [Euro]": 0.11,
                                                            "mass [g]": 13.0,
                                                            "delivery time [days]": 5,
                                                            "data source": "https://www.bricklink.com/v2/catalog/catalogitem.page?P=56904c02#T=C",
                                                            "diameter [mm]": 43.2
                                                        },
                                                        "layer": "kpi-COMPONENT"
                                                    }
                                                },
                                                {
                                                    "component": {
                                                        "uuid": "kpi-d1c7b4ea-b1bf-4988-8544-f7f26e70d7f4",
                                                        "properties": {
                                                            "label": "bush front left",
                                                            "item number": 3713,
                                                            "item description": "Technic Bush",
                                                            "category": "frame",
                                                            "price [Euro]": 0.01,
                                                            "mass [g]": 0.14,
                                                            "delivery time [days]": 3,
                                                            "data source": "https://www.bricklink.com/v2/catalog/catalogitem.page?P=3713&name=Technic%20Bush&category=%5BTechnic%5D#T=S&O={%22iconly%22:0}",
                                                            "dimension [studs]": 1
                                                        },
                                                        "layer": "kpi-COMPONENT"
                                                    }
                                                }
                                            ],
                                            "assemblies": []
                                        }
                                    },
                                    {
                                        "assembly": {
                                            "uuid": "kpi-9ec50fb2-a45f-4b25-a4cd-2aecbb958ac9",
                                            "properties": {
                                                "label": "front wheel right assembly"
                                            },
                                            "layer": "kpi-SUBASSEMBLY",
                                            "components": [
                                                {
                                                    "component": {
                                                        "uuid": "kpi-69cf7cec-e639-47f3-96ff-8c2265a822f2",
                                                        "properties": {
                                                            "label": "front wheel left",
                                                            "item number": "56904c02",
                                                            "item description": "wheel 43,2",
                                                            "category": "wheel",
                                                            "related items": 30699,
                                                            "price [Euro]": 0.11,
                                                            "mass [g]": 13.0,
                                                            "delivery time [days]": 5,
                                                            "data source": "https://www.bricklink.com/v2/catalog/catalogitem.page?P=56904c02#T=C",
                                                            "diameter [mm]": 43.2
                                                        },
                                                        "layer": "kpi-COMPONENT"
                                                    }
                                                },
                                                {
                                                    "component": {
                                                        "uuid": "kpi-0d862f27-f936-4ede-b1fb-50167d4e7937",
                                                        "properties": {
                                                            "label": "bush front right",
                                                            "item number": 3713,
                                                            "item description": "Technic Bush",
                                                            "category": "frame",
                                                            "price [Euro]": 0.01,
                                                            "mass [g]": 0.14,
                                                            "delivery time [days]": 3,
                                                            "data source": "https://www.bricklink.com/v2/catalog/catalogitem.page?P=3713&name=Technic%20Bush&category=%5BTechnic%5D#T=S&O={%22iconly%22:0}",
                                                            "dimension [studs]": 1
                                                        },
                                                        "layer": "kpi-COMPONENT"
                                                    }
                                                }
                                            ],
                                            "assemblies": []
                                        }
                                    }
                                ]
                            }
                        },
                        {
                            "assembly": {
                                "uuid": "kpi-a65dfd1e-5458-470e-84fe-ecabe3584212",
                                "properties": {
                                    "label": "back wheel right assembly"
                                },
                                "layer": "kpi-SUBASSEMBLY",
                                "components": [
                                    {
                                        "component": {
                                            "uuid": "kpi-f511aee5-529c-4400-bf82-706d33d9ac37",
                                            "properties": {
                                                "label": "back wheel right",
                                                "item number": "3482c01",
                                                "item description": "wheel 24",
                                                "category": "wheel",
                                                "related items": 3483,
                                                "price [Euro]": 0.01,
                                                "mass [g]": 3.0,
                                                "delivery time [days]": 5,
                                                "data source": "https://www.bricklink.com/v2/catalog/catalogitem.page?P=3482c01#T=C",
                                                "diameter [mm]": 24.0
                                            },
                                            "layer": "kpi-COMPONENT"
                                        }
                                    },
                                    {
                                        "component": {
                                            "uuid": "kpi-8c402915-d996-40b0-b9bc-265c10cbafb4",
                                            "properties": {
                                                "label": "axle pin right",
                                                "item number": 3749,
                                                "item description": "Technic, Axle 1L with Pin without Friction Ridges",
                                                "category": "frame",
                                                "price [Euro]": 0.01,
                                                "mass [g]": 0.22,
                                                "delivery time [days]": 5,
                                                "data source": "https://www.bricklink.com/v2/catalog/catalogitem.page?P=3749&name=Technic,%20Axle%20%201L%20with%20Pin%20without%20Friction%20Ridges&category=%5BTechnic,%20Axle%5D#T=S&O={%22iconly%22:0}",
                                                "dimension [studs]": "0,75 x 2 x 0,55"
                                            },
                                            "layer": "kpi-COMPONENT"
                                        }
                                    }
                                ],
                                "assemblies": []
                            }
                        },
                        {
                            "assembly": {
                                "uuid": "kpi-979acea1-a724-4279-a5ca-ad94f2d479cd",
                                "properties": {
                                    "label": "back wheel left assembly"
                                },
                                "layer": "kpi-SUBASSEMBLY",
                                "components": [
                                    {
                                        "component": {
                                            "uuid": "kpi-20d1c1fc-2fac-4f06-b526-b5f76e2f68f0",
                                            "properties": {
                                                "label": "back wheel left",
                                                "item number": "3482c01",
                                                "item description": "wheel 24",
                                                "category": "wheel",
                                                "related items": 3483,
                                                "price [Euro]": 0.01,
                                                "mass [g]": 3.0,
                                                "delivery time [days]": 5,
                                                "data source": "https://www.bricklink.com/v2/catalog/catalogitem.page?P=3482c01#T=C",
                                                "diameter [mm]": 24.0
                                            },
                                            "layer": "kpi-COMPONENT"
                                        }
                                    },
                                    {
                                        "component": {
                                            "uuid": "kpi-2569b7fa-4c33-4ceb-b4f2-e9054e4edad3",
                                            "properties": {
                                                "label": "axle pin left",
                                                "item number": 3749,
                                                "item description": "Technic, Axle 1L with Pin without Friction Ridges",
                                                "category": "frame",
                                                "price [Euro]": 0.01,
                                                "mass [g]": 0.22,
                                                "delivery time [days]": 5,
                                                "data source": "https://www.bricklink.com/v2/catalog/catalogitem.page?P=3749&name=Technic,%20Axle%20%201L%20with%20Pin%20without%20Friction%20Ridges&category=%5BTechnic,%20Axle%5D#T=S&O={%22iconly%22:0}",
                                                "dimension [studs]": "0,75 x 2 x 0,55"
                                            },
                                            "layer": "kpi-COMPONENT"
                                        }
                                    }
                                ],
                                "assemblies": []
                            }
                        }
                    ]
                }
            }
        ]
    }
}