{
    "4265cc01":{
        "item number":"4265cc01",
        "item description":"wheel 14",
        "category":"wheel",
        "related items":59895,
        "price [Euro]":0.02,
        "mass [g]":0.5,
        "delivery time [days]":5,
        "data source":"https://www.bricklink.com/v2/catalog/catalogitem.page?P=4265cc01#T=C",
        "diameter [mm]":14.0
    },
    "3482c01":{
        "item number":"3482c01",
        "item description":"wheel 24",
        "category":"wheel",
        "related items":3483,
        "price [Euro]":0.01,
        "mass [g]":3.0,
        "delivery time [days]":5,
        "data source":"https://www.bricklink.com/v2/catalog/catalogitem.page?P=3482c01#T=C",
        "diameter [mm]":24.0
    },
    "56904c02":{
        "item number":"56904c02",
        "item description":"wheel 43,2",
        "category":"wheel",
        "related items":30699,
        "price [Euro]":0.11,
        "mass [g]":13.0,
        "delivery time [days]":5,
        "data source":"https://www.bricklink.com/v2/catalog/catalogitem.page?P=56904c02#T=C",
        "diameter [mm]":43.2
    },
    "41896c04":{
        "item number":"41896c04",
        "item description":"wheel 56",
        "category":"wheel",
        "related items":41897,
        "price [Euro]":0.45,
        "mass [g]":23.0,
        "delivery time [days]":5,
        "data source":"https://www.bricklink.com/v2/catalog/catalogitem.page?P=41896c04#T=C",
        "diameter [mm]":56.0
    },
    "2903c02":{
        "item number":"2903c02",
        "item description":"wheel 81,6",
        "category":"wheel",
        "related items":2902,
        "price [Euro]":1.31,
        "mass [g]":30.0,
        "delivery time [days]":5,
        "data source":"https://www.bricklink.com/v2/catalog/catalogitem.page?P=2903c02#T=C",
        "diameter [mm]":81.6
    },
    "88517c01":{
        "item number":"88517c01",
        "item description":"wheel 100,6",
        "category":"wheel",
        "related items":11957,
        "price [Euro]":1.25,
        "mass [g]":40.0,
        "delivery time [days]":5,
        "data source":"https://www.bricklink.com/v2/catalog/catalogitem.page?P=88517c02#T=C",
        "diameter [mm]":100.6
    }
}