{
	"JSON": {
		"ID": "1ee8238b-1bad-683f-a789-ab02cfec093d",
		"label": "setup_testrig_3",
		"comment": "UUID6 is used"
	},
	"setup": {
		"1ee4d7f7-565f-6f82-8db2-2cf8a3c4cb18": {
            "type": "group",
			"name": "group_info",
            "comment": ""
        },
		"1ee823cd-7650-61c2-9b01-d4744d892e2a": {
            "type": "instrument",
			"name": "raspberry_pi",
            "comment": ""
        },
		"1ee823b5-5d9b-6f24-9817-906ef09da71d": {
            "type": "instrument",
			"name": "motor_controller",
            "comment": ""
        },
		"1ee8239a-489e-66bc-932e-2587341b8ad5": {
            "type": "actor",
			"name": "brushless_DC_motor",
            "comment": ""
        },
		"1ee823d5-1451-6df6-a364-c723014c91a1": {
            "type": "sensor",
			"name": "accelerometer",
            "range": {
                    "min": -4,
                    "max": 4,
                    "units": "standard_gravity"
            },
            "frequency": {
				    "value": 800,
				    "units": "Hertz"
			},
            "comment": ""
        },
		"1ee82404-096b-61ea-a426-5847f8250328": {
            "type": "part",
			"name": "disk_1",
            "comment": ""
        },
		"1ee823ec-9064-6977-8963-933103fbb222": {
            "type": "part",
			"name": "shaft",
            "comment": ""
        },
		"1ee82415-0fbe-652a-aea6-39cda52b5240": {
            "type": "part",
			"name": "touchdown_bearing_1",
            "comment": ""
        },
		"1ee823a3-c13f-68e5-b5c0-f853874e2380": {
            "type": "instrument",
			"name": "digital_analog_converter",
            "comment": ""
        }
	}
}