{
	"JSON": {
		"ID": "1ee82413-f38a-667d-a9fe-21a6ccce16a3",
		"label": "",
		"comment": "UUID6 is used"
	},
	"part": {
		"name": "touch-down_bearing_testrig_2",
		"distance to motor bearing": {
			"value": 500,
			"unit": "millimeter"
		}
	}
}