{
    "JSON": {
        "ID": "1eeaed50-f3e3-62da-8a45-904001581b7a",
        "label": "setup_speaker",
        "comment": ""
    },
    "setup": {
        "1ee846ef-4df0-632a-bfdb-ef2ea3181b39": {
            "type": "general",
            "name": "general_info",
            "comment": ""
        },
        "1ee846f1-b588-6d3c-9659-7c3266d530e8": {
            "type": "instrument",
            "name": "raspberry_pi",
            "comment": ""
        },
        "1ee847be-fddd-6ee4-892a-68c4555b0981": {
            "type": "sensor",
            "name": "accelerometer",
            "range": {
                "min": -2,
                "max": 2,
                "units": "standard_gravity"
            },
            "frequency": {
                "value": 800,
                "units": "Hertz"
            },
            "comment": ""
        },
        "1eeaed49-35bd-6865-857f-3dd00e7888bb": {
            "type": "probe",
            "name": "speaker",
            "comment": ""
        }
    }
}