{
    "group_info": {
        "UUIDs": [
            "1ee8303b-ad98-613f-b334-8a98771b729c"
        ],
        "names": [
            "group_info"
        ]
    },
    "instrument": {
        "UUIDs": [
            "1ee8304a-52b1-605c-9544-79319d9db5a2"
        ],
        "names": [
            "raspberry_pi"
        ]
    },
    "sensor": {
        "UUIDs": [
            "1ee82fbb-6c15-6d66-a1c4-6aa76f5388e6",
            "1ee82fbe-07c3-607a-9eae-f65c8a46c73a"
        ],
        "names": [
            "temperature_cup",
            "temperature_environment"
        ],
        "serials": [
            "3ce1045763bf",
            "3ce1045712e2"
        ]
    },
    "probe": {
        "UUIDs": [
            "1ee83056-8a4a-64f8-a316-949a4836d7b7"
        ],
        "names": [
            "probe_description"
        ]
    },
    "all": {
        "values": [
            "1ee8303b-ad98-613f-b334-8a98771b729c",
            "1ee8304a-52b1-605c-9544-79319d9db5a2",
            "1ee82fbb-6c15-6d66-a1c4-6aa76f5388e6",
            "1ee82fbe-07c3-607a-9eae-f65c8a46c73a",
            "1ee83056-8a4a-64f8-a316-949a4836d7b7"
        ],
        "names": [
            "group_info",
            "raspberry_pi",
            "temperature_cup",
            "temperature_environment",
            "probe_description"
        ]
    }
}