{
	"JSON": {
		"ID": "1ee8304a-52b1-605c-9544-79319d9db5a2",
		"label": "",
		"comment": "UUID6 is used"
	},
	"instrument": {
		"name": "raspberry_pi",
		"type": "single_board_computer",
		"manufacturer": "Raspberry Pi Foundation",
		"model": "Raspberry Pi 4 Model B Rev 1.5",
		"serial": "100000002542122c",
		"operating_system": "Raspberry Pi OS",
		"comment": "to get model and serial number put this code in the terminal:cat /proc/cpuinfo "
	}
}