{
	"JSON": {
		"ID": "1ee82404-096b-61ea-a426-5847f8250328",
		"label": "",
		"comment": "UUID6 is used"
	},
	"part": {
		"name": "disk_testrig_3",
		"mass": {
			"value": 950,
			"unit": "gramm"
		},
		"material": "S235",
		"young's modulus": {
			"value": 210000,
			"unit": "N/mm**2"
		},
		"dimensions": {
			"thickness": {
				"value": 15,
				"unit": "millimeter"
			},
			"diameter": {
				"value": 99,
				"unit": "millimeter"
			}
		}
	}
}