{
    "JSON": {
        "ID": "1ee520ed-7973-641c-9b1b-f5c7e82ff3f3",
        "label": "setup_iPhone",
        "comment": "UUID6 is used"
    },
    "setup": {
        "1ee846ef-4df0-632a-bfdb-ef2ea3181b39": {
            "type": "general",
            "name": "general_info",
            "comment": ""
        },
        "1ee846f1-b588-6d3c-9659-7c3266d530e8": {
            "type": "instrument",
            "name": "raspberry_pi",
            "comment": ""
        },
        "1ee847be-fddd-6ee4-892a-68c4555b0981": {
            "type": "sensor",
            "name": "accelerometer",
            "range": {
                    "min": -2,
                    "max": 2,
                    "units": "standard_gravity"
            },
            "frequency": {
				    "value": 800,
				    "units": "Hertz"
			},
            "comment": ""
        }
    }
}
