{
	"JSON": {
		"ID": "1ee846ef-4df0-632a-bfdb-ef2ea3181b39",
		"label": "",
		"comment": "UUID6 is used"
	},
	"general": {
		"researcher": "ValentinKaemmerer",
		"experiment": "home_experiment_lavalrotor"
	}
}