{
	"JSON": {
		"ID": "1ee84a1e-34cf-614f-b928-4584c3378061",
		"label": "",
		"comment": "UUID6 is used"
	},
	"group": {
		"number": "45",
		"author": "Valentin Kämmerer",
		"experiment": "Kalorimetrie (Küchentisch)"
	}
}