{
	"JSON": {
		"ID": "1ee84c6c-6e38-68d6-b11c-e38f7bac55e2",
		"label": "",
		"comment": "UUID6 is used"
	},
    "comment": "Setup für den Versuch -thermische Verluste-",
    "info": "List below ALL components, you used in your experiment. By using the UUID there is no possibility to mix something up.",
	"setup": {
		"1ee84a1e-34cf-614f-b928-4584c3378061": {
            "type": "group_info",
			"name": "group_info",
            "comment": ""
        },
		"1ee84a20-9275-6f20-b74f-db8e14524384": {
            "type": "instrument",
			"name": "raspberry_pi",
            "comment": ""
        },
		"1ee848b5-b8fc-62e0-bc48-7ff7c050d4a5": {
            "type": "sensor",
			"name": "temperature_hot_drink",
            "comment": "Misst die Temperatur des heißen Getränks (Sensor 1)"
        },
		"1ee84a26-3c47-601b-beb0-45fe2c4c755b": {
            "type": "probe",
			"name": "probe_description",
            "comment": ""
        },
		"1ee848b7-3be3-6e18-a3b0-618ddbcb3962": {
			"type": "sensor",
			"name": "temperature_ambient",
			"comment": "Misst die Temperatur der Umgebung (Sensor 2)"
		}
	}
}