{
	"JSON": {
		"ID": "1ee84a26-3c47-601b-beb0-45fe2c4c755b",
		"label": "",
		"comment": "UUID6 is used"
	},
	"probe": {
		"metadata": "define your own metadata here",
		"info": "think about all necessary things you should write down, that someone else can understand what you were doing"
	}
}