{
	"JSON": {
		"ID": "1ee84bba-ab20-6fbf-8df3-73366f7ac040",
		"label": "",
		"comment": "UUID6 is used"
	},
    "comment": "Setup für den Versuch -Wärmekapazität eines Behälters-",
    "info": "List below ALL components, you used in your experiment. By using the UUID there is no possibility to mix something up.",
	"setup": {
		"1ee84a1e-34cf-614f-b928-4584c3378061": {
            "type": "group_info",
			"name": "group_info",
            "comment": ""
        },
		"1ee84a20-9275-6f20-b74f-db8e14524384": {
            "type": "instrument",
			"name": "raspberry_pi",
            "comment": ""
        },
		"1ee848b5-b8fc-62e0-bc48-7ff7c050d4a5": {
            "type": "sensor",
			"name": "temperature_warm_water",
            "comment": "Misst die Temperatur des Behälters mit dem warmen Wasser (Sensor 1)"
        },
		"1ee84a23-64ae-6af1-ad41-f5b5c0cb8b85": {
            "type": "probe",
			"name": "probe_description",
            "comment": "Enthält die Massen des verwendeten Wassers der beiden Behälter"
        },
		"1ee848b7-3be3-6e18-a3b0-618ddbcb3962": {
			"type": "sensor",
			"name": "temperature_cold_water",
			"comment": "Misst die Temperatur des Behälters mit dem kalten Wasser (Sensor 2)"
		}
	}
}