digraph G {
node [shape=box];
"world" [label="world"];
"arm_pedestal_link" [label="arm_pedestal_link"];
"base_link" [label="base_link"];
"base" [label="base"];
"shoulder_link" [label="shoulder_link"];
"upper_arm_link" [label="upper_arm_link"];
"forearm_link" [label="forearm_link"];
"wrist_1_link" [label="wrist_1_link"];
"wrist_2_link" [label="wrist_2_link"];
"wrist_3_link" [label="wrist_3_link"];
"ee_link" [label="ee_link"];
"tool0" [label="tool0"];
"hand_hand" [label="hand_hand"];
"hand_leftfinger" [label="hand_leftfinger"];
"hand_rightfinger" [label="hand_rightfinger"];
node [shape=ellipse, color=blue, fontcolor=blue];
"world" -> "arm_pedestal_joint" [label="xyz: 0 0 -0.1 \nrpy: 0 -0 0"]
"arm_pedestal_joint" -> "arm_pedestal_link"
"world" -> "world_joint" [label="xyz: 0 0 0 \nrpy: 0 -0 0"]
"world_joint" -> "base_link"
"base_link" -> "base_link-base_fixed_joint" [label="xyz: 0 0 0 \nrpy: 0 0 -3.14159"]
"base_link-base_fixed_joint" -> "base"
"base_link" -> "shoulder_pan_joint" [label="xyz: 0 0 0.1273 \nrpy: 0 -0 0"]
"shoulder_pan_joint" -> "shoulder_link"
"shoulder_link" -> "shoulder_lift_joint" [label="xyz: 0 0.220941 0 \nrpy: 0 -0 0"]
"shoulder_lift_joint" -> "upper_arm_link"
"upper_arm_link" -> "elbow_joint" [label="xyz: 0 -0.1719 0.612 \nrpy: 0 -0 0"]
"elbow_joint" -> "forearm_link"
"forearm_link" -> "wrist_1_joint" [label="xyz: 0 0 0.5723 \nrpy: 0 1.5708 -0"]
"wrist_1_joint" -> "wrist_1_link"
"wrist_1_link" -> "wrist_2_joint" [label="xyz: 0 0.1149 0 \nrpy: 0 -0 0"]
"wrist_2_joint" -> "wrist_2_link"
"wrist_2_link" -> "wrist_3_joint" [label="xyz: 0 0 0.1157 \nrpy: 0 -0 0"]
"wrist_3_joint" -> "wrist_3_link"
"wrist_3_link" -> "ee_fixed_joint" [label="xyz: 0 0.0922 0 \nrpy: 0 -0 1.5708"]
"ee_fixed_joint" -> "ee_link"
"wrist_3_link" -> "wrist_3_link-tool0_fixed_joint" [label="xyz: 0 0.0922 0 \nrpy: -1.5708 0 0"]
"wrist_3_link-tool0_fixed_joint" -> "tool0"
"tool0" -> "hand_to_arm" [label="xyz: 0 0 0 \nrpy: 0 0 -0.785398"]
"hand_to_arm" -> "hand_hand"
"hand_hand" -> "hand_joint_finger_joint1" [label="xyz: 0 0 0.0584 \nrpy: 0 -0 0"]
"hand_joint_finger_joint1" -> "hand_leftfinger"
"hand_hand" -> "hand_joint_finger_joint2" [label="xyz: 0 0 0.0584 \nrpy: 0 -0 0"]
"hand_joint_finger_joint2" -> "hand_rightfinger"
}
