Symlinking /home/vaibhav/Workspace/ur10_gazebo/devel/lib/ur_simulation_main/pick_place_tutorial
Linked: (/home/vaibhav/Workspace/ur10_gazebo/devel/.private/ur_simulation_main/lib/ur_simulation_main/parser, /home/vaibhav/Workspace/ur10_gazebo/devel/lib/ur_simulation_main/parser)
Linked: (/home/vaibhav/Workspace/ur10_gazebo/devel/.private/ur_simulation_main/lib/pkgconfig/ur_simulation_main.pc, /home/vaibhav/Workspace/ur10_gazebo/devel/lib/pkgconfig/ur_simulation_main.pc)
Linked: (/home/vaibhav/Workspace/ur10_gazebo/devel/.private/ur_simulation_main/share/ur_simulation_main/cmake/ur_simulation_mainConfig.cmake, /home/vaibhav/Workspace/ur10_gazebo/devel/share/ur_simulation_main/cmake/ur_simulation_mainConfig.cmake)
Linked: (/home/vaibhav/Workspace/ur10_gazebo/devel/.private/ur_simulation_main/share/ur_simulation_main/cmake/ur_simulation_mainConfig-version.cmake, /home/vaibhav/Workspace/ur10_gazebo/devel/share/ur_simulation_main/cmake/ur_simulation_mainConfig-version.cmake)
