[31m[1mCMake Error[0m at /home/vaibhav/Workspace/ur10_gazebo/src/ur_simulation_main/CMakeLists.txt:44 (target_link_libraries):
  Cannot specify link libraries for target "parser" which is not built by
  this project.


make: *** [Makefile:574: cmake_check_build_system] Error 1
