<?xml version="1.0" encoding="utf-8"?>
<robot xmlns:xacro="http://www.ros.org/wiki/xacro" name="ur10_hand">
  <xacro:property name="joint_limited" value="true" />
  <xacro:unless value="${joint_limited}">
    <xacro:include filename="$(find ur_description)/urdf/ur10_robot.urdf.xacro"/>
  </xacro:unless>
  <xacro:if value="${joint_limited}">
    <xacro:include filename="$(find ur_description)/urdf/ur10_joint_limited_robot.urdf.xacro"/>
  </xacro:if> 
  <xacro:include filename="$(find ur_simulation_main)/urdf/hand/hand.urdf.xacro"/>
  <xacro:hand_urdf prefix="" joint_prefix="" rpy="0 0 ${-pi/4}" connected_to="tool0" xyz="0 0 0"/>
  <xacro:include filename="$(find ur_simulation_main)/urdf/v2_transmission_hw.xacro"/>
</robot>
 
