MASS_SPECTROMETRY
	META_NAME	FRAGMENT	WEIGHT	VALUE	DEVIATION
	ALA	2,3	0	0.760757531053152	0.0283597993725781
			1	0.0513077534637702	0.0104224251026869
			2	0.187934715483078	0.0222507273909279

	ALA	2,3	0	0.845596660788008	0.0283683115396253
			1	0.0242444954985135	0.00825160426555096
			2	0.130158843713478	0.0231359714260288

	ALA	1,2,3	0	0.834008537496086	0.0203777862372911
			1	0.0301514627085567	0.00989201787487861
			2	0.0264284453810324	0.0070652831375312
			3	0.109411554414325	0.0176173245248012

	GLY	2	0	0.842749723747963	0.00915148382129867
			1	0.157250276252037	0.0091514838212987

	GLY	2	0	0.863447247764621	0.0102178102099436
			1	0.136552752235379	0.0102178102099435

	GLY	1,2	0	0.827584337462441	0.0164419026474216
			1	0.0774832996414279	0.00844579504362192
			2	0.0949323628961312	0.0124177555788275

	GLY	1,2	0	0.83838590252363	0.0230545398747978
			1	0.0730281970335433	0.0119286701067832
			2	0.0885859004428269	0.0150847491917276

	VAL	2,3,4,5	0	0.68860239378883	0.0381471751831716
			1	0.0588036366937183	0.0141499340364943
			2	0.204874068728341	0.0233285293323232
			3	0.0188585489232542	0.00427403552039857
			4	0.0288613518658566	0.00782249301097643

	VAL	2,3,4,5	0	0.743827718184979	0.0286765308494092
			1	0.0430691449138841	0.0107480608016728
			2	0.182763430137259	0.0167085642351535
			3	0.00430014074160089	0.00429497446411621
			4	0.0260395660222771	0.00813437351815399

	VAL	1,2,3,4,5	0	0.732157786003433	0.0270713668450408
			1	0.0458565501427841	0.00903450888069438
			2	0.112582453156163	0.0106160956214263
			3	0.0813453442426462	0.0108101660500052
			4	0.00465712614092224	0.00422731664240949
			5	0.0234007403140508	0.00739091855890211

	VAL	1,2	0	0.834652597180826	0.0133934083223967
			1	0.0487057845405869	0.00511099266876728
			2	0.116641618278588	0.0127284826777083

	VAL	1,2,3,4,5	0	0.746182518929621	0.0171519254447681
			1	0.0473009739735209	0.00626201592524636
			2	0.108120499374376	0.00782403781256604
			3	0.0732447940590766	0.00916931943035462
			4	0.00560910459303481	0.0037923778643483
			5	0.0195421090703707	0.00545651137248087

	LEU	2,3,4,5,6	0	0.587883815069448	0.0320508591833561
			1	0.149839392896847	0.0185149235072366
			2	0.195873896894713	0.0153120569806535
			3	0.036586073932013	0.00679723464846965
			4	0.0229786998702644	0.00504485326355578
			5	0.00683812133671443	0.00392186883919503

	LEU	2,3,4,5,6	0	0.695910770843159	0.0298727908534353
			1	0.108838475002994	0.0126100043999846
			2	0.143409130745193	0.0125926438733796
			3	0.0302414884141958	0.00826184499630299
			4	0.0172613866648236	0.00609914257280806
			5	0.00433874832963551	0.00409957257130953

	LEU	1,2,3,4,5,6	0	0.695421199893247	0.0364815723702377
			1	0.0513139434181471	0.0125883844924371
			2	0.201649716244919	0.0224340876405603
			3	0.00947021756232746	0.00520048399394637
			4	0.0373552462909766	0.0088601342075417
			5	0.000387397349048579	0.00282065842484627
			6	0.00440227924133426	0.00319723348392863

	ILE	2,3,4,5,6	0	0.652019692894488	0.0431206575102807
			1	0.105408746537026	0.0202068149283266
			2	0.169246309150265	0.0196870192398688
			3	0.0537959647324592	0.00771593837267407
			4	0.0117715667589697	0.00424447344494847
			5	0.00775771992679262	0.00352717755906372

	ILE	2,3,4,5,6	0	0.693339569161785	0.027185855922291
			1	0.0888445070472236	0.00990058274328033
			2	0.151685472492556	0.0142041761359761
			3	0.0492617772855355	0.00758722665513895
			4	0.0099815628872877	0.00451020926581462
			5	0.00688711112561146	0.00366880062913559

	ILE	1,2,3,4,5,6	0	0.685309142195773	0.0186792675860868
			1	0.0913845990484626	0.00553140449480292
			2	0.13162080418499	0.0114733781110868
			3	0.0615354847348684	0.00744577424449335
			4	0.0198544316982779	0.00484372890059782
			5	0.00809042465095111	0.00345037947207837
			6	0.00220511348667724	0.002897530843734

	PRO	2,3,4,5	0	0.78000840917255	0.0376986702201646
			1	0.0609010992314588	0.0185602891076224
			2	0.138217452151469	0.0187125132690094
			3	0.00751394585372795	0.00425862725014491
			4	0.0133590935907933	0.00465656917966173

	PRO	2,3,4,5	0	0.794577719901898	0.0179579696566408
			1	0.0560879308498988	0.00790225641711029
			2	0.13026839843114	0.011109555341757
			3	0.00676605214566661	0.00406168005748242
			4	0.0122998986713965	0.00403877036450101

	PRO	1,2,3,4,5	0	0.737461546161138	0.0279081656700038
			1	0.051988166865594	0.00919524863459602
			2	0.110547165710462	0.0127070602211412
			3	0.0340700381802474	0.00497349595272882
			4	0.0600458357156821	0.0307684533492928
			5	0.00588724736687601	0.00337760059309987

	PRO	1,2	0	0.961550725578697	0.0268230604644974
			1	0.00217433272896504	0.0082527436683499
			2	0.0362749416923383	0.0235425599748078

	PRO	1,2,3,4,5	0	0.757500982626084	0.0145254192149437
			1	0.0502660250542653	0.0103037438647343
			2	0.10823873747402	0.0115193032374401
			3	0.0355186984398083	0.00455330059888052
			4	0.0427924307008021	0.0197497120947552
			5	0.00568312570501988	0.00355606337536257

	MET	2,3,4,5	0	0.713318049670058	0.0177427191381558
			1	0.147263150546315	0.0092701324098149
			2	0.0639591408594447	0.00718344903011855
			3	0.0676663772802656	0.00664269253322618
			4	0.00779328164391763	0.00344591006315598

	MET	2,3,4,5	0	0.714194279460649	0.0188340757206682
			1	0.146506268594573	0.0085626336269204
			2	0.0610972949396915	0.00695965115182966
			3	0.0678929363964277	0.00644238115422776
			4	0.0103092206086589	0.0068485230670292

	MET	1,2	0	0.543351281419509	0.0163002756743477
			1	0.380183544081389	0.0157374675483058
			2	0.0764651744991017	0.0169108309675719

	MET	1,2,3,4,5	0	0.682102908135534	0.0161617163061208
			1	0.163038046425333	0.00792774797144311
			2	0.0554029847774164	0.00741695813768022
			3	0.0645637522983036	0.00655109479368358
			4	0.0311018611732788	0.00517860516993931
			5	0.00379044719013411	0.00304758965973724

	MET	1,2,3,4,5	0	0.684482135083889	0.0127277464367966
			1	0.16501915238821	0.00706943040343455
			2	0.0537369409399677	0.0074132564404873
			3	0.0631557141100687	0.00703964905434768
			4	0.0289002025152054	0.00458054855744995
			5	0.00470585496265929	0.00398127671678034

	SER	2,3	0	0.822090552879804	0.0159287785564062
			1	0.0980703061980552	0.0102689601104605
			2	0.0798391409221409	0.0141717799478684

	SER	1,2	0	0.840043032820148	0.0128961154549091
			1	0.0585921723806422	0.00718571907371702
			2	0.10136479479921	0.0112064651411748

	SER	2,3	0	0.821284419565675	0.0125902100771943
			1	0.10057074804369	0.00691677541506111
			2	0.0781448323906349	0.0140541267520314

	SER	1,2,3	0	0.797541878910922	0.0114001161396067
			1	0.0865664193679343	0.00626907488095192
			2	0.0492179560452115	0.00508442467903895
			3	0.0666737456759318	0.0131904843070053

	SER	1,2,3	0	0.811891236462997	0.0164973839919286
			1	0.0823791214067406	0.00710217009540615
			2	0.0425175628882547	0.00587499295179629
			3	0.0632120792420078	0.0133624606913236

	THR	2,3,4	0	0.807822489476304	0.0163701904223901
			1	0.0796854195262114	0.00770126723274762
			2	0.0703465899003631	0.008267062524083
			3	0.0421455010971215	0.00643620835333613

	THR	1,2,3,4	0	0.781214007222725	0.0169388803469637
			1	0.0867687985211653	0.00747447253897756
			2	0.0570689000776032	0.00915145955947539
			3	0.0619616671454251	0.00892283460454405
			4	0.0129866270330815	0.00401486064189145

	THR	1,2,3,4	0	0.776214847149419	0.0154329587201429
			1	0.0908853854429102	0.00792005211764291
			2	0.0577905395641151	0.00821103450013065
			3	0.0627368699742206	0.00857895399221776
			4	0.012372357869335	0.00409210711895328

	PHE	2,3,4,5,6,7,8,9	0	0.614099760425116	0.0399025112972521
			1	0.0706490262555938	0.00588981390555598
			2	0.139810080378393	0.0101537556516525
			3	0.0643336910918818	0.00891399853665256
			4	0.0503770851240461	0.012135315190744
			5	0.024944192719674	0.00950781755239629
			6	0.0216390235637084	0.0102579545418471
			7	0.00527965768875123	0.00456304408386884
			8	0.00886748275283599	0.00593705598054874

	PHE	1,2	0	0.834004968899651	0.0293481213177096
			1	0.0498520562346894	0.0116722115456628
			2	0.116142974865659	0.0221470899787316

	PHE	2,3,4,5,6,7,8,9	0	0.614027579000415	0.0387040306975906
			1	0.0718996811270238	0.00609749440732209
			2	0.133912503656689	0.0100192621659862
			3	0.0628553237085318	0.00827792836348388
			4	0.0496807074552741	0.0118585521960093
			5	0.0275303604787938	0.0092443170069783
			6	0.0238210539887077	0.010138620635132
			7	0.00603567984537058	0.00470817260332654
			8	0.0102371107391947	0.00618581222290044

	PHE	1,2,3,4,5,6,7,8,9	0	0.605551081551091	0.0425885537848402
			1	0.0758592293953733	0.00708587344613699
			2	0.0853887446438808	0.00605720795863871
			3	0.108991521598742	0.0110309606103956
			4	0.0451276842477127	0.0108272597027532
			5	0.0278266913148988	0.0103909457391679
			6	0.0250194806502151	0.0111175966148292
			7	0.0114789204215935	0.00694314711849072
			8	0.00616671808793074	0.00510129229084982
			9	0.00858992808856251	0.00626657044213297

	PHE	1,2,3,4,5,6,7,8,9	0	0.630975089348111	0.0379222796088134
			1	0.0695876935438837	0.00862734512395175
			2	0.0770693762019925	0.00564364919890947
			3	0.101005670533219	0.00922493204028577
			4	0.04133783787388	0.00986023741019763
			5	0.0322387258066122	0.0112274449794128
			6	0.022462842832479	0.0102255781220863
			7	0.0118938829089506	0.00703767330827406
			8	0.0056316197768621	0.00493373264215201
			9	0.00779726117401014	0.00582376765939323

	ASP	1,2	0	0.907827792396857	0.0115264786178675
			1	0.0570689264033313	0.00734149434273737
			2	0.0351032811998118	0.00705580566832483

	ASP	2,3,4	0	0.884293034573425	0.0139905405268876
			1	0.0523574029220582	0.00874560926527318
			2	0.0361171233621542	0.00642754496653107
			3	0.0272324391423626	0.00463193547706581

	ASP	2,3,4	0	0.892989034441349	0.0118994980988971
			1	0.0538850044361501	0.00733393115331171
			2	0.0342891641161232	0.00567325275298369
			3	0.0188367970063778	0.00476134097645683

	ASP	1,2,3,4	0	0.869586777358968	0.0146188758575383
			1	0.0634338560438594	0.00785159353957634
			2	0.031505364311837	0.00666219687448141
			3	0.0296916036646791	0.00613003584152593
			4	0.00578239862065628	0.00338619176466488

	ASP	1,2,3,4	0	0.87587627504953	0.0166311379733979
			1	0.0627439923666581	0.00908065569929506
			2	0.0267973150659432	0.00712946018172317
			3	0.0286740743588695	0.0059595937313667
			4	0.00590834315899925	0.00347940474250336

	GLU	1,2	0	0.834590373424813	0.0128292017872716
			1	0.127947522370325	0.0100571148770129
			2	0.0374621042048624	0.00660202828195838

	GLU	2,3,4,5	0	0.796062245822075	0.0211279604523848
			1	0.064731901690082	0.0101859267984103
			2	0.121755024534294	0.0119520590856265
			3	0.00737391960320186	0.00442087239339291
			4	0.0100769083503477	0.00390091049106214

	GLU	2,3,4,5	0	0.807615514198067	0.0217969103616012
			1	0.0597567863668577	0.0111790286972281
			2	0.116711126717566	0.0108322476347051
			3	0.00673693512955477	0.00455448407712475
			4	0.00917963758795529	0.0037755586361227

	GLU	1,2,3,4,5	0	0.763944098387619	0.0222979443006373
			1	0.0756721340672974	0.00952584110320751
			2	0.112985987186345	0.0123127100879051
			3	0.0338276128141264	0.00556810229400507
			4	0.00840419031579293	0.00370712043330514
			5	0.00516597722881903	0.00300410823191195

	GLU	1,2,3,4,5	0	0.77828338927525	0.0189443364397869
			1	0.0735509514991105	0.00891863729311665
			2	0.10429895242414	0.00972680198203993
			3	0.0314012501131431	0.00547301735243594
			4	0.00789546488817733	0.00375934406229116
			5	0.0045699918001792	0.0030212729650957

	LYS	1,2	0	0.696026769640532	0.0147810076357827
			1	0.256499676178675	0.0121165417454233
			2	0.0474735541807929	0.00710908646114496

	LYS	2,3,4,5,6	0	0.684234111530266	0.0230016142089399
			1	0.0967366899560696	0.00988867673400694
			2	0.150483468172731	0.0118657782132801
			3	0.0479505910460519	0.00568820111542618
			4	0.0124819181678081	0.00407269313462015
			5	0.00811322112707339	0.00344340380347317

	LYS	2,3,4,5,6	0	0.682848418310104	0.0239247286058752
			1	0.10603383148251	0.0106239163894787
			2	0.147007533682075	0.0149101079517753
			3	0.0454744029855269	0.0063169364767997
			4	0.0157037599748444	0.00553348064745337
			5	0.00293205356493944	0.00697994695768892

	LYS	1,2,3,4,5,6	0	0.661577331126563	0.0214500558985921
			1	0.104866207305467	0.00832912158458727
			2	0.110225981883068	0.00886290028850749
			3	0.0899339855148188	0.00939521032392722
			4	0.0172340053022523	0.00420529266487785
			5	0.0112464362801402	0.00371213564662642
			6	0.0049160525876913	0.00308955071428724

	LYS	1,2,3,4,5,6	0	0.661134784206392	0.0219111357099994
			1	0.109414585069049	0.00736702512057788
			2	0.10646265716425	0.00861141541485905
			3	0.0869672771877177	0.00921561416040416
			4	0.017647591652485	0.00442041890565578
			5	0.011366573927943	0.00399578480621098
			6	0.00700653079216415	0.00318664410150178

	HIS3	1,2	0	0.862726970089152	0.014202991859809
			1	0.0217256248998695	0.00569282067819852
			2	0.115547405010978	0.0112615204544827

	HIS3	2,3,4,5,6	0	0.651414649148195	0.0215394521162346
			1	0.141350116140519	0.00788629191764667
			2	0.126338955189111	0.0116128094010141
			3	0.0416388991098499	0.00622555946758388
			4	0.0303765371610529	0.00724563479635788
			5	0.00888084325127298	0.00364825413614713

	HIS3	2,3,4,5,6	0	0.665859849282595	0.0232934386752482
			1	0.137672124913857	0.00771897822874534
			2	0.118511266763888	0.0112362851507071
			3	0.0389881680194046	0.00655572030652006
			4	0.0274953698303787	0.00861196966291523
			5	0.0114732211898777	0.00379926451719509

	HIS3	1,2,3,4,5,6	0	0.654195826694585	0.0228384574989048
			1	0.136840623224339	0.00779154057299805
			2	0.0794897122025877	0.00669341956650681
			3	0.072235333302639	0.00928747072670973
			4	0.021567776002627	0.00539772490370312
			5	0.0289056141148207	0.00765765988730193
			6	0.00676511445840138	0.00367605596298614

	HIS3	1,2,3,4,5,6	0	0.670417913477002	0.0223267050332066
			1	0.129757874833604	0.0087889081103311
			2	0.0740177803174902	0.00705142038486499
			3	0.0708421522902892	0.00849188230522683
			4	0.0200203948253065	0.00508654364141328
			5	0.0276617709732434	0.00687430163038963
			6	0.0072821132830654	0.0033625464048245

	TYR	1,2	0	0.792076740959868	0.0672229098510756
			1	0.0812193914199954	0.0413292052078409
			2	0.126703867620137	0.0286960647031628

	TYR	2,3,4,5,6,7,8,9	0	0.656101439180542	0.0261923198827153
			1	0.0599834978263114	0.00698349678409017
			2	0.133901060588372	0.0128044997056908
			3	0.0553586482164444	0.00738592058595462
			4	0.0451861218400788	0.00830950661810873
			5	0.0183322960262104	0.0052506493161159
			6	0.0188258059036376	0.00574511752794166
			7	0.00461410228315128	0.00335246189823644
			8	0.00769702813525226	0.00425975734465012

	TYR	2,3,4,5,6,7,8,9	0	0.643775882773911	0.0238636754959303
			1	0.057512524104098	0.00662773631776728
			2	0.123462654560791	0.0132322755748729
			3	0.0519216994551429	0.00728519642162347
			4	0.0558476568138427	0.00722245097936961
			5	0.0300062372362981	0.00477352208623113
			6	0.0205292275846854	0.00586283085043246
			7	0.00831708613528445	0.00356423261244792
			8	0.00862703133594689	0.00434039284519647

	TYR	1,2,3,4,5,6,7,8,9	0	0.658630338366356	0.0253914243331582
			1	0.0655124410125476	0.00743855454779327
			2	0.0775836852987589	0.00801937540465571
			3	0.0969852267120802	0.0123817394315334
			4	0.0385215077682741	0.00736528883387804
			5	0.0220698690793624	0.00544574059774849
			6	0.020265144735978	0.00561599010297675
			7	0.00858058236605764	0.00410336304063516
			8	0.00491589304927125	0.00340733836606329
			9	0.00693531161131387	0.00418885477087676

	TYR	1,2,3,4,5,6,7,8,9	0	0.664198833098515	0.0263515273677366
			1	0.0645282639604841	0.00786110519823436
			2	0.076562960354828	0.00775974855424688
			3	0.095228671164544	0.0119573718553007
			4	0.0354676919580536	0.00825597369886433
			5	0.0221425328947928	0.00542936252541612
			6	0.0198179506027804	0.0056922778537741
			7	0.00969259353608382	0.00379378948750749
			8	0.00526659189751533	0.00335428573166231
			9	0.00709391053240323	0.00413579104748359

