Processed Data
		Exp1
ala	232	0.529123296009109
	233	0.324996464470606
	234	0.145880239520285
	260	0.476427344662299
	261	0.325615577658747
	262	0
	263	0.197957077678954
asp	302	0.780942280407984
	303	0
	304	0.219057719592016
	316	0.341153932033085
	317	0.385411133445983
	318	0.223184698641932
	319	0.0502502358790006
	390	0.352437392013463
	391	0.390475538511395
	392	0.209848273160887
	393	0.047238796314254
	460	0.336737158695828
	461	0.369727579781559
	462	0.109755008882993
	463	0.142195562031381
	464	0.0415846906082395
glu	302	0.832375470146843
	303	0.066609557412531
	304	0.101014972440626
	330	0.271028559583739
	331	0.34662135582635
	332	0.283602309871706
	333	0.0810557290290222
	334	0.0176920456891831
	404	0.295050046867608
	405	0.339093846449213
	406	0.276855933056604
	407	0.0739349071436448
	408	0.0150652664829305
	432	0.160717443659368
	433	0.293468853754255
	434	0.303983890441988
	435	0.172744482261373
	436	0.0590908918599687
	437	0.0099944380230475
	474	0.242433883510224
	475	0.297143269413503
	476	0.311680147293957
	477	0.109717712503282
	478	0.0372371466449941
	479	0.00178784063404008
gly	218	0.802613397579021
	219	0.197386602420979
	246	0.795144374421
	247	0
	248	0.204855625579
	288	0.799162844567497
	289	0
	290	0.200837155432503
his3	302	0.609502416503078
	303	0.186548025100885
	304	0.203949558396036
	338	0.396022297333467
	339	0.330869710074957
	340	0.0675801691548628
	341	0.120605429819573
	342	0.0402113732846592
	343	0.0447110203324813
	412	0.401235637950206
	413	0.14636501491208
	414	0.0784484240788966
	415	0.110244743264331
	416	0.116716556553465
	417	0.146989623241022
	440	0.330117657924198
	441	0.321517344608292
	442	0.0865070226787096
	443	0.118253720598509
	444	0.0540078026560728
	445	0.0542096612749881
	446	0.0353867902592297
	482	0.348624466958487
	483	0.300998588117015
	484	0.106131288720085
	485	0.0971586089398727
	486	0.0646097658859368
	487	0.0551510076820225
	488	0.0273262736965813
ile	200	0.152609730532565
	201	0.296415869167144
	202	0.314106482928528
	203	0.175083329282854
	204	0.0551428291386856
	205	0.00664175895022329
	274	0.150762748581023
	275	0.292804982741306
	276	0.311008993315696
	277	0.176932852351544
	278	0.0598120903886856
	279	0.00867833262174539
	344	0.192020811887553
	345	0.305333877728462
	346	0.200775302115284
	347	0.122741824036764
	348	0.167368922068705
	349	0
	350	0.011759262163232
leu	200	0.117793367423998
	201	0.285516343044557
	202	0.326270944789719
	203	0.206784703628543
	204	0.0595674240574801
	205	0.00406721705570277
	274	0.130172801873317
	275	0.294817304530768
	276	0.323241689900518
	277	0.198910965599564
	278	0.0481922992658562
	279	0.00466493882997667
	344	0.138644370916309
	345	0.247638547417766
	346	0.30913004997621
	347	0.220514554509877
	348	0.067973033326567
	349	0.0160994438532701
	350	0
lys	302	0.716803626196574
	303	0.123384429832995
	304	0.159811943970431
	329	0.186406463083853
	330	0.28378198716776
	331	0.314564984842879
	332	0.162656475311558
	333	0.0525900895939504
	334	0
	403	0.156737258036056
	404	0.240367414800894
	405	0.26584725498258
	406	0.206832349371267
	407	0.104161868474177
	408	0.0260538543350274
	431	0.146227577624118
	432	0.243612387252458
	433	0.29655846791917
	434	0.197570097998081
	435	0.101222001017476
	436	0.00828555276322746
	437	0.00652391542546884
	473	0.127493563734046
	474	0.200970907855156
	475	0.26766337351437
	476	0.210622981039921
	477	0.124445359259862
	478	0.046273700705137
	479	0.0225301138915075
met	218	0.18173469461024
	219	0.372020079196724
	220	0.292714989757902
	221	0.129125393932715
	222	0.0244048425024194
	292	0.179297172311472
	293	0.373468228377089
	294	0.292522898492551
	295	0.130901364824789
	296	0.0238103359940982
	302	0.45050373849993
	303	0.4187591184574
	304	0.13073714304267
	320	0.180182490101843
	321	0.363753875140774
	322	0.23362919150032
	323	0.109802133684852
	324	0.0949524919198754
	325	0.0176798176523355
	362	0.195121355310671
	363	0.364688555938616
	364	0.219214601683626
	365	0.0960337906703927
	366	0.10102015424135
	367	0.0239215421553438
phe	234	0.15766945373606
	235	0.255229944953317
	236	0.248768587130366
	237	0.135828172446678
	238	0.0933770781831954
	239	0.0612669269631856
	240	0.0380239095702581
	241	0.00912312543002845
	242	0.000712801586911056
	302	0.790881521714537
	303	0
	304	0.209118478285463
	308	0.175051370145543
	309	0.252164969491582
	310	0.239550677013852
	311	0.138037996429257
	312	0.0904161487101883
	313	0.0616278535229467
	314	0.0357524120938863
	315	0.00705994071731071
	316	0.000338631875433708
	336	0.170669741692017
	337	0.246746806764306
	338	0.179319301855134
	339	0.158508540542484
	340	0.111223402307989
	341	0.0797284839145749
	342	0.0285894382943248
	343	0.0187800087587988
	344	0.00539260060536772
	345	0.00104167526500388
	378	0.162242829944658
	379	0.182961038503056
	380	0.153907787087658
	381	0.118003862277661
	382	0.113442918905426
	383	0.217695851211088
	384	0
	385	0.0350684702010712
	386	0.00706718694535679
	387	0.00961005492402445
pro	184	0.260201558103669
	185	0.356440555023055
	186	0.287278702486322
	187	0.0819570747444822
	188	0.014122109642471
	258	0.260954001904532
	259	0.355915602624063
	260	0.285661799434123
	261	0.0804695274690439
	262	0.0169990685682385
	286	0.260869259602848
	287	0.317800081299416
	288	0.277753192554115
	289	0.117062533007168
	290	0.0265149335364529
	291	0
	302	0.912538164731503
	303	0
	304	0.0874618352684976
	328	0.18088150538309
	329	0.310981269407933
	330	0.280511593745142
	331	0.157944182271827
	332	0.0623347614048414
	333	0.00734668778716546
ser	288	0.592937512591635
	289	0.339318063883097
	290	0.0677444235252677
	302	0.80094295827081
	303	0
	304	0.19905704172919
	362	0.630856693061145
	363	0.292346529599722
	364	0.0767967773391336
	390	0.521937162108508
	391	0.297186575849185
	392	0
	393	0.180876262042307
	432	0.541577623639387
	433	0.282460591336314
	434	0
	435	0.175961785024298
thr	376	0.344378162006627
	377	0.390419129433471
	378	0.226425985666725
	379	0.0387767228931762
	404	0.341516368588749
	405	0.37602770061821
	406	0.100930262305772
	407	0.145625888507156
	408	0.0358997799801128
	446	0.330728420504901
	447	0.374076312642636
	448	0.108478072988233
	449	0.139158718756557
	450	0.0475584751076729
tyr	302	0.789058608557502
	303	0
	304	0.210941391442497
	364	0.188575686038834
	365	0.243952194020533
	366	0.24082987834183
	367	0.132462640872662
	368	0.0888995926701205
	369	0.0631731236667788
	370	0.0321424071509835
	371	0.0074994637192653
	372	0.00246501351899305
	438	0.196531159551878
	439	0.239749567209258
	440	0.248802046912586
	441	0.11335993020538
	442	0.100631075373393
	443	0.0503698916676709
	444	0.0403201770629914
	445	0.00520221472348107
	446	0.00503393729336139
	466	0.171968380671061
	467	0.24025055030797
	468	0.185607268661447
	469	0.149331330729515
	470	0.108396682760086
	471	0.0840042802126636
	472	0.0292176619871658
	473	0.0224316446244011
	474	0.00354632130202099
	475	0.00524587874366904
	508	0.199744922850498
	509	0.206386094636238
	510	0.183847132213883
	511	0.164685414078071
	512	0.103583847405343
	513	0.0875782131038761
	514	0.0166492533822674
	515	0.0279461516999828
	516	0.0040782745952606
	517	0.00550069603457947
val	186	0.247686653493096
	187	0.344949216741247
	188	0.291190570962316
	189	0.114063021420041
	190	0.00211053738329961
	260	0.250542288974818
	261	0.346996865265455
	262	0.29640821254737
	263	0.0876681697587017
	264	0.0183844634536549
	288	0.243432368728728
	289	0.337891950926504
	290	0.206542033441728
	291	0.140543818424751
	292	0.0464520255462842
	293	0.025137802932004
	302	0.74141544355906
	303	0
	304	0.25858455644094
	330	0.273465499939572
	331	0.327285390405494
	332	0.200837059706586
	333	0.138031205162995
	334	0.0392029727093054
	335	0.0211778720760472
