Reaction_net,Flux_net
R1,0.719979397644002
R2,9.99999999473644e-08
R3,0.00500272789427473
R4,1.00000242642118e-07
R5,0.0797393302940139
R6,0.395734437893287
R7,9.99846410665306e-08
R8,0.395734537877927
R9,-0.0507385791088515
R10,0.0331615304627561
R11,0.0331615304639854
R12,0.495596052398469
R13,1.03644623261709
R14,0.978072160288993
R15,0.978072160288993
R16,0.927725456821392
R17,0.00146013889684588
R18,1.00000242642118e-07
R19,0.664743091333337
R20,0.0945756975490388
R21,0.570167393783777
R22,0.10627273295214
R23,-0.0405496906096232
R24,-0.0657230423429709
R25,-0.0657230423429709
R26,0.0657230423429709
R27,0.0196928024567894
R28,0.227455276031663
R29,0.181154789716273
R30,9.99999999473644e-08
R31,9.99999999999482e-08
R32,0.184286246939517
R33,9.99986858368418e-08
R34,0.114271964250477
R35,0.114271964250477
R36,0.114271964250477
R37,0.0044704901963161
R38,0.00590038463847469
R39,0.0482372436717924
R40,0.0285444412150934
R41,0.0583740723281019
R42,0.0307079004881226
R43,4.35141793718072e-12
R44,0.126625151491812
R45,0.0857275230355299
R46,0.141932511359755
R47,0.483064717915915
R48,0.111198603605502
R49,0.016025231549234
R50,0.020238814051057
R51,0.141727752996279
R52,0.0214524219389395
R53,1.00002500214719e-07
R54,0.0307366225440685
R55,0.0432848554939441
R56,0.00313165722324419
R57,0.00142989444215859
R58,0.00357273345211614
R59,0.0248088688367796
R60,0.0276606471079754
R61,0.0173549933273758
R62,0.0214524219389395
R63,0.0124124450315111
R64,0.00951660838814793
R65,0.00324429831414134
R66,0.00897989730901837
R67,0.00819856669677266
R68,0.00411890161581857
R69,0.00842989288613551
R70,0.00468825478719728
R71,0.00374163809893823
R72,0.000137287204967204
R73,9.57924522688047e-05
R74,9.57924522688047e-05
R75,0.000137287204967204
R76,0.000137287204967204
R77,7.92573554807714e-06
R78,2.0780891985812e-05
R79,0.000105902003034673
R80,0.000163218602790889
R81,1.98787757445675e-05
R82,0.0011423328874992
R83,0.00418074628289848
R84,0.00418074628289848
R85,0.00418074628289848
R86,0.00418074628289848
R87,0.00139358209429949
R88,0.000696791047149747
R89,0.000668640898473665
R90,0.000477861858585967
R91,0.0384244376290261
R92,0.066574845298454
R93,0.0223726233792521
R94,0.648269924349504
R95,2.00503290558004
R96,0.941797316945039
R97,0.477902656112882
R98,0.463894660832157
R99,0.463894660832157
R100,0.463894660832157
R101,0.463894660832157
R102,0.477902656112875
R103,0.477902556160137
R104,0.463894660832157
R105,9.99527450668003e-08
R106,0.941797316945039
R107,0.0400530656066832
R108,0.0051750825360815
R109,0.000143530794529225
R110,0.000322184371873055
R111,0.000748674166917103
R112,0.00157086480679207
R113,0.0217209935720894
