          Factor 2 _0  Factor 2 _1  Factor 2 _2  Factor 2 _3  Factor 2 _4  \
Factor 1                                                                    
2                   0            2            0            0            1   
1                   1            0            0            2            0   
0                   1            0            2            0            0   
3                   1            0            1            0            1   
4                   0            1            0            1            1   

          Factor 3 _0  Factor 3 _1  Factor 3 _2  Factor 3 _3  Factor 3 _4  \
Factor 1                                                                    
2                   0            1            0            1            1   
1                   1            1            0            1            0   
0                   0            1            1            0            1   
3                   0            0            1            1            1   
4                   2            0            1            0            0   

          Factor 4 _0  Factor 4 _1  Factor 4 _2  Factor 4 _3  Factor 4 _4  \
Factor 1                                                                    
2                   0            1            1            0            1   
1                   1            0            1            1            0   
0                   0            1            1            0            1   
3                   1            1            0            0            1   
4                   1            0            0            2            0   

          Factor 5 _0  Factor 5 _1  Factor 5 _2  Factor 5 _3  Factor 5 _4  
Factor 1                                                                   
2                   1            1            0            1            0  
1                   0            0            1            1            1  
0                   0            2            0            0            1  
3                   2            0            0            1            0  
4                   0            0            2            0            1  
          Factor 1 _0  Factor 1 _1  Factor 1 _2  Factor 1 _3  Factor 1 _4  \
Factor 2                                                                    
1                   0            0            2            0            1   
3                   0            2            0            0            1   
0                   1            1            0            1            0   
4                   0            0            1            1            1   
2                   2            0            0            1            0   

          Factor 3 _0  Factor 3 _1  Factor 3 _2  Factor 3 _3  Factor 3 _4  \
Factor 2                                                                    
1                   0            1            1            0            1   
3                   2            0            0            1            0   
0                   0            2            0            0            1   
4                   1            0            1            1            0   
2                   0            0            1            1            1   

          Factor 4 _0  Factor 4 _1  Factor 4 _2  Factor 4 _3  Factor 4 _4  \
Factor 2                                                                    
1                   0            1            1            1            0   
3                   1            0            0            2            0   
0                   0            0            1            0            2   
4                   1            1            0            0            1   
2                   1            1            1            0            0   

          Factor 5 _0  Factor 5 _1  Factor 5 _2  Factor 5 _3  Factor 5 _4  
Factor 2                                                                   
1                   1            0            0            1            1  
3                   0            0            2            0            1  
0                   1            0            0            1            1  
4                   0            1            1            1            0  
2                   1            2            0            0            0  
          Factor 1 _0  Factor 1 _1  Factor 1 _2  Factor 1 _3  Factor 1 _4  \
Factor 3                                                                    
1                   1            1            1            0            0   
3                   0            1            1            1            0   
4                   1            0            1            1            0   
2                   1            0            0            1            1   
0                   0            1            0            0            2   

          Factor 2 _0  Factor 2 _1  Factor 2 _2  Factor 2 _3  Factor 2 _4  \
Factor 3                                                                    
1                   2            1            0            0            0   
3                   0            0            1            1            1   
4                   1            1            1            0            0   
2                   0            1            1            0            1   
0                   0            0            0            2            1   

          Factor 4 _0  Factor 4 _1  Factor 4 _2  Factor 4 _3  Factor 4 _4  \
Factor 3                                                                    
1                   0            0            2            0            1   
3                   2            0            0            0            1   
4                   0            1            1            0            1   
2                   0            2            0            1            0   
0                   1            0            0            2            0   

          Factor 5 _0  Factor 5 _1  Factor 5 _2  Factor 5 _3  Factor 5 _4  
Factor 3                                                                   
1                   0            0            0            2            1  
3                   1            1            1            0            0  
4                   2            1            0            0            0  
2                   0            1            0            1            1  
0                   0            0            2            0            1  
          Factor 1 _0  Factor 1 _1  Factor 1 _2  Factor 1 _3  Factor 1 _4  \
Factor 4                                                                    
2                   1            1            1            0            0   
0                   0            1            0            1            1   
1                   1            0            1            1            0   
4                   1            0            1            1            0   
3                   0            1            0            0            2   

          Factor 2 _0  Factor 2 _1  Factor 2 _2  Factor 2 _3  Factor 2 _4  \
Factor 4                                                                    
2                   1            1            1            0            0   
0                   0            0            1            1            1   
1                   0            1            1            0            1   
4                   2            0            0            0            1   
3                   0            1            0            2            0   

          Factor 3 _0  Factor 3 _1  Factor 3 _2  Factor 3 _3  Factor 3 _4  \
Factor 4                                                                    
2                   0            2            0            0            1   
0                   1            0            0            2            0   
1                   0            0            2            0            1   
4                   0            1            0            1            1   
3                   2            0            1            0            0   

          Factor 5 _0  Factor 5 _1  Factor 5 _2  Factor 5 _3  Factor 5 _4  
Factor 4                                                                   
2                   0            1            0            2            0  
0                   1            0            2            0            0  
1                   1            1            0            1            0  
4                   1            1            0            0            1  
3                   0            0            1            0            2  
          Factor 1 _0  Factor 1 _1  Factor 1 _2  Factor 1 _3  Factor 1 _4  \
Factor 5                                                                    
3                   0            1            1            1            0   
2                   0            1            0            0            2   
0                   0            0            1            2            0   
4                   1            1            0            0            1   
1                   2            0            1            0            0   

          Factor 2 _0  Factor 2 _1  Factor 2 _2  Factor 2 _3  Factor 2 _4  \
Factor 5                                                                    
3                   1            1            0            0            1   
2                   0            0            0            2            1   
0                   1            1            1            0            0   
4                   1            1            0            1            0   
1                   0            0            2            0            1   

          Factor 3 _0  Factor 3 _1  Factor 3 _2  Factor 3 _3  Factor 3 _4  \
Factor 5                                                                    
3                   0            2            1            0            0   
2                   2            0            0            1            0   
0                   0            0            0            1            2   
4                   1            1            1            0            0   
1                   0            0            1            1            1   

          Factor 4 _0  Factor 4 _1  Factor 4 _2  Factor 4 _3  Factor 4 _4  
Factor 5                                                                   
3                   0            1            2            0            0  
2                   2            0            0            1            0  
0                   1            1            0            0            1  
4                   0            0            0            2            1  
1                   0            1            1            0            1  