,Factor 1,Factor 2,Factor 3,Factor 4,Factor 5
Factor 1,1.0,0.0222,0.1778,-0.0778,0.0333
Factor 2,0.0222,1.0,0.0556,0.1778,0.0444
Factor 3,0.1778,0.0556,1.0,0.0444,0.0889
Factor 4,-0.0778,0.1778,0.0444,1.0,-0.0556
Factor 5,0.0333,0.0444,0.0889,-0.0556,1.0
