Average Data
		Exp_1	Exp_2	Exp_3
ala	158	0.764734986701534	0.760757531053152	0.812250836728692
	159	0.0461775364031687	0.0513077534637702	0.054174349505705
	160	0.189087476895297	0.187934715483078	0.133574813765603
	232	0.839935190598386	0.845596660788008	0.908196572613722
	233	0.026539271482504	0.0242444954985135	0.0209912545378942
	234	0.13352553791911	0.130158843713478	0.0708121728483839
	260	0.825279522600234	0.834008537496086	0.904346806492866
	261	0.0373704205859618	0.0301514627085567	0.0232044100647314
	262	0.0299260632571424	0.0264284453810324	0.0160096538234934
	263	0.107423993556661	0.109411554414325	0.0564391296189089
gly	144	0.846248759006493	0.842749723747963	0.89882005757999
	145	0.153751240993508	0.157250276252037	0.10117994242001
	218	0.865498838410429	0.863447247764621	0.91375902086325
	219	0.134501161589571	0.136552752235379	0.0862409791367503
	246	0.83604681505241	0.827584337462441	0.903233066697595
	247	0.0724677104365331	0.0774832996414279	0.0444988918390191
	248	0.0914854745110566	0.0949323628961312	0.0522680414633858
	288	0.852284016589859	0.83838590252363	0.913377412309011
	289	0.0643353440655653	0.0730281970335433	0.0394736101380912
	290	0.0833806393445756	0.0885859004428269	0.0471489775528983
val	186	0.714218300631189	0.68860239378883	0.788705697287087
	187	0.0460795820989052	0.0588036366937183	0.0571438169241318
	188	0.193649194694961	0.204874068728341	0.120767598864132
	189	0.0188439619411003	0.0188585489232542	0.017709197265684
	190	0.0272089606338451	0.0288613518658566	0.0156736896589655
	260	0.739658604840397	0.743827718184979	0.853788248598645
	261	0.045845646828329	0.0430691449138841	0.0289564419556096
	262	0.183568038525348	0.182763430137259	0.101323619667187
	263	0.00493942528113536	0.00430014074160089	0.00219576737857007
	264	0.0259882845247909	0.0260395660222771	0.0137359223999884
	288	0.723405209824659	0.732157786003433	0.84902537012759
	289	0.0515993372674449	0.0458565501427841	0.0282714054923132
	290	0.11686053939824	0.112582453156163	0.063442530621081
	291	0.080318953517862	0.0813453442426462	0.0446197441858832
	292	0.00538073525652045	0.00465712614092224	0.00243855598289645
	293	0.0224352247352736	0.0234007403140508	0.012202393590236
	302	0.829508563761505	0.834652597180826	0.904788577841025
	303	0.0535736587817938	0.0487057845405869	0.0312911942424876
	304	0.116917777456701	0.116641618278588	0.0639202279164876
	330	0.735809630929316	0.746182518929621	0.860142562252251
	331	0.0519067780630115	0.0473009739735209	0.0264872675437459
	332	0.112638756402597	0.108120499374376	0.0597859368227172
	333	0.0732093505670784	0.0732447940590766	0.0399108666651202
	334	0.00673477419432751	0.00560910459303481	0.00309245212301646
	335	0.0197007098436694	0.0195421090703707	0.0105809145931497
leu	200	0.594608586995994	0.587883815069448	0.7052987141529
	201	0.144593364655884	0.149839392896847	0.130570388799194
	202	0.194309569424297	0.195873896894713	0.127016830253516
	203	0.0370534419925609	0.036586073932013	0.0201555058925828
	204	0.0231039964676192	0.0229786998702644	0.0131070161487969
	205	0.00633104046364504	0.00683812133671443	0.00385154475301127
	274	0.69050467934465	0.695910770843159	0.82587743033043
	275	0.112620804744613	0.108838475002994	0.0654362207294202
	276	0.145581365666715	0.143409130745193	0.0809433118245304
	277	0.0302091674369188	0.0302414884141958	0.0160415224700346
	278	0.0172382111040422	0.0172613866648236	0.00918663762502195
	279	0.00384577170306139	0.00433874832963551	0.0025148770205628
	344	0.696624189412891	0.695421199893247	0.833531656650055
	345	0.0527998203985047	0.0513139434181471	0.0269035238470249
	346	0.200122986640577	0.201649716244919	0.110938218127299
	347	0.0100224258982914	0.00947021756232746	0.00513115504755516
	348	0.035899570799044	0.0373552462909766	0.0206997704629538
	349	0.000307569819635324	0.000387397349048579	0.000179327683173386
	350	0.0042234370310569	0.00440227924133426	0.00261634818193911
ile	200	0.683863504783645	0.652019692894488	0.788842661816951
	201	0.0897391106471785	0.105408746537026	0.0724029749637972
	202	0.160102039438287	0.169246309150265	0.0994562568578944
	203	0.0489343234688497	0.0537959647324592	0.0287914614666979
	204	0.0107028896206612	0.0117715667589697	0.00625417148301688
	205	0.0066581320413784	0.00775771992679262	0.00425247341164244
	274	0.695332873893154	0.693339569161785	0.826001951887763
	275	0.0905727454793219	0.0888445070472236	0.0541263533247988
	276	0.152305500034943	0.151685472492556	0.0841199925879638
	277	0.046415418924202	0.0492617772855355	0.0264805204930962
	278	0.00920858063129918	0.0099815628872877	0.00537209475650784
	279	0.00616488103707968	0.00688711112561146	0.00389908694986981
	344	0.686665333226217	0.685309142195773	0.826050693959371
	345	0.0928605574093563	0.0913845990484626	0.0508529155438961
	346	0.132041098017166	0.13162080418499	0.0716640868930663
	347	0.0597776163196179	0.0615354847348684	0.0342525032101703
	348	0.0190490490156346	0.0198544316982779	0.0112577734565894
	349	0.0076391726538927	0.00809042465095111	0.00464800024888499
	350	0.00196717335811556	0.00220511348667724	0.00127402668802168
pro	184	0.799642496753528	0.78000840917255	0.854457681524782
	185	0.0516961732459992	0.0609010992314588	0.0488546710176657
	186	0.130399928683515	0.138217452151469	0.08537358129645
	187	0.00668969609428382	0.00751394585372795	0.00379307459166349
	188	0.0115717052226738	0.0133590935907933	0.00752099156943872
	258	0.800065858999832	0.794577719901898	0.889298161300993
	259	0.0541522833668753	0.0560879308498988	0.0311741548831258
	260	0.127915974349674	0.13026839843114	0.0699393775380471
	261	0.00644135148557965	0.00676605214566661	0.00309516374803191
	262	0.0114245317980387	0.0122998986713965	0.00649314252980218
	286	0.763662113840223	0.737461546161138	0.849608628276995
	287	0.051414024186218	0.051988166865594	0.030676310891276
	288	0.109860376747063	0.110547165710462	0.0603323721083334
	289	0.0316024360437154	0.0340700381802474	0.0183657870089057
	290	0.0382125648348771	0.0600458357156821	0.0377433605510863
	291	0.00524848434790345	0.00588724736687601	0.00327354116340333
	302	0.490525864221138	0.961550725578697	0.872262912401359
	303	0	0.00217433272896504	0.000321297252941113
	304	0.0094741357788624	0.0362749416923383	0.016304679234589
	328	0.780940589769487	0.757500982626084	0.862178892114598
	329	0.0477002622030671	0.0502660250542653	0.0299029809681221
	330	0.108022122585303	0.10823873747402	0.0588590766721902
	331	0.0336021579535503	0.0355186984398083	0.0187118152902928
	332	0.0240747396656817	0.0427924307008021	0.027205042207238
	333	0.00566012782291081	0.00568312570501988	0.00314219274755893
met	218	0.722756194019163	0.713318049670058	0.829885865706581
	219	0.144829005445461	0.147263150546315	0.0842353551466319
	220	0.0632285486766458	0.0639591408594447	0.0414480879009732
	221	0.0626490280023531	0.0676663772802656	0.0402826491962959
	222	0.00653722385637723	0.00779328164391763	0.00414804204951774
	292	0.722303632710797	0.714194279460649	0.810806845192719
	293	0.142433831579047	0.146506268594573	0.0823399101252543
	294	0.0599984092462595	0.0610972949396915	0.0341697509074581
	295	0.0630496084480476	0.0678929363964277	0.0437694115836956
	296	0.0122145180158485	0.0103092206086589	0.0289140821908729
	302	0.584037572414617	0.543351281419509	0.668405300873094
	303	0.338732314951312	0.380183544081389	0.317483931208173
	304	0.077230112634071	0.0764651744991017	0.0141107679187339
	320	0.697719285198595	0.682102908135534	0.857608260915282
	321	0.159425928486548	0.163038046425333	0.0936420025695247
	322	0.0529660894797752	0.0554029847774164	0.0287464393754994
	323	0.0599430338810069	0.0645637522983036	0.00701986240177225
	324	0.0267532360553136	0.0311018611732788	0.0056199999544543
	325	0.00319242689876169	0.00379044719013411	0.00736343478346765
	362	0.703191897526389	0.684482135083889	0.804729737132216
	363	0.163153232255467	0.16501915238821	0.0862801606701797
	364	0.0496227365731131	0.0537369409399677	0.037691297320651
	365	0.0557504102153751	0.0631557141100687	0.0425812004858102
	366	0.0254518133314036	0.0289002025152054	0.0251964411124158
	367	0.00282991009825185	0.00470585496265929	0.00352116327872778
ser	288	0.826091601554244	0.822090552879804	0.897010095957392
	289	0.0961042330912775	0.0980703061980552	0.060557494668881
	290	0.0778041653544784	0.0798391409221409	0.0424324093737268
	302	0.842494717025039	0.840043032820148	0.907695848225021
	303	0.0586686113179092	0.0585921723806422	0.0350812947666915
	304	0.0988366716570517	0.10136479479921	0.0572228570082875
	362	0.82068886744246	0.821284419565675	0.896505912411091
	363	0.10123672845117	0.10057074804369	0.0614035409057581
	364	0.0780744041063691	0.0781448323906349	0.0420905466831507
	390	0.794144554733899	0.797541878910922	0.878079550594832
	391	0.08752670143974	0.0865664193679343	0.0565066988092985
	392	0.0523329521987732	0.0492179560452115	0.030372104781255
	393	0.0659957916275876	0.0666737456759318	0.0350416458146145
	432	0.8145941245639	0.811891236462997	0.892014720523778
	433	0.080638326108917	0.0823791214067406	0.0516567176164048
	434	0.0439067644943625	0.0425175628882547	0.0239402313655825
	435	0.0608607848328205	0.0632120792420078	0.0323883304942344
thr	376	0.812047555667163	0.807822489476304	0.893888123478926
	377	0.0794339181152543	0.0796854195262114	0.0457017734645834
	378	0.0682034803240915	0.0703465899003631	0.037629890835454
	379	0.0403150458934908	0.0421455010971215	0.0227802122210371
	404	0.797798674104528	0.781214007222725	0.873337730731522
	405	0.084433227184618	0.0867687985211653	0.0545227303178158
	406	0.0511555409924549	0.0570689000776032	0.030983666767531
	407	0.0557878557350843	0.0619616671454251	0.0341342701143419
	408	0.0108247019833149	0.0129866270330815	0.00702160206878887
	446	0.786736975964402	0.776214847149419	0.879035126960589
	447	0.0869795632509884	0.0908853854429102	0.0512949897016445
	448	0.0567227359327628	0.0577905395641151	0.0292543153505631
	449	0.0583611737857814	0.0627368699742206	0.033602867473915
	450	0.0111995510660658	0.012372357869335	0.00681270051328862
phe	234	0.623017542680073	0.614099760425116	0.786016008683777
	235	0.0717493667114639	0.0706490262555938	0.0455725873186801
	236	0.138333466058799	0.139810080378393	0.07883063328844
	237	0.0622069088113242	0.0643336910918818	0.0341881452568878
	238	0.0487910555069806	0.0503770851240461	0.0258891925040087
	239	0.0232965793782191	0.024944192719674	0.0120633018701691
	240	0.0201613527790015	0.0216390235637084	0.0104386308206899
	241	0.00465286666185376	0.00527965768875123	0.00267853895909038
	242	0.00779086141228405	0.00886748275283599	0.00432296129825718
	302	0.843239411073393	0.834004968899651	0.896214746248343
	303	0.0476088328917948	0.0498520562346894	0.0419832435227003
	304	0.109151756034813	0.116142974865659	0.0618020102289565
	308	0.617718537007372	0.614027579000415	0.787961116468724
	309	0.0732507772303556	0.0718996811270238	0.0451468286489435
	310	0.13340593498721	0.133912503656689	0.0740703393728564
	311	0.061822104191648	0.0628553237085318	0.0328883364507004
	312	0.0493628409472191	0.0496807074552741	0.0253884379605007
	313	0.0265949036872019	0.0275303604787938	0.0147020858256935
	314	0.0231799766736804	0.0238210539887077	0.0124037567210307
	315	0.00545614394384559	0.00603567984537058	0.0027468713615822
	316	0.00920878133146818	0.0102371107391947	0.00469222718996871
	336	0.609502458735487	0.605551081551091	0.784986989322278
	337	0.0782366719631489	0.0758592293953733	0.045516291285532
	338	0.0867651472710381	0.0853887446438808	0.0478873775717525
	339	0.106067543579734	0.108991521598742	0.0590756135286955
	340	0.0448840967156152	0.0451276842477127	0.0232050421529122
	341	0.0266927750534789	0.0278266913148988	0.0135538058349429
	342	0.0236827116533587	0.0250194806502151	0.0123955072206319
	343	0.010915778166315	0.0114789204215935	0.00610128305076444
	344	0.00588268634837904	0.00616671808793074	0.00314664662309257
	345	0.0073701305134452	0.00858992808856251	0.00413144340939784
	378	0.625238253232412	0.630975089348111	0.799296495488016
	379	0.0733854389948141	0.0695876935438837	0.0384524869820251
	380	0.0812984961753023	0.0770693762019925	0.0422379402712125
	381	0.10052844620415	0.101005670533219	0.0549708858251779
	382	0.0415946766477862	0.04133783787388	0.0214851352421892
	383	0.0332951084303931	0.0322387258066122	0.0189383932325652
	384	0.0213670196556617	0.022462842832479	0.0108755168769901
	385	0.0113119889942111	0.0118938829089506	0.00651511037508541
	386	0.00519556975841564	0.0056316197768621	0.00296033854927737
	387	0.00678500190685371	0.00779726117401014	0.00426769715746124
asp	302	0.907892251274555	0.907827792396857	0.943421313562383
	303	0.0570018610783663	0.0570689264033313	0.0372729770699263
	304	0.0351058876470789	0.0351032811998118	0.019305709367691
	316	0.887762854078779	0.884293034573425	0.931494209112963
	317	0.0490094238712739	0.0523574029220582	0.03140035263013
	318	0.0360219721828565	0.0361171233621542	0.0185231357742275
	319	0.0272057498670911	0.0272324391423626	0.0185823024826795
	390	0.894189583342737	0.892989034441349	0.935273515309039
	391	0.0517066753871503	0.0538850044361501	0.0345945777284243
	392	0.0351105528780521	0.0342891641161232	0.0194311608775831
	393	0.018993188392061	0.0188367970063778	0.0107007460849534
	418	0.866594096169733	0.869586777358968	0.911497544122787
	419	0.0633644561034169	0.0634338560438594	0.047574731093921
	420	0.0339724370144728	0.031505364311837	0.0209858065207147
	421	0.0304362552889398	0.0296916036646791	0.0166723815823715
	422	0.00563275542343769	0.00578239862065628	0.00326953668020559
	460	0.878932907318724	0.87587627504953	0.926560519843316
	461	0.0593934574589518	0.0627439923666581	0.0407589054966871
	462	0.0272836107189555	0.0267973150659432	0.0136735760273598
	463	0.028936932373499	0.0286740743588695	0.0157021052088002
	464	0.00545309212986946	0.00590834315899925	0.00330489342383702
glu	302	0.83661299001927	0.834590373424813	0.89021268285007
	303	0.125882203877111	0.127947522370325	0.0891850462335041
	304	0.0375048061036185	0.0374621042048624	0.0206022709164261
	330	0.79646863003401	0.796062245822075	0.883679025589791
	331	0.0643152685271348	0.064731901690082	0.0389965548832477
	332	0.122028572475444	0.121755024534294	0.0686468085291324
	333	0.00731675403772797	0.00737391960320186	0.00332389648672977
	334	0.00987077492568308	0.0100769083503477	0.00535371451109917
	404	0.814348230300183	0.807615514198067	0.895621605177458
	405	0.0545707019937237	0.0597567863668577	0.0331364208610749
	406	0.116144534018578	0.116711126717566	0.0633775038324455
	407	0.00606504316202422	0.00673693512955477	0.00296461644606203
	408	0.00887149052549135	0.00917963758795529	0.00489985368296
	432	0.769285591419078	0.763944098387619	0.864026913078028
	433	0.0722056536240445	0.0756721340672974	0.0494677571905189
	434	0.113238706390795	0.112985987186345	0.0623778096107473
	435	0.0322324235911097	0.0338276128141264	0.0173373329843773
	436	0.00818449576259584	0.00840419031579293	0.00410219463870787
	437	0.00485312921237652	0.00516597722881903	0.00268799249762094
	474	0.783228035004672	0.77828338927525	0.877788998663093
	475	0.069175320963619	0.0735509514991105	0.043194226002799
	476	0.105636945854031	0.10429895242414	0.055541662340809
	477	0.0299156388989795	0.0314012501131431	0.0167923756704674
	478	0.00765477971957807	0.00789546488817733	0.00415196709132098
	479	0.00438927955911988	0.0045699918001792	0.00253077023151019
lys	302	0.703822762065997	0.696026769640532	0.831722314763524
	303	0.25152772619239	0.256499676178675	0.143219705109787
	304	0.0446495117416135	0.0474735541807929	0.0250579801266886
	329	0.689180174285593	0.684234111530266	0.820282769961165
	330	0.0963436438405801	0.0967366899560696	0.0598016058846464
	331	0.150071205337455	0.150483468172731	0.0830691876295892
	332	0.0456102356151789	0.0479505910460519	0.0259732584174474
	333	0.0115905090480291	0.0124819181678081	0.00649518322160698
	334	0.00720423187316376	0.00811322112707339	0.00437799488554479
	403	0.699877444258378	0.682848418310104	0.809632829709887
	404	0.100664016847145	0.10603383148251	0.0615486139799594
	405	0.140297108196423	0.147007533682075	0.0780926530512872
	406	0.0428037017094048	0.0454744029855269	0.0270068878899302
	407	0.0158564806893735	0.0157037599748444	0.00977221406484952
	408	0.000501248299276163	0.00293205356493944	0.0139468013040864
	431	0.676914568052131	0.661577331126563	0.810915463976196
	432	0.101001615273373	0.104866207305467	0.0632257093803984
	433	0.107141849575123	0.110225981883068	0.0593121202257086
	434	0.0851933103038893	0.0899339855148188	0.0484816407141082
	435	0.0155713430484755	0.0172340053022523	0.00916102262435265
	436	0.0100291872162317	0.0112464362801402	0.00620590677350556
	437	0.00414812653077562	0.0049160525876913	0.00269813630573109
	473	0.672925015614995	0.661134784206392	0.804437293541037
	474	0.104494434807182	0.109414585069049	0.0697547520128206
	475	0.106441328435974	0.10646265716425	0.0570105544565243
	476	0.0839722231146268	0.0869672771877177	0.0476710286382536
	477	0.0155974887776133	0.017647591652485	0.00963587521766354
	478	0.0101390377608657	0.011366573927943	0.0063063278300416
	479	0.00643047148874261	0.00700653079216415	0.0051841683036595
his3	302	0.864404392523866	0.862726970089152	0.925064066040084
	303	0.0213380455667193	0.0217256248998695	0.0111327411722506
	304	0.114257561909415	0.115547405010978	0.0638031927876656
	338	0.655836043358204	0.651414649148195	0.792493053779079
	339	0.142043455228566	0.141350116140519	0.0797926371133001
	340	0.126419282211429	0.126338955189111	0.0780887369618481
	341	0.039935977188105	0.0416388991098499	0.0282013686412238
	342	0.0285038323293892	0.0303765371610529	0.0163609185967321
	343	0.00726140968430797	0.00888084325127298	0.00506328490781654
	412	0.671892098299093	0.665859849282595	0.808245345021307
	413	0.138587288625557	0.137672124913857	0.075953765708277
	414	0.117502587567742	0.118511266763888	0.0703306474462906
	415	0.0382764775299793	0.0389881680194046	0.0227005683459983
	416	0.0239743657358112	0.0274953698303787	0.0145112529163866
	417	0.0097671822418169	0.0114732211898777	0.00825842056174095
	440	0.659792094134479	0.654195826694585	0.798770701818018
	441	0.135922803503004	0.136840623224339	0.0801729900621096
	442	0.081196180124043	0.0794897122025877	0.049659195411485
	443	0.0703014782561331	0.072235333302639	0.04062818938473
	444	0.0210086404230028	0.021567776002627	0.0120284284499611
	445	0.0266970074815306	0.0289056141148207	0.0152081131430377
	446	0.00508179607780742	0.00676511445840138	0.00353238173065825
	482	0.674177914315885	0.670417913477002	0.81221172941663
	483	0.127041139917093	0.129757874833604	0.0708548012433114
	484	0.0762697743483945	0.0740177803174902	0.0449244620575553
	485	0.0702064876216284	0.0708421522902892	0.0407663990923554
	486	0.019704364955182	0.0200203948253065	0.0119993058964277
	487	0.0266616342287181	0.0276617709732434	0.0151724866283403
	488	0.00593868461309842	0.0072821132830654	0.00407081566537993
tyr	302	0.849025719186039	0.792076740959868	0.856780363371416
	303	0.0455041854177323	0.0812193914199954	0.0676592959875899
	304	0.105470095396229	0.126703867620137	0.0755603406409941
	364	0.658668767992735	0.656101439180542	0.798253521252171
	365	0.0625221019690445	0.0599834978263114	0.0346567473100297
	366	0.134689222646595	0.133901060588372	0.0830068576688895
	367	0.0550903651716988	0.0553586482164444	0.0324653204822983
	368	0.0447345506819598	0.0451861218400788	0.0254465567328986
	369	0.0156358536585954	0.0183322960262104	0.00988428784915878
	370	0.0178445752575769	0.0188258059036376	0.00995701548385779
	371	0.0043484979923105	0.00461410228315128	0.0024561092445274
	372	0.00646606462948459	0.00769702813525226	0.00387358397616946
	438	0.649149976183402	0.643775882773911	0.77075838459838
	439	0.0596519090961854	0.057512524104098	0.0337899809751893
	440	0.123947536489733	0.123462654560791	0.0705879915674823
	441	0.0517437807300329	0.0519216994551429	0.0295632276612015
	442	0.0504494107468238	0.0558476568138427	0.0419495730923422
	443	0.0300068629000589	0.0300062372362981	0.0322244658694396
	444	0.0191147450757335	0.0205292275846854	0.0111329335323682
	445	0.00842019138186099	0.00831708613528445	0.00526223786366968
	446	0.00751558739616932	0.00862703133594689	0.00473120483992733
	466	0.661147702011673	0.658630338366356	0.805092341400919
	467	0.0684256295466595	0.0655124410125476	0.0389697109488557
	468	0.0793361091964492	0.0775836852987589	0.0452788667618964
	469	0.0947115657312682	0.0969852267120802	0.0552721013573891
	470	0.0381316243248787	0.0385215077682741	0.0215127518844791
	471	0.0213003788688672	0.0220698690793624	0.012000099524544
	472	0.018908677547272	0.020265144735978	0.0107668026591049
	473	0.00802777778979699	0.00858058236605764	0.00459910018873109
	474	0.00417886732555151	0.00491589304927125	0.00281411194745587
	475	0.00583166765758363	0.00693531161131387	0.00369411332662482
	508	0.660719985678984	0.664198833098515	0.809645642122652
	509	0.066623025760153	0.0645282639604841	0.0380000119648103
	510	0.0792738468408726	0.076562960354828	0.0440253196149204
	511	0.0931507647432524	0.095228671164544	0.0548658570118725
	512	0.035919113269915	0.0354676919580536	0.0194014228297162
	513	0.0229691146424206	0.0221425328947928	0.0115347372753874
	514	0.0192473047802763	0.0198179506027804	0.010282232655856
	515	0.0103847575853764	0.00969259353608382	0.0054761595058768
	516	0.0051063452846904	0.00526659189751533	0.00307673062608198
	517	0.00660574141405909	0.00709391053240323	0.00369188639282673
