Standard Deviation
		Exp_1	Exp_2	Exp_3
ala	158	0.0353669206853874	0.0283597993725781	0.0693640863160134
	159	0.0116618092879066	0.0104224251026869	0.0140057746985357
	160	0.0273707566927294	0.0222507273909279	0.0657800807304865
	232	0.0305134902502843	0.0283683115396253	0.0715868201966166
	233	0.00742231900059714	0.00825160426555096	0.00930510416758257
	234	0.0261861359243526	0.0231359714260288	0.0667954818365638
	260	0.0335845016250918	0.0203777862372911	0.080782549042812
	261	0.00934071253469954	0.00989201787487861	0.0157614607047551
	262	0.00907813961977458	0.0070652831375312	0.0144090638610116
	263	0.0226411702814707	0.0176173245248012	0.056393745893419
gly	144	0.0111211786015644	0.00915148382129867	0.0638091499357431
	145	0.0111211786015644	0.0091514838212987	0.0638091499357431
	218	0.0134065199249759	0.0102178102099436	0.0600656375992031
	219	0.0134065199249759	0.0102178102099435	0.0600656375992032
	246	0.0148319432839952	0.0164419026474216	0.0820595639953712
	247	0.00648680128811876	0.00844579504362192	0.0360719684054966
	248	0.0112539712628751	0.0124177555788275	0.0485033961380636
	288	0.0191735618077245	0.0230545398747978	0.0811916469615364
	289	0.00872010520035039	0.0119286701067832	0.037053306039791
	290	0.0132661944588048	0.0150847491917276	0.0466829161047416
val	186	0.0340897486591079	0.0381471751831716	0.128089545435597
	187	0.0123403467001462	0.0141499340364943	0.0237078028531701
	188	0.0182907275880243	0.0233285293323232	0.104846528139698
	189	0.00413145966274191	0.00427403552039857	0.00344872654446289
	190	0.00942120646197893	0.00782249301097643	0.0167392473608233
	260	0.0282444842026911	0.0286765308494092	0.128699660614924
	261	0.00895657518537238	0.0107480608016728	0.0172444782702694
	262	0.015968001316656	0.0167085642351535	0.0988698630050032
	263	0.00414701475106658	0.00429497446411621	0.00467418794504539
	264	0.00899276054543837	0.00813437351815399	0.0156403151905978
	288	0.0303065490568758	0.0270713668450408	0.138450288351072
	289	0.00845192331921435	0.00903450888069438	0.0235673775682583
	290	0.0109626747135888	0.0106160956214263	0.0610969302883516
	291	0.0102384020856436	0.0108101660500052	0.0450814650520023
	292	0.00438522059379974	0.00422731664240949	0.0048339529148306
	293	0.00885767594716862	0.00739091855890211	0.0140474488446287
	302	0.0232406481050548	0.0133934083223967	0.0859656627145359
	303	0.00887539328186779	0.00511099266876728	0.026086446776712
	304	0.0174333672686034	0.0127284826777083	0.0625376709996627
	330	0.0337523925522613	0.0171519254447681	0.132279188001141
	331	0.0090773018449331	0.00626201592524636	0.0263602640614422
	332	0.012678355210251	0.00782403781256604	0.0589765323786915
	333	0.0108225647035773	0.00916931943035462	0.0403057915759044
	334	0.00461730686496867	0.0037923778643483	0.00520956805233671
	335	0.00791635281063901	0.00545651137248087	0.0117244568691763
leu	200	0.0454886774178806	0.0320508591833561	0.151568531462887
	201	0.021375052118473	0.0185149235072366	0.0323496657958154
	202	0.0179382496157431	0.0153120569806535	0.0886148138948741
	203	0.00945153621295153	0.00679723464846965	0.0218382036513309
	204	0.00741389291528399	0.00504485326355578	0.0143489256330134
	205	0.00453227364131447	0.00392186883919503	0.00606363655365841
	274	0.0268275104213993	0.0298727908534353	0.153013035389367
	275	0.0111571944016063	0.0126100043999846	0.0505399933000491
	276	0.0117205396017044	0.0125926438733796	0.0787797607740173
	277	0.00858661269287693	0.00826184499630299	0.0179225981705651
	278	0.00627542969047316	0.00609914257280806	0.0113776260832769
	279	0.00422015495717925	0.00409957257130953	0.00486293933179489
	344	0.0292813153663119	0.0364815723702377	0.159716148165859
	345	0.0122831866032689	0.0125883844924371	0.0276443956249581
	346	0.0125681007364272	0.0224340876405603	0.108300299209843
	347	0.00580250006086524	0.00520048399394637	0.00709647985655439
	348	0.00886526429566122	0.0088601342075417	0.0219258336946829
	349	0.00278775369733132	0.00282065842484627	0.0026888092337968
	350	0.00382055259564001	0.00319723348392863	0.00493420085797324
ile	200	0.0300430994088804	0.0431206575102807	0.161783685698413
	201	0.012318879566948	0.0202068149283266	0.0462772941044737
	202	0.0141601278409253	0.0196870192398688	0.0839379610839537
	203	0.00791408466284487	0.00771593837267407	0.0295082832284756
	204	0.00423509904264885	0.00424447344494847	0.00828893169170732
	205	0.00366668791904759	0.00352717755906372	0.0064309040358679
	274	0.0260207348778336	0.027185855922291	0.152791881980666
	275	0.0101811012125802	0.00990058274328033	0.0409845243501082
	276	0.0126050205438944	0.0142041761359761	0.0804362930440795
	277	0.00737404435076657	0.00758722665513895	0.0277325016239231
	278	0.00404325588642753	0.00451020926581462	0.00765461991141582
	279	0.00351834052711544	0.00366880062913559	0.00607418620275398
	344	0.0313302962772091	0.0186792675860868	0.165993737735206
	345	0.01010616257239	0.00553140449480292	0.0504326135305107
	346	0.0150437609208942	0.0114733781110868	0.0706135430844136
	347	0.00731729151093849	0.00744577424449335	0.0348812295176903
	348	0.00645420370177418	0.00484372890059782	0.0124142019095651
	349	0.00398186082466586	0.00345037947207837	0.00679945185668211
	350	0.00299512133272044	0.002897530843734	0.00357813432836997
pro	184	0.0290319020831275	0.0376986702201646	0.133524994033276
	185	0.00949775403738678	0.0185602891076224	0.0468054268251626
	186	0.0174926593112045	0.0187125132690094	0.0805454581927436
	187	0.00504055805904354	0.00425862725014491	0.00608489589266965
	188	0.00550049058349842	0.00465656917966173	0.00979375655783285
	258	0.0278794738974403	0.0179579696566408	0.102358167528932
	259	0.00914167486125415	0.00790225641711029	0.0271841051869399
	260	0.0167178634309966	0.011109555341757	0.0686326338234198
	261	0.00472286998517384	0.00406168005748242	0.0055254283267318
	262	0.00551559936562427	0.00403877036450101	0.00867809092539546
	286	0.0300522182155282	0.0279081656700038	0.118804041939855
	287	0.0101614049785429	0.00919524863459602	0.0316638035614912
	288	0.0167937302901689	0.0127070602211412	0.0590646156513552
	289	0.00697595649700334	0.00497349595272882	0.0197548764829057
	290	0.0131208765281425	0.0307684533492928	0.0196512393695496
	291	0.00417734304775934	0.00337760059309987	0.00562681823697766
	302	0.527047349876215	0.0268230604644974	0.33002717426926
	303	0.0025	0.0082527436683499	0.00315925021596105
	304	0.0187240653088503	0.0235425599748078	0.0199398447497843
	328	0.0350936048525342	0.0145254192149437	0.114270300819115
	329	0.0101047015971638	0.0103037438647343	0.0309914455951685
	330	0.0148966684230455	0.0115193032374401	0.0582711460748654
	331	0.00704509769392066	0.00455330059888052	0.0191832354227549
	332	0.0164780476804402	0.0197497120947552	0.0186571175844405
	333	0.00411711382490796	0.00355606337536257	0.00543934032160069
met	218	0.0233187724308909	0.0177427191381558	0.153471008727775
	219	0.0114947527118279	0.0092701324098149	0.0825892515565498
	220	0.00874355395200069	0.00718344903011855	0.0342229969864705
	221	0.00906941898693859	0.00664269253322618	0.0378052800616904
	222	0.00363888793031527	0.00344591006315598	0.00647405280652826
	292	0.0253256854959354	0.0188340757206682	0.129641315162303
	293	0.0103932989238003	0.0085626336269204	0.0767548523531771
	294	0.00796308059956355	0.00695965115182966	0.0331277904465069
	295	0.00904875323628171	0.00644238115422776	0.0343728674519394
	296	0.0106095253161879	0.0068485230670292	0.0171101394666559
	302	0.0618670195597586	0.0163002756743477	0.0679164849645132
	303	0.0574751012806619	0.0157374675483058	0.0465732253867982
	304	0.0106445369346771	0.0169108309675719	0.0302208658940929
	320	0.0229721811865637	0.0161617163061208	0.139323716927545
	321	0.00689401967657157	0.00792774797144311	0.0914524373958497
	322	0.00880646149761564	0.00741695813768022	0.0298604046744205
	323	0.00881239364674308	0.00655109479368358	0.0235595872053167
	324	0.00724699812327063	0.00517860516993931	0.0132620973438041
	325	0.00351972933001604	0.00304758965973724	0.0107279935075727
	362	0.0192128594366851	0.0127277464367966	0.140263418959179
	363	0.0135569608167346	0.00706943040343455	0.0824690322797747
	364	0.00880276201621776	0.0074132564404873	0.0267906477612811
	365	0.0104883201259761	0.00703964905434768	0.0298453613630739
	366	0.00691383475984093	0.00458054855744995	0.0142732784256167
	367	0.00426759882129319	0.00398127671678034	0.00632705428302632
ser	288	0.0127352970979821	0.0159287785564062	0.0885044543469299
	289	0.00897075204295904	0.0102689601104605	0.0500942888149534
	290	0.00819162676187516	0.0141717799478684	0.0410666179970541
	302	0.0120999351361183	0.0128961154549091	0.0799360373708391
	303	0.00678409918581788	0.00718571907371702	0.0301128662732642
	304	0.00915481601335771	0.0112064651411748	0.052399968805853
	362	0.0150735869482416	0.0125902100771943	0.0905409748252335
	363	0.0105019798266094	0.00691677541506111	0.0513087916432525
	364	0.00816002055150251	0.0140541267520314	0.0419418862948674
	390	0.0183667528068384	0.0114001161396067	0.0982109985429017
	391	0.0106204888801013	0.00626907488095192	0.0404685681245929
	392	0.00840060613463105	0.00508442467903895	0.0268592625148397
	393	0.00708092421992782	0.0131904843070053	0.0361422476627736
	432	0.0171602224656743	0.0164973839919286	0.0947248928865326
	433	0.00999752359035275	0.00710217009540615	0.0420652805702564
	434	0.0079403475853089	0.00587499295179629	0.0248349872984527
	435	0.00714351682641534	0.0133624606913236	0.033258021562076
thr	376	0.0188270920467329	0.0163701904223901	0.0998466800206688
	377	0.00939720077257342	0.00770126723274762	0.042392011570377
	378	0.00841405552679768	0.008267062524083	0.0382975764788352
	379	0.00645980547952271	0.00643620835333613	0.0241820716494194
	404	0.0258857574025105	0.0169388803469637	0.115607297850886
	405	0.0109186229166799	0.00747447253897756	0.0475696256326916
	406	0.0113874633425496	0.00915145955947539	0.0312655522503324
	407	0.00779269110718963	0.00892283460454405	0.0351484974789768
	408	0.00491443379643441	0.00401486064189145	0.00917426926402675
	446	0.0241683294190263	0.0154329587201429	0.113132377483998
	447	0.00997579916658129	0.00792005211764291	0.0474933412157584
	448	0.0115252677325619	0.00821103450013065	0.0303054468627951
	449	0.00752700198678349	0.00857895399221776	0.0343407121364573
	450	0.0050485114981067	0.00409210711895328	0.00865099739362671
phe	234	0.0321998516243142	0.0399025112972521	0.185717663787521
	235	0.00542466716887467	0.00588981390555598	0.0324644388789406
	236	0.00764804105279341	0.0101537556516525	0.0732555042959963
	237	0.00710364548814348	0.00891399853665256	0.0344321529421729
	238	0.00934480498785346	0.012135315190744	0.0270741406936803
	239	0.00878294337653957	0.00950781755239629	0.0139106194568375
	240	0.00956304287323483	0.0102579545418471	0.0122789222228043
	241	0.00476003505579342	0.00456304408386884	0.00481531738203705
	242	0.00602286556939252	0.00593705598054874	0.00635872901930475
	302	0.0237886783448682	0.0293481213177096	0.0685807627331845
	303	0.0103465000492323	0.0116722115456628	0.0188734485393763
	304	0.0168165865772431	0.0221470899787316	0.0580824407894981
	308	0.0335881096458595	0.0387040306975906	0.185294220369663
	309	0.00505978555933204	0.00609749440732209	0.0334034682864087
	310	0.00966448255535589	0.0100192621659862	0.0725319710137454
	311	0.00717662593856083	0.00827792836348388	0.033798295752185
	312	0.00947786026555811	0.0118585521960093	0.0267463479778192
	313	0.0085690571980221	0.0092443170069783	0.0131574988749946
	314	0.00926440287541782	0.010138620635132	0.012036165774874
	315	0.00468202579958759	0.00470817260332654	0.00524738519878684
	316	0.00598661620339447	0.00618581222290044	0.00708195177837378
	336	0.0320576850238346	0.0425885537848402	0.194680997567362
	337	0.00537303559112776	0.00708587344613699	0.0386450007146636
	338	0.00572497742608255	0.00605720795863871	0.0458048071751433
	339	0.00836280800295206	0.0110309606103956	0.0587553133138041
	340	0.00848922010563065	0.0108272597027532	0.0247789583507575
	341	0.00876851356167211	0.0103909457391679	0.0152879044591721
	342	0.00934022571641572	0.0111175966148292	0.0139553385366227
	343	0.00611266541278196	0.00694314711849072	0.00727536134801022
	344	0.00453809463571829	0.00510129229084982	0.00522513667405781
	345	0.0055791994168559	0.00626657044213297	0.00642163295380257
	378	0.0298542416442639	0.0379222796088134	0.182567588986492
	379	0.0056617627619573	0.00862734512395175	0.039192842993431
	380	0.00517689244510067	0.00564364919890947	0.0426206041230441
	381	0.007186025621993	0.00922493204028577	0.054386435443511
	382	0.00792254306441734	0.00986023741019763	0.0226589214363708
	383	0.00760212377503801	0.0112274449794128	0.0146041532732036
	384	0.00908237969214151	0.0102255781220863	0.0125724801478406
	385	0.00543837505893107	0.00703767330827406	0.00723751445952016
	386	0.00441223206475026	0.00493373264215201	0.00491432843145081
	387	0.00527646439789351	0.00582376765939323	0.00561497097650065
asp	302	0.0117823592423604	0.0115264786178675	0.0421200291896782
	303	0.00755220315674687	0.00734149434273737	0.0257171997763741
	304	0.00701805462857985	0.00705580566832483	0.0189234881058481
	316	0.0135741659612719	0.0139905405268876	0.0490376596760187
	317	0.00840591744730401	0.00874560926527318	0.0231789668480051
	318	0.00602133341683426	0.00642754496653107	0.0189936953840118
	319	0.00453317616758034	0.00463193547706581	0.0119328506392867
	390	0.016103155925589	0.0118994980988971	0.0531958176701224
	391	0.00936853273963281	0.00733393115331171	0.0252457405981064
	392	0.00734127022863277	0.00567325275298369	0.0202718740041661
	393	0.00488794120253415	0.00476134097645683	0.0127854703872807
	418	0.0182888339373448	0.0146188758575383	0.0618013628300133
	419	0.00947838846469778	0.00785159353957634	0.0273769271555258
	420	0.00887119912294745	0.00666219687448141	0.0180069018664527
	421	0.00515772565084727	0.00613003584152593	0.0184554957234031
	422	0.00381158872423126	0.00338619176466488	0.00563836616857637
	460	0.0161075124203001	0.0166311379733979	0.0568729618112944
	461	0.00928171375053647	0.00908065569929506	0.0272295160171186
	462	0.00767677646319616	0.00712946018172317	0.0149843839601688
	463	0.00443337304409988	0.0059595937313667	0.0171561531232684
	464	0.00362836449848632	0.00347940474250336	0.00526742329359778
glu	302	0.0157385656223916	0.0128292017872716	0.066723463583976
	303	0.00880995850840772	0.0100571148770129	0.0471775894589295
	304	0.00984646221241288	0.00660202828195838	0.0220662873404128
	330	0.0292200781827366	0.0211279604523848	0.0956857056264953
	331	0.00914349420268409	0.0101859267984103	0.0262999847676308
	332	0.017800286117632	0.0119520590856265	0.0638558574490601
	333	0.00505973439044066	0.00442087239339291	0.00569356539083406
	334	0.00518522454042317	0.00390091049106214	0.00758141007032218
	404	0.0270906107843405	0.0217969103616012	0.0934725839606141
	405	0.00993504478638905	0.0111790286972281	0.0274091266714644
	406	0.0159324045876383	0.0108322476347051	0.0613871885674183
	407	0.00453283248283623	0.00455448407712475	0.00539398493259477
	408	0.00479285192396247	0.0037755586361227	0.00714225475175914
	432	0.026663309825679	0.0222979443006373	0.103024331946991
	433	0.0083723269106308	0.00952584110320751	0.028039523470231
	434	0.0148795514233249	0.0123127100879051	0.0547878894519529
	435	0.00655032114291141	0.00556810229400507	0.0189825388272097
	436	0.00459462831158036	0.00370712043330514	0.00643653447437358
	437	0.00374503304279274	0.00300410823191195	0.00495788902080982
	474	0.0282907967859589	0.0189443364397869	0.108766025359279
	475	0.00933825233637466	0.00891863729311665	0.0344194932547061
	476	0.0156031662323219	0.00972680198203993	0.0550505736677443
	477	0.006562709621333	0.00547301735243594	0.0182822806500661
	478	0.00461907721188388	0.00375934406229116	0.00627423365938808
	479	0.00375091724241319	0.0030212729650957	0.00484056261112322
lys	302	0.0201343981638249	0.0147810076357827	0.15812346870963
	303	0.0128249574106445	0.0121165417454233	0.134310936638509
	304	0.0106229073791582	0.00710908646114496	0.0264229629381973
	329	0.0268317211390388	0.0230016142089399	0.148050405551915
	330	0.00885376321083521	0.00988867673400694	0.0413482790680222
	331	0.0138933645960452	0.0118657782132801	0.0762731894825299
	332	0.00717297030997609	0.00568820111542618	0.025565111919374
	333	0.00454970681400945	0.00407269313462015	0.00850904356275616
	334	0.00395413391236658	0.00344340380347317	0.00646241729934066
	403	0.0282048973912887	0.0239247286058752	0.138715455119089
	404	0.00979140993367453	0.0106239163894787	0.044661616995599
	405	0.0143520009760949	0.0149101079517753	0.0716828802677612
	406	0.00864624580199163	0.0063169364767997	0.0231122420135125
	407	0.00500740569221962	0.00553348064745337	0.00662113036527677
	408	0.00371016226779671	0.00697994695768892	0.00594021736103147
	431	0.0380037621632051	0.0214500558985921	0.166810254080664
	432	0.0108892539888677	0.00832912158458727	0.0486331410462273
	433	0.0140245822769485	0.00886290028850749	0.0576613730109333
	434	0.0118320364665745	0.00939521032392722	0.0486850387999683
	435	0.00646302279219807	0.00420529266487785	0.0111538792154814
	436	0.00503435211209001	0.00371213564662642	0.00830424787334588
	437	0.00367610516636129	0.00308955071428724	0.00494887062326417
	473	0.0404407340486472	0.0219111357099994	0.164833762281227
	474	0.0142902950123231	0.00736702512057788	0.0487457042654489
	475	0.0145778154264598	0.00861141541485905	0.0568308444669659
	476	0.0114851149152923	0.00921561416040416	0.0474676228652655
	477	0.00626634871342783	0.00442041890565578	0.0114041652778193
	478	0.00473965693714855	0.00399578480621098	0.0081645257680902
	479	0.00366713142895831	0.00318664410150178	0.00501644198009982
his3	302	0.0146553450477415	0.014202991859809	0.0728399047188904
	303	0.0062928958026581	0.00569282067819852	0.0130963796742162
	304	0.0112562715707528	0.0112615204544827	0.0622519567669487
	338	0.019348133803002	0.0215394521162346	0.169085106173743
	339	0.00930949248304152	0.00788629191764667	0.0737611215695504
	340	0.00856817476666552	0.0116128094010141	0.0634910301072635
	341	0.00667402007749027	0.00622555946758388	0.0181076775926018
	342	0.0071223857789368	0.00724563479635788	0.0174840239046036
	343	0.00414800417128136	0.00364825413614713	0.00653839508274431
	412	0.019944276034806	0.0232934386752482	0.168552041440927
	413	0.00911838060231131	0.00771897822874534	0.0745910436264814
	414	0.00786970509727548	0.0112362851507071	0.0637711268715585
	415	0.00629951226840211	0.00655572030652006	0.0182565347170677
	416	0.00887654729416528	0.00861196966291523	0.0164310633713723
	417	0.00408770785625392	0.00379926451719509	0.00586145715801397
	440	0.020515288961851	0.0228384574989048	0.173987218600597
	441	0.00840679427664863	0.00779154057299805	0.0677199581598221
	442	0.00522550573991619	0.00669341956650681	0.0413899224513066
	443	0.00689024026793248	0.00928747072670973	0.0412556714218268
	444	0.00572695720296455	0.00539772490370312	0.0137727476992107
	445	0.00737035993622331	0.00765765988730193	0.0168156874801583
	446	0.0042217125378915	0.00367605596298614	0.00587524956879803
	482	0.0223534770420483	0.0223267050332066	0.173150598897333
	483	0.0105403619664396	0.0087889081103311	0.0698282630007956
	484	0.00549990525181915	0.00705142038486499	0.0416647486866092
	485	0.00702447560047339	0.00849188230522683	0.0395399755107883
	486	0.00572223391033976	0.00508654364141328	0.0130564565477057
	487	0.00707487727963258	0.00687430163038963	0.0161615214511005
	488	0.00427466074917207	0.0033625464048245	0.00572198577173096
tyr	302	0.0152818101388927	0.0672229098510756	0.112582422483844
	303	0.0095186984060904	0.0413292052078409	0.0491653764601648
	304	0.0108038152491613	0.0286960647031628	0.070048387230887
	364	0.0129508739470191	0.0261923198827153	0.175560399370514
	365	0.00451375068331961	0.00698349678409017	0.0348759121728711
	366	0.0102531096832058	0.0128044997056908	0.0667645806349977
	367	0.00512262454520424	0.00738592058595462	0.0312081042339327
	368	0.00560499554730057	0.00830950661810873	0.0260104065810781
	369	0.00637296538052562	0.0052506493161159	0.012070927115419
	370	0.00602497104120184	0.00574511752794166	0.0118158766095288
	371	0.00356739657344066	0.00335246189823644	0.00460819798107516
	372	0.00477123578202299	0.00425975734465012	0.00631249250918235
	438	0.00957850629608448	0.0238636754959303	0.167094912926146
	439	0.00445191375735483	0.00662773631776728	0.0333926512075572
	440	0.0101403476214334	0.0132322755748729	0.0682197089359804
	441	0.00511887684173019	0.00728519642162347	0.0299585077108296
	442	0.00633944089457028	0.00722245097936961	0.0232386596164395
	443	0.00409668209498527	0.00477352208623113	0.0129050467341634
	444	0.006372248897469	0.00586283085043246	0.0131996620364752
	445	0.00352254073950949	0.00356423261244792	0.00777164031242646
	446	0.00467614767957269	0.00434039284519647	0.00644171178756408
	466	0.0127996342367844	0.0253914243331582	0.183532553419091
	467	0.00498555573065068	0.00743855454779327	0.0376948201294412
	468	0.00573733168482499	0.00801937540465571	0.0442939455003176
	469	0.00979694753063858	0.0123817394315334	0.0551872033173403
	470	0.0049176375177233	0.00736528883387804	0.0230229204453251
	471	0.00534509576025581	0.00544574059774849	0.013772938079117
	472	0.00588492505609455	0.00561599010297675	0.0126948326993162
	473	0.00437806976719658	0.00410336304063516	0.00683402813023313
	474	0.00374493667129081	0.00340733836606329	0.00473679207224653
	475	0.00463457860750033	0.00418885477087676	0.00592350698358662
	508	0.0139016773301701	0.0263515273677366	0.179009339288413
	509	0.00467170154781254	0.00786110519823436	0.0385853207910566
	510	0.00603878783135303	0.00775974855424688	0.0443323867310968
	511	0.00933750959548172	0.0119573718553007	0.0535924354250802
	512	0.00661119747202091	0.00825597369886433	0.0210889579334263
	513	0.00509919948024062	0.00542936252541612	0.0132477131097234
	514	0.00601951146101931	0.0056922778537741	0.0120181623730662
	515	0.00385760780055443	0.00379378948750749	0.00637522327282165
	516	0.00343027944076476	0.00335428573166231	0.00451720453930742
	517	0.00453009850420254	0.00413579104748359	0.00586977982369733
