,Factor 1,Factor 2,Factor 3,Factor 4,Factor 5
Factor 1,1.0,-0.175,0.175,-0.0875,0.1125
Factor 2,-0.175,1.0,0.025,0.125,-0.175
Factor 3,0.175,0.025,1.0,-0.075,0.125
Factor 4,-0.0875,0.125,-0.075,1.0,-0.0625
Factor 5,0.1125,-0.175,0.125,-0.0625,1.0
