Center Balance,Level Balance,Orthogonality,Two-level Balance,Two-level Min-Eff,D-Eff,D1-Eff,D2-Eff,A-Eff,A1-Eff,A2-Eff,Nexp
100.0,100.0,45.838,0.0,38.4,0.93,49.281,0.0,9.332,40.226,71.195,10
100.0,100.0,32.746,13.6,50.4,25.158,46.594,0.0,12.918,34.078,6.615,15
100.0,100.0,53.774,33.0,62.0,25.19,50.61,0.0,8.815,42.813,0.87,20
100.0,100.0,68.769,49.2,72.8,27.422,52.728,14.18,15.507,47.48,2.777,25
100.0,100.0,73.216,47.267,79.6,29.478,53.281,18.879,18.574,48.482,7.816,30
100.0,100.0,71.403,49.029,85.6,28.822,53.059,18.985,16.175,47.947,8.422,35
100.0,100.0,86.625,52.7,88.8,30.352,54.796,22.049,19.603,51.848,12.605,40
100.0,100.0,91.279,59.689,94.4,30.872,55.276,23.307,20.433,52.748,14.486,45
