State,Id,type,flux_value,flux_std,lb,ub,
reaction,r1,fitted,0.62,0.06,0.3,1,SubsGlc --> G6P
reaction,r2,free,1,1,0.0001,1000,G6P --> F6P
reaction,r4,free,1,1,0.0001,1000,F6P --> FBP
reaction,r6,free,1,1,0.0001,1000,FBP --> DHAP + GAP
reaction,r7,free,1,1,0.0001,1000,DHAP + GAP --> FBP
reaction,r8,free,1,1,0.0001,1000,DHAP --> GAP
reaction,r9,free,1,1,0.0001,1000,GAP --> DHAP
reaction,r10,free,1,1,0.0001,1000,GAP --> PGA
reaction,r12,free,1,1,0.0001,1000,PGA --> PEP
reaction,r14,free,1,1,0.0001,1000,PEP --> Pyr
reaction,r15,free,1,1,0.0001,1000,Pyr --> PEP
reaction,r16,free,1,1,0.0001,1000,Pyr --> AcCOA + CO2in
reaction,r17,free,1,1,0.0001,1000,AcCOA + Oxa --> IsoCit
reaction,r18,free,1,1,0.0001,1000,IsoCit --> aKG + CO2in
reaction,r19,free,1,1,0.0001,1000,aKG --> Suc + CO2in
reaction,r20,free,1,1,0.0001,1000,Suc --> Fum
reaction,r21,free,1,1,0.0001,1000,Fum --> Suc
reaction,r22,free,1,1,0.0001,1000,Fum --> Mal
reaction,r23,free,1,1,0.0001,1000,Mal --> Fum
reaction,r24,free,1,1,0.0001,1000,Mal --> Oxa
reaction,r25,free,1,1,0.0001,1000,Oxa --> Mal
reaction,r26,free,1,1,0.0001,1000,IsoCit + AcCOA --> Mal + Suc
reaction,r27,free,1,1,0.0001,1000,G6P --> m6PG
reaction,r28,free,1,1,0.0001,1000,m6PG --> Ru5P + CO2in
reaction,r29,free,1,1,0.0001,1000,Ru5P --> R5P
reaction,r30,free,1,1,0.0001,1000,R5P --> Ru5P
reaction,r31,free,1,1,0.0001,1000,Ru5P --> Xu5P
reaction,r32,free,1,1,0.0001,1000,Xu5P --> Ru5P
reaction,r33,free,1,1,0.0001,1000,R5P + Xu5P --> S7P + GAP
reaction,r34,free,1,1,0.0001,1000,GAP + S7P --> Xu5P + R5P
reaction,r35,free,1,1,0.0001,1000,GAP + S7P --> F6P + E4P
reaction,r36,free,1,1,0.0001,1000,E4P + F6P --> S7P + GAP
reaction,r37,free,1,1,0.0001,1000,E4P + Xu5P --> F6P + GAP
reaction,r38,free,1,1,0.0001,1000,GAP + F6P --> Xu5P + E4P
reaction,r40,free,1,1,0.0001,1000,PEP + CO2in --> Oxa
reaction,r41,free,1,1,0.0001,1000,Oxa --> PEP + CO2in
reaction,r42,free,1,1,0.0001,1000,Mal --> Pyr + CO2in
reaction,r56,free,1,1,0.0001,1000,SubsCO2 --> CO2in
reaction,r57,free,1,1,0.0001,1000,CO2in --> CO2ex
reaction,r58,free,1,1,0.0001,1000,Pyr --> Ala
#reaction,r59,free,1,1,0.0001,1000,Oxa --> Asp
#reaction,r60,free,1,1,0.0001,1000,Oxa --> Thr
#reaction,r61,free,1,1,0.0001,1000,aKG --> Glu
#reaction,r62,free,1,1,0.0001,1000,E4P + PEP + PEP --> Phe
#reaction,r63,free,1,1,0.0001,1000,E4P + PEP + PEP --> Tyr
#reaction,r64,free,1,1,0.0001,1000,Oxa + Pyr --> Ile
#reaction,r65,free,1,1,0.0001,1000,AcCOA + Pyr + Pyr --> Leu
#reaction,r66,free,1,1,0.0001,1000,Pyr + Pyr --> Val
#reaction,r67,free,1,1,0.0001,1000,PGA --> Ser
#reaction,r68,free,1,1,0.0001,1000,Ser --> Gly + MEETHF
#reaction,r69,free,1,1,0.0001,1000,Gly + MEETHF --> Ser
#reaction,r70,free,1,1,0.0001,1000,Gly --> CO2in + MEETHF
#reaction,r71,free,1,1,0.0001,1000,CO2in + MEETHF --> Gly
#reaction,rM2C,free,1,1,0.0001,1000,
#reaction,rArg,free,1,1,0.0001,1000,Glu + CO2in -> Arg
# reaction,rbm,fitting,0.3,.02,0.1,1,
reversible,TPI,free,1,1,-300,300,
reversible,SDH,free,1,1,-300,300,
reversible,MDH,free,1,1,-300,300,
reversible,RPI,free,1,1,-300,300,
reversible,RBE,free,1,1,-300,300,
reversible,TKT1,free,1,1,-300,300,
reversible,TAL,free,1,1,-300,300,
reversible,TKT2,free,1,1,-300,300,
reversible,FH,free,1,1,-300,300,
metabolite,m6PG,fixed,10,1,0.001,100,
metabolite,AcCOA,fixed,10,1,0.001,100,
metabolite,aKG,fixed,10,1,0.001,100,
metabolite,Ala,fixed,10,1,0.001,100,
#metabolite,Asp,fixed,10,1,0.001,100,
#metabolite,Arg,fixed,10,1,0.001,100,
# metabolite,Biomass,fixed,10,1,0.001,100,
metabolite,CO2ex,fixed,10,1,0.001,100,
metabolite,CO2in,fixed,10,1,0.001,100,
metabolite,DHAP,fixed,10,1,0.001,100,
metabolite,E4P,fixed,10,1,0.001,100,
metabolite,F6P,fixed,10,1,0.001,100,
metabolite,FBP,fixed,10,1,0.001,100,
metabolite,G6P,fixed,10,1,0.001,100,
metabolite,GAP,fixed,10,1,0.001,100,
#metabolite,Glu,fixed,10,1,0.001,100,
#metabolite,Gly,fixed,10,1,0.001,100,
#metabolite,Ile,fixed,10,1,0.001,100,
metabolite,IsoCit,fixed,10,1,0.001,100,
#metabolite,Leu,fixed,10,1,0.001,100,
metabolite,Mal,fixed,10,1,0.001,100,
#metabolite,MEETHF,fixed,10,1,0.001,100,
metabolite,Oxa,fixed,10,1,0.001,100,
metabolite,PEP,fixed,10,1,0.001,100,
metabolite,PGA,fixed,10,1,0.001,100,
#metabolite,Phe,fixed,10,1,0.001,100,
metabolite,Pyr,fixed,10,1,0.001,100,
metabolite,R5P,fixed,10,1,0.001,100,
metabolite,Ru5P,fixed,10,1,0.001,100,
metabolite,S7P,fixed,10,1,0.001,100,
#metabolite,Ser,fixed,10,1,0.001,100,
metabolite,SubsCO2,fixed,10,1,0.001,100,
metabolite,SubsGlc,fixed,10,1,0.001,100,
metabolite,Fum,fixed,10,1,0.001,100,
metabolite,Suc,fixed,10,1,0.001,100,
#metabolite,Thr,fixed,10,1,0.001,100,
#metabolite,Tyr,fixed,10,1,0.001,100,
#metabolite,Val,fixed,10,1,0.001,100,
metabolite,Xu5P,fixed,10,1,0.001,100,
