0.000654705 0.000662164 0.000670399 0.000679531 0.000689719 0.000701158 0.000714101 0.000728876 0.000745919 0.000765823 0.000789413 0.000817883 0.000853015 0.000897603 0.0009563 0.00103746 0.00115775 
0.000654906 0.000662371 0.000670611 0.000679751 0.000689946 0.000701394 0.000714348 0.000729136 0.000746194 0.000766117 0.00078973 0.000818228 0.000853397 0.000898034 0.000956797 0.00103805 0.00115849 
0.000655107 0.000662577 0.000670823 0.000679969 0.000690172 0.000701631 0.000714595 0.000729396 0.000746469 0.00076641 0.000790047 0.000818573 0.000853779 0.000898465 0.000957294 0.00103864 0.00115922 
0.000655308 0.000662783 0.000671035 0.000680188 0.000690399 0.000701866 0.000714841 0.000729655 0.000746744 0.000766703 0.000790363 0.000818919 0.000854161 0.000898895 0.00095779 0.00103923 0.00115995 
0.000655508 0.000662989 0.000671246 0.000680406 0.000690625 0.000702102 0.000715088 0.000729914 0.000747019 0.000766997 0.000790679 0.000819263 0.000854542 0.000899325 0.000958286 0.00103982 0.00116069 
0.000655708 0.000663194 0.000671458 0.000680625 0.000690851 0.000702337 0.000715334 0.000730173 0.000747293 0.000767289 0.000790995 0.000819608 0.000854924 0.000899755 0.000958782 0.00104041 0.00116142 
0.000655908 0.0006634 0.000671669 0.000680843 0.000691077 0.000702572 0.00071558 0.000730432 0.000747567 0.000767582 0.00079131 0.000819953 0.000855305 0.000900185 0.000959278 0.001041 0.00116216 
0.000656107 0.000663604 0.000671879 0.00068106 0.000691303 0.000702806 0.000715825 0.00073069 0.000747841 0.000767874 0.000791625 0.000820296 0.000855686 0.000900614 0.000959773 0.00104159 0.00116289 
0.000656307 0.000663809 0.00067209 0.000681277 0.000691528 0.000703041 0.000716071 0.000730948 0.000748114 0.000768166 0.00079194 0.00082064 0.000856066 0.000901044 0.000960268 0.00104218 0.00116362 
0.000656505 0.000664013 0.000672301 0.000681495 0.000691753 0.000703275 0.000716316 0.000731205 0.000748387 0.000768458 0.000792255 0.000820984 0.000856447 0.000901473 0.000960764 0.00104277 0.00116435 
0.000656704 0.000664217 0.00067251 0.000681711 0.000691978 0.000703509 0.00071656 0.000731463 0.00074866 0.000768749 0.00079257 0.000821327 0.000856827 0.000901901 0.000961258 0.00104336 0.00116508 
0.000656903 0.000664421 0.00067272 0.000681928 0.000692202 0.000703742 0.000716805 0.000731721 0.000748932 0.000769042 0.000792884 0.000821671 0.000857207 0.000902329 0.000961753 0.00104395 0.00116582 
0.0006571 0.000664624 0.000672929 0.000682144 0.000692426 0.000703977 0.000717049 0.000731978 0.000749205 0.000769332 0.000793199 0.000822014 0.000857587 0.000902759 0.000962247 0.00104453 0.00116655 
0.000657298 0.000664827 0.000673139 0.00068236 0.00069265 0.00070421 0.000717293 0.000732235 0.000749477 0.000769623 0.000793513 0.000822356 0.000857966 0.000903187 0.000962741 0.00104512 0.00116728 
0.000657495 0.00066503 0.000673347 0.000682576 0.000692874 0.000704442 0.000717537 0.000732491 0.00074975 0.000769914 0.000793826 0.000822699 0.000858347 0.000903614 0.000963235 0.00104571 0.00116801 
0.000657693 0.000665232 0.000673556 0.000682791 0.000693098 0.000704675 0.00071778 0.000732748 0.000750021 0.000770205 0.00079414 0.000823041 0.000858725 0.000904042 0.000963729 0.0010463 0.00116874 
0.00065789 0.000665434 0.000673764 0.000683007 0.000693321 0.000704908 0.000718023 0.000733004 0.000750293 0.000770494 0.000794453 0.000823383 0.000859105 0.00090447 0.000964222 0.00104689 0.00116947 
