0.00119729 0.00124735 0.00130335 0.00136636 0.00143768 0.00151895 0.0016123 0.0017205 0.00184725 0.00199758 0.00217853 0.00240024 0.00267795 0.0030355 0.00351263 0.00418065 0.00518187 
0.00119762 0.00124769 0.00130371 0.00136674 0.00143807 0.00151937 0.00161274 0.00172098 0.00184776 0.00199813 0.00217912 0.0024009 0.00267868 0.00303633 0.00351357 0.00418177 0.00518324 
0.00119795 0.00124803 0.00130407 0.00136711 0.00143847 0.00151978 0.00161319 0.00172145 0.00184827 0.00199868 0.00217972 0.00240156 0.0026794 0.00303715 0.00351452 0.00418289 0.00518461 
0.00119828 0.00124837 0.00130443 0.00136749 0.00143886 0.0015202 0.00161363 0.00172192 0.00184878 0.00199923 0.00218032 0.00240221 0.00268013 0.00303797 0.00351546 0.004184 0.00518599 
0.0011986 0.00124871 0.00130478 0.00136786 0.00143926 0.00152062 0.00161408 0.0017224 0.00184929 0.00199978 0.00218091 0.00240287 0.00268086 0.00303879 0.00351641 0.00418512 0.00518736 
0.00119893 0.00124905 0.00130514 0.00136824 0.00143966 0.00152104 0.00161452 0.00172287 0.00184979 0.00200033 0.00218151 0.00240352 0.00268159 0.00303961 0.00351736 0.00418624 0.00518874 
0.00119926 0.0012494 0.0013055 0.00136862 0.00144005 0.00152146 0.00161497 0.00172335 0.0018503 0.00200087 0.00218211 0.00240418 0.00268232 0.00304044 0.0035183 0.00418736 0.00519011 
0.00119959 0.00124974 0.00130586 0.00136899 0.00144045 0.00152188 0.00161541 0.00172382 0.00185081 0.00200142 0.00218271 0.00240484 0.00268305 0.00304126 0.00351925 0.00418848 0.00519149 
0.00119991 0.00125008 0.00130622 0.00136937 0.00144085 0.0015223 0.00161586 0.0017243 0.00185132 0.00200198 0.00218331 0.00240549 0.00268378 0.00304209 0.0035202 0.0041896 0.00519286 
0.00120024 0.00125043 0.00130658 0.00136975 0.00144124 0.00152272 0.0016163 0.00172477 0.00185183 0.00200252 0.00218391 0.00240615 0.00268451 0.00304291 0.00352115 0.00419072 0.00519424 
0.00120057 0.00125077 0.00130694 0.00137013 0.00144164 0.00152314 0.00161675 0.00172525 0.00185234 0.00200308 0.0021845 0.00240681 0.00268524 0.00304373 0.0035221 0.00419184 0.00519562 
0.0012009 0.00125111 0.0013073 0.0013705 0.00144204 0.00152356 0.0016172 0.00172572 0.00185285 0.00200363 0.0021851 0.00240747 0.00268597 0.00304456 0.00352304 0.00419297 0.005197 
0.00120123 0.00125146 0.00130766 0.00137088 0.00144244 0.00152398 0.00161764 0.0017262 0.00185336 0.00200418 0.0021857 0.00240813 0.00268671 0.00304539 0.00352399 0.00419409 0.00519838 
0.00120156 0.0012518 0.00130802 0.00137126 0.00144284 0.0015244 0.00161809 0.00172668 0.00185388 0.00200473 0.0021863 0.00240878 0.00268744 0.00304621 0.00352494 0.00419521 0.00519976 
0.00120189 0.00125214 0.00130838 0.00137164 0.00144323 0.00152482 0.00161853 0.00172715 0.00185439 0.00200528 0.0021869 0.00240944 0.00268817 0.00304704 0.0035259 0.00419633 0.00520113 
0.00120222 0.00125249 0.00130874 0.00137202 0.00144363 0.00152524 0.00161898 0.00172763 0.0018549 0.00200583 0.0021875 0.0024101 0.0026889 0.00304786 0.00352684 0.00419746 0.00520251 
0.00120255 0.00125283 0.0013091 0.00137239 0.00144403 0.00152567 0.00161943 0.00172811 0.00185541 0.00200639 0.0021881 0.00241076 0.00268964 0.00304869 0.0035278 0.00419858 0.00520389 
