0.00988045 0.00988557 0.00988887 0.00989035 0.00989 0.00988784 0.00988385 0.00987803 0.00987038 0.00986089 0.00984957 0.00983641 0.0098214 0.00980455 0.00978585 0.0097653 0.00974289 0.00971862 0.00969249 0.00966449 0.00963461 0.00960287 0.00956924 0.00953373 0.00949634 0.00945705 0.00941587 0.00937279 0.0093278 0.00928091 0.00923212 0.00918141 0.00912879 0.00907426 0.00901782 0.00895947 0.00889923 0.0088371 0.0087731 0.00870727 0.00863963 0.00857025 0.00849923 0.00842668 0.00835281 0.00827796 0.00820267 0.00812794 0.00805576 0.00799074 0.00794537 
0.00961155 0.00961653 0.00961974 0.00962118 0.00962084 0.00961874 0.00961486 0.0096092 0.00960175 0.00959252 0.00958151 0.00956871 0.00955411 0.00953772 0.00951953 0.00949953 0.00947773 0.00945412 0.0094287 0.00940146 0.00937241 0.00934152 0.00930882 0.00927427 0.0092379 0.00919967 0.00915961 0.00911771 0.00907395 0.00902833 0.00898086 0.00893153 0.00888035 0.0088273 0.00877239 0.00871564 0.00865703 0.00859659 0.00853434 0.0084703 0.0084045 0.00833701 0.00826792 0.00819734 0.00812549 0.00805267 0.00797943 0.00790674 0.00783652 0.00777327 0.00772914 
0.0093569 0.00936175 0.00936487 0.00936627 0.00936595 0.0093639 0.00936012 0.00935461 0.00934736 0.00933838 0.00932766 0.00931519 0.00930098 0.00928502 0.00926732 0.00924785 0.00922663 0.00920365 0.0091789 0.00915238 0.00912409 0.00909403 0.00906219 0.00902855 0.00899314 0.00895594 0.00891694 0.00887614 0.00883354 0.00878913 0.00874292 0.0086949 0.00864507 0.00859343 0.00853998 0.00848472 0.00842767 0.00836884 0.00830823 0.00824588 0.00818183 0.00811613 0.00804887 0.00798016 0.00791021 0.00783933 0.00776802 0.00769725 0.0076289 0.00756732 0.00752436 
0.0091154 0.00912012 0.00912316 0.00912453 0.00912421 0.00912221 0.00911853 0.00911316 0.0091061 0.00909735 0.00908691 0.00907477 0.00906092 0.00904538 0.00902812 0.00900916 0.00898849 0.0089661 0.00894199 0.00891616 0.0088886 0.00885931 0.00882829 0.00879553 0.00876103 0.00872478 0.00868679 0.00864705 0.00860554 0.00856228 0.00851727 0.00847048 0.00842194 0.00837163 0.00831956 0.00826573 0.00821015 0.00815283 0.00809379 0.00803305 0.00797066 0.00790665 0.00784112 0.00777419 0.00770605 0.00763699 0.00756753 0.00749859 0.007432 0.00737201 0.00733015 
0.00888604 0.00889065 0.00889361 0.00889495 0.00889464 0.00889269 0.0088891 0.00888387 0.00887699 0.00886846 0.00885827 0.00884644 0.00883294 0.00881779 0.00880097 0.00878248 0.00876233 0.0087405 0.008717 0.00869182 0.00866495 0.0086364 0.00860616 0.00857422 0.00854059 0.00850526 0.00846822 0.00842948 0.00838902 0.00834685 0.00830296 0.00825736 0.00821004 0.00816099 0.00811023 0.00805776 0.00800358 0.0079477 0.00789015 0.00783094 0.00777011 0.00770771 0.00764383 0.00757859 0.00751216 0.00744484 0.00737712 0.00730991 0.007245 0.00718652 0.00714572 
0.00866795 0.00867244 0.00867533 0.00867663 0.00867633 0.00867444 0.00867093 0.00866583 0.00865911 0.00865079 0.00864086 0.00862932 0.00861615 0.00860137 0.00858496 0.00856693 0.00854727 0.00852598 0.00850306 0.00847849 0.00845229 0.00842443 0.00839494 0.00836378 0.00833098 0.00829651 0.00826038 0.00822259 0.00818313 0.00814199 0.00809918 0.0080547 0.00800853 0.0079607 0.00791118 0.00785999 0.00780714 0.00775264 0.0076965 0.00763874 0.0075794 0.00751854 0.00745623 0.00739258 0.00732778 0.00726212 0.00719606 0.00713051 0.00706719 0.00701014 0.00697034 
0.00846031 0.00846469 0.00846751 0.00846878 0.00846849 0.00846664 0.00846322 0.00845823 0.00845168 0.00844356 0.00843387 0.0084226 0.00840975 0.00839532 0.00837931 0.00836171 0.00834252 0.00832174 0.00829936 0.00827539 0.00824981 0.00822262 0.00819383 0.00816343 0.00813141 0.00809776 0.0080625 0.00802562 0.0079871 0.00794695 0.00790516 0.00786174 0.00781669 0.00776999 0.00772166 0.0076717 0.00762012 0.00756692 0.00751212 0.00745575 0.00739784 0.00733843 0.00727761 0.00721549 0.00715224 0.00708815 0.00702368 0.00695969 0.00689789 0.00684221 0.00680336 
0.00826238 0.00826666 0.00826942 0.00827066 0.00827037 0.00826856 0.00826522 0.00826035 0.00825396 0.00824602 0.00823656 0.00822555 0.008213 0.00819891 0.00818327 0.00816608 0.00814735 0.00812705 0.0081052 0.00808178 0.0080568 0.00803026 0.00800214 0.00797244 0.00794117 0.00790832 0.00787388 0.00783786 0.00780024 0.00776103 0.00772022 0.00767782 0.00763382 0.00758821 0.00754101 0.00749222 0.00744185 0.00738989 0.00733638 0.00728132 0.00722476 0.00716675 0.00710735 0.00704668 0.00698492 0.00692232 0.00685936 0.00679687 0.00673651 0.00668214 0.0066442 
0.0080735 0.00807768 0.00808038 0.00808159 0.00808131 0.00807954 0.00807628 0.00807152 0.00806527 0.00805752 0.00804827 0.00803751 0.00802525 0.00801148 0.0079962 0.00797941 0.0079611 0.00794127 0.00791991 0.00789703 0.00787262 0.00784668 0.00781921 0.00779019 0.00775964 0.00772753 0.00769388 0.00765868 0.00762192 0.00758361 0.00754374 0.0075023 0.00745931 0.00741475 0.00736863 0.00732095 0.00727172 0.00722096 0.00716867 0.00711487 0.00705961 0.00700292 0.00694488 0.0068856 0.00682524 0.00676408 0.00670255 0.00664149 0.00658251 0.00652938 0.00649231 
0.00789306 0.00789715 0.00789979 0.00790097 0.00790069 0.00789897 0.00789578 0.00789113 0.00788502 0.00787744 0.00786839 0.00785788 0.00784589 0.00783243 0.00781749 0.00780107 0.00778317 0.00776378 0.00774291 0.00772054 0.00769668 0.00767132 0.00764445 0.00761609 0.00758621 0.00755483 0.00752193 0.00748752 0.00745158 0.00741412 0.00737514 0.00733463 0.0072926 0.00724903 0.00720394 0.00715733 0.00710921 0.00705958 0.00700845 0.00695586 0.00690183 0.00684641 0.00678966 0.00673171 0.0066727 0.0066129 0.00655276 0.00649306 0.0064354 0.00638345 0.00634721 
0.00772052 0.00772451 0.00772709 0.00772825 0.00772798 0.00772629 0.00772317 0.00771862 0.00771264 0.00770523 0.00769639 0.0076861 0.00767438 0.00766121 0.0076466 0.00763053 0.00761303 0.00759406 0.00757364 0.00755176 0.00752842 0.00750362 0.00747734 0.00744959 0.00742037 0.00738967 0.0073575 0.00732383 0.00728868 0.00725204 0.00721391 0.00717429 0.00713317 0.00709056 0.00704646 0.00700087 0.00695379 0.00690525 0.00685524 0.0068038 0.00675095 0.00669674 0.00664124 0.00658455 0.00652683 0.00646834 0.00640951 0.00635112 0.00629472 0.00624391 0.00620846 
0.00755535 0.00755926 0.00756179 0.00756292 0.00756265 0.007561 0.00755795 0.0075535 0.00754765 0.0075404 0.00753174 0.00752167 0.0075102 0.00749731 0.00748301 0.0074673 0.00745016 0.0074316 0.00741162 0.00739021 0.00736737 0.00734309 0.00731738 0.00729022 0.00726163 0.00723159 0.0072001 0.00716715 0.00713275 0.0070969 0.00705959 0.00702081 0.00698057 0.00693888 0.00689572 0.0068511 0.00680503 0.00675752 0.00670859 0.00665824 0.00660653 0.00655348 0.00649916 0.00644369 0.0063872 0.00632996 0.00627239 0.00621525 0.00616005 0.00611033 0.00607564 
0.0073971 0.00740094 0.0074034 0.00740451 0.00740426 0.00740264 0.00739965 0.00739529 0.00738956 0.00738246 0.00737399 0.00736413 0.0073529 0.00734028 0.00732628 0.00731089 0.00729412 0.00727595 0.00725639 0.00723542 0.00721306 0.00718929 0.00716412 0.00713753 0.00710954 0.00708012 0.00704929 0.00701704 0.00698336 0.00694826 0.00691172 0.00687376 0.00683437 0.00679354 0.00675129 0.0067076 0.0066625 0.00661599 0.00656808 0.00651879 0.00646815 0.00641621 0.00636304 0.00630872 0.00625342 0.00619738 0.00614102 0.00608507 0.00603103 0.00598235 0.00594839 
0.00724535 0.0072491 0.00725152 0.00725261 0.00725236 0.00725077 0.00724784 0.00724358 0.00723796 0.00723101 0.00722271 0.00721306 0.00720205 0.0071897 0.00717598 0.00716091 0.00714448 0.00712668 0.00710752 0.00708698 0.00706508 0.0070418 0.00701714 0.0069911 0.00696368 0.00693487 0.00690467 0.00687308 0.0068401 0.00680571 0.00676993 0.00673274 0.00669416 0.00665417 0.00661278 0.00657 0.00652582 0.00648026 0.00643333 0.00638505 0.00633546 0.00628458 0.0062325 0.0061793 0.00612513 0.00607024 0.00601503 0.00596023 0.0059073 0.00585962 0.00582635 
0.0070997 0.00710338 0.00710574 0.00710681 0.00710656 0.00710501 0.00710214 0.00709796 0.00709246 0.00708565 0.00707751 0.00706805 0.00705727 0.00704516 0.00703172 0.00701695 0.00700085 0.00698341 0.00696464 0.00694451 0.00692305 0.00690024 0.00687608 0.00685056 0.00682369 0.00679546 0.00676587 0.00673491 0.00670259 0.0066689 0.00663383 0.0065974 0.00655959 0.0065204 0.00647984 0.00643792 0.00639463 0.00634999 0.006304 0.0062567 0.0062081 0.00615825 0.00610721 0.00605508 0.006002 0.00594821 0.00589411 0.00584041 0.00578855 0.00574183 0.00570923 
0.00695979 0.00696339 0.00696572 0.00696676 0.00696652 0.00696499 0.00696218 0.00695808 0.00695269 0.00694601 0.00693804 0.00692877 0.0069182 0.00690632 0.00689315 0.00687867 0.00686289 0.00684579 0.00682739 0.00680766 0.00678662 0.00676426 0.00674057 0.00671556 0.00668922 0.00666154 0.00663254 0.00660219 0.0065705 0.00653747 0.0065031 0.00646738 0.00643032 0.00639191 0.00635215 0.00631105 0.00626861 0.00622485 0.00617977 0.0061334 0.00608576 0.00603689 0.00598685 0.00593575 0.00588372 0.00583099 0.00577796 0.00572532 0.00567448 0.00562868 0.00559672 
0.00682528 0.00682882 0.0068311 0.00683212 0.00683188 0.00683039 0.00682763 0.00682361 0.00681833 0.00681177 0.00680395 0.00679486 0.0067845 0.00677286 0.00675994 0.00674574 0.00673026 0.00671349 0.00669544 0.0066761 0.00665546 0.00663353 0.00661031 0.00658578 0.00655995 0.00653281 0.00650436 0.0064746 0.00644352 0.00641113 0.00637742 0.0063424 0.00630605 0.00626838 0.00622939 0.00618908 0.00614747 0.00610455 0.00606034 0.00601487 0.00596814 0.00592022 0.00587115 0.00582104 0.00577001 0.00571831 0.00566629 0.00561468 0.00556481 0.0055199 0.00548856 
0.00669588 0.00669935 0.00670158 0.00670259 0.00670235 0.00670089 0.00669818 0.00669424 0.00668905 0.00668263 0.00667495 0.00666603 0.00665586 0.00664444 0.00663177 0.00661784 0.00660266 0.00658621 0.0065685 0.00654953 0.00652928 0.00650777 0.00648498 0.00646091 0.00643557 0.00640895 0.00638104 0.00635184 0.00632136 0.00628958 0.00625651 0.00622215 0.00618649 0.00614953 0.00611128 0.00607174 0.00603091 0.00598881 0.00594544 0.00590083 0.00585499 0.00580798 0.00575984 0.00571067 0.00566062 0.00560989 0.00555886 0.00550822 0.00545931 0.00541524 0.0053845 
0.00657129 0.0065747 0.00657689 0.00657788 0.00657765 0.00657621 0.00657355 0.00656968 0.00656459 0.00655828 0.00655076 0.006542 0.00653202 0.00652081 0.00650838 0.00649471 0.0064798 0.00646366 0.00644628 0.00642766 0.00640779 0.00638668 0.00636432 0.0063407 0.00631583 0.0062897 0.00626231 0.00623366 0.00620374 0.00617255 0.0061401 0.00610637 0.00607138 0.00603511 0.00599757 0.00595877 0.0059187 0.00587738 0.00583482 0.00579103 0.00574605 0.00569991 0.00565267 0.00560442 0.00555529 0.00550551 0.00545543 0.00540573 0.00535773 0.00531448 0.00528431 
0.00645126 0.0064546 0.00645675 0.00645772 0.00645749 0.00645608 0.00645348 0.00644967 0.00644468 0.00643849 0.00643109 0.0064225 0.0064127 0.0064017 0.00638949 0.00637607 0.00636144 0.00634559 0.00632853 0.00631025 0.00629074 0.00627002 0.00624806 0.00622487 0.00620046 0.00617481 0.00614792 0.00611979 0.00609042 0.0060598 0.00602794 0.00599483 0.00596047 0.00592487 0.00588802 0.00584992 0.00581059 0.00577002 0.00572823 0.00568525 0.00564109 0.00559579 0.00554941 0.00550204 0.00545381 0.00540494 0.00535578 0.00530699 0.00525986 0.00521741 0.00518778 
0.00633553 0.00633881 0.00634092 0.00634187 0.00634165 0.00634026 0.00633771 0.00633397 0.00632907 0.00632299 0.00631573 0.00630729 0.00629767 0.00628686 0.00627487 0.00626169 0.00624732 0.00623176 0.006215 0.00619705 0.00617789 0.00615754 0.00613598 0.0061132 0.00608923 0.00606403 0.00603763 0.00601001 0.00598116 0.00595109 0.0059198 0.00588729 0.00585355 0.00581858 0.00578239 0.00574498 0.00570635 0.00566651 0.00562548 0.00558326 0.00553989 0.00549541 0.00544986 0.00540334 0.00535598 0.00530798 0.0052597 0.00521178 0.0051655 0.00512381 0.00509472 
0.00622388 0.0062271 0.00622918 0.00623011 0.00622989 0.00622853 0.00622602 0.00622235 0.00621753 0.00621155 0.00620442 0.00619613 0.00618668 0.00617607 0.00616429 0.00615134 0.00613722 0.00612194 0.00610548 0.00608784 0.00606902 0.00604902 0.00602784 0.00600547 0.00598192 0.00595717 0.00593123 0.00590409 0.00587575 0.00584622 0.00581548 0.00578354 0.00575039 0.00571604 0.00568049 0.00564373 0.00560579 0.00556665 0.00552634 0.00548487 0.00544226 0.00539856 0.00535382 0.00530812 0.00526159 0.00521444 0.00516701 0.00511994 0.00507447 0.00503351 0.00500494 
0.00611609 0.00611926 0.0061213 0.00612222 0.00612201 0.00612067 0.0061182 0.00611459 0.00610986 0.00610399 0.00609698 0.00608883 0.00607954 0.00606911 0.00605754 0.00604481 0.00603094 0.00601592 0.00599974 0.00598241 0.00596392 0.00594427 0.00592345 0.00590147 0.00587833 0.005854 0.00582851 0.00580185 0.005774 0.00574497 0.00571477 0.00568338 0.00565081 0.00561705 0.00558211 0.005546 0.00550871 0.00547025 0.00543063 0.00538988 0.00534801 0.00530507 0.0052611 0.00521619 0.00517047 0.00512414 0.00507753 0.00503127 0.00498659 0.00494634 0.00491826 
0.00601198 0.00601509 0.0060171 0.006018 0.00601779 0.00601648 0.00601405 0.0060105 0.00600585 0.00600008 0.00599319 0.00598518 0.00597605 0.0059658 0.00595442 0.00594191 0.00592828 0.00591351 0.00589761 0.00588057 0.0058624 0.00584308 0.00582262 0.00580101 0.00577826 0.00575435 0.00572929 0.00570308 0.00567571 0.00564718 0.00561749 0.00558663 0.00555461 0.00552143 0.00548709 0.00545159 0.00541493 0.00537713 0.00533819 0.00529813 0.00525698 0.00521476 0.00517154 0.0051274 0.00508245 0.00503691 0.0049911 0.00494563 0.00490171 0.00486214 0.00483454 
0.00591135 0.00591441 0.00591638 0.00591727 0.00591707 0.00591577 0.00591338 0.0059099 0.00590532 0.00589965 0.00589288 0.005885 0.00587602 0.00586594 0.00585475 0.00584245 0.00582905 0.00581453 0.0057989 0.00578214 0.00576427 0.00574528 0.00572516 0.00570391 0.00568154 0.00565804 0.0056334 0.00560762 0.00558071 0.00555266 0.00552346 0.00549312 0.00546164 0.00542902 0.00539525 0.00536034 0.0053243 0.00528713 0.00524884 0.00520945 0.00516898 0.00512748 0.00508498 0.00504158 0.00499738 0.0049526 0.00490755 0.00486285 0.00481966 0.00478076 0.00475362 
0.00581403 0.00581705 0.00581899 0.00581986 0.00581966 0.00581838 0.00581604 0.00581261 0.00580811 0.00580253 0.00579586 0.00578812 0.00577929 0.00576937 0.00575837 0.00574627 0.00573309 0.00571881 0.00570343 0.00568695 0.00566938 0.0056507 0.00563091 0.00561001 0.00558801 0.00556489 0.00554066 0.00551531 0.00548884 0.00546124 0.00543253 0.00540269 0.00537173 0.00533964 0.00530643 0.0052721 0.00523664 0.00520009 0.00516243 0.00512369 0.00508389 0.00504307 0.00500127 0.00495858 0.00491512 0.00487107 0.00482677 0.00478279 0.00474032 0.00470206 0.00467536 
0.00571987 0.00572283 0.00572474 0.0057256 0.0057254 0.00572415 0.00572184 0.00571847 0.00571404 0.00570855 0.00570199 0.00569438 0.00568569 0.00567593 0.00566511 0.00565321 0.00564024 0.00562619 0.00561106 0.00559485 0.00557756 0.00555918 0.00553971 0.00551915 0.00549751 0.00547476 0.00545092 0.00542598 0.00539994 0.0053728 0.00534455 0.00531519 0.00528473 0.00525316 0.00522049 0.00518671 0.00515183 0.00511587 0.00507882 0.00504071 0.00500155 0.00496139 0.00492027 0.00487827 0.00483551 0.00479218 0.00474859 0.00470533 0.00466355 0.0046259 0.00459964 
0.00562871 0.00563163 0.0056335 0.00563435 0.00563415 0.00563292 0.00563065 0.00562733 0.00562297 0.00561757 0.00561112 0.00560362 0.00559507 0.00558547 0.00557482 0.00556311 0.00555034 0.00553652 0.00552163 0.00550568 0.00548866 0.00547058 0.00545142 0.00543119 0.00540989 0.00538751 0.00536405 0.0053395 0.00531388 0.00528717 0.00525937 0.00523048 0.0052005 0.00516944 0.00513728 0.00510404 0.00506973 0.00503433 0.00499787 0.00496037 0.00492184 0.00488232 0.00484185 0.00480052 0.00475844 0.0047158 0.00467291 0.00463034 0.00458922 0.00455218 0.00452633 
0.00554041 0.00554328 0.00554513 0.00554596 0.00554576 0.00554455 0.00554232 0.00553905 0.00553476 0.00552944 0.00552309 0.00551571 0.0055073 0.00549785 0.00548736 0.00547584 0.00546327 0.00544966 0.00543501 0.00541931 0.00540256 0.00538476 0.0053659 0.00534599 0.00532502 0.00530299 0.0052799 0.00525574 0.00523052 0.00520422 0.00517686 0.00514842 0.00511892 0.00508834 0.00505669 0.00502398 0.00499019 0.00495535 0.00491947 0.00488255 0.00484463 0.00480572 0.0047659 0.00472521 0.0046838 0.00464182 0.0045996 0.0045577 0.00451722 0.00448076 0.00445532 
0.00545484 0.00545766 0.00545948 0.0054603 0.00546011 0.00545891 0.00545671 0.0054535 0.00544927 0.00544404 0.00543779 0.00543052 0.00542224 0.00541293 0.00540261 0.00539126 0.00537889 0.00536549 0.00535106 0.00533561 0.00531911 0.00530159 0.00528302 0.00526342 0.00524277 0.00522108 0.00519835 0.00517456 0.00514973 0.00512384 0.0050969 0.00506891 0.00503986 0.00500975 0.00497859 0.00494638 0.00491312 0.00487882 0.00484349 0.00480714 0.0047698 0.0047315 0.00469228 0.00465223 0.00461145 0.00457013 0.00452856 0.0044873 0.00444745 0.00441156 0.00438651 
0.00537186 0.00537465 0.00537644 0.00537724 0.00537706 0.00537588 0.00537371 0.00537055 0.00536639 0.00536123 0.00535507 0.00534792 0.00533976 0.0053306 0.00532043 0.00530926 0.00529707 0.00528388 0.00526967 0.00525445 0.00523821 0.00522095 0.00520267 0.00518336 0.00516303 0.00514167 0.00511928 0.00509586 0.0050714 0.0050459 0.00501937 0.00499181 0.0049632 0.00493355 0.00490286 0.00487114 0.00483839 0.00480461 0.00476981 0.00473402 0.00469725 0.00465953 0.00462091 0.00458147 0.00454131 0.00450061 0.00445968 0.00441905 0.00437981 0.00434446 0.00431979 
0.00529138 0.00529412 0.00529589 0.00529668 0.0052965 0.00529534 0.0052932 0.00529008 0.00528598 0.00528091 0.00527484 0.0052678 0.00525976 0.00525073 0.00524072 0.00522971 0.00521771 0.00520471 0.00519072 0.00517572 0.00515972 0.00514272 0.00512472 0.0051057 0.00508567 0.00506463 0.00504258 0.00501951 0.00499542 0.0049703 0.00494417 0.00491701 0.00488884 0.00485963 0.0048294 0.00479816 0.0047659 0.00473262 0.00469835 0.00466309 0.00462687 0.00458972 0.00455168 0.00451283 0.00447327 0.00443318 0.00439286 0.00435284 0.00431419 0.00427936 0.00425507 
0.00521327 0.00521597 0.00521771 0.00521849 0.00521831 0.00521717 0.00521507 0.00521199 0.00520796 0.00520295 0.00519698 0.00519003 0.00518212 0.00517323 0.00516336 0.00515251 0.00514069 0.00512788 0.0051141 0.00509932 0.00508356 0.00506681 0.00504907 0.00503033 0.0050106 0.00498987 0.00496814 0.00494541 0.00492168 0.00489694 0.00487119 0.00484443 0.00481667 0.0047879 0.00475812 0.00472733 0.00469554 0.00466276 0.004629 0.00459426 0.00455857 0.00452197 0.00448449 0.00444621 0.00440724 0.00436774 0.00432802 0.00428859 0.0042505 0.00421619 0.00419226 
0.00513744 0.0051401 0.00514181 0.00514258 0.0051424 0.00514128 0.0051392 0.00513618 0.0051322 0.00512727 0.00512138 0.00511454 0.00510673 0.00509797 0.00508825 0.00507756 0.00506591 0.00505329 0.0050397 0.00502514 0.00500961 0.0049931 0.00497562 0.00495716 0.00493771 0.00491729 0.00489587 0.00487347 0.00485008 0.0048257 0.00480033 0.00477396 0.0047466 0.00471825 0.0046889 0.00465856 0.00462724 0.00459493 0.00456166 0.00452743 0.00449226 0.00445619 0.00441926 0.00438153 0.00434313 0.00430421 0.00426506 0.0042262 0.00418867 0.00415486 0.00413127 
0.00506377 0.0050664 0.00506809 0.00506885 0.00506867 0.00506756 0.00506552 0.00506253 0.00505861 0.00505375 0.00504795 0.0050412 0.00503351 0.00502488 0.00501529 0.00500476 0.00499327 0.00498084 0.00496744 0.00495309 0.00493778 0.00492151 0.00490428 0.00488608 0.00486692 0.00484678 0.00482567 0.0048036 0.00478054 0.00475651 0.0047315 0.00470551 0.00467855 0.0046506 0.00462167 0.00459177 0.00456089 0.00452905 0.00449625 0.00446251 0.00442785 0.00439229 0.00435589 0.00431871 0.00428085 0.00424249 0.0042039 0.00416561 0.00412861 0.00409529 0.00407204 
0.0049922 0.00499478 0.00499645 0.0049972 0.00499702 0.00499593 0.00499391 0.00499097 0.00498711 0.00498231 0.00497659 0.00496994 0.00496236 0.00495385 0.0049444 0.00493401 0.00492269 0.00491043 0.00489723 0.00488308 0.00486799 0.00485195 0.00483496 0.00481701 0.00479812 0.00477827 0.00475746 0.0047357 0.00471297 0.00468927 0.00466462 0.004639 0.00461241 0.00458486 0.00455634 0.00452686 0.00449642 0.00446503 0.0044327 0.00439943 0.00436526 0.00433021 0.00429432 0.00425766 0.00422034 0.00418252 0.00414448 0.00410672 0.00407026 0.0040374 0.00401448 
0.00492261 0.00492516 0.00492681 0.00492754 0.00492737 0.00492629 0.00492431 0.00492141 0.00491759 0.00491287 0.00490723 0.00490067 0.00489319 0.0048848 0.00487548 0.00486524 0.00485408 0.00484198 0.00482897 0.00481502 0.00480013 0.00478432 0.00476757 0.00474987 0.00473124 0.00471167 0.00469115 0.00466969 0.00464728 0.00462391 0.0045996 0.00457434 0.00454812 0.00452096 0.00449283 0.00446377 0.00443375 0.0044028 0.00437091 0.00433811 0.00430441 0.00426985 0.00423446 0.00419832 0.00416152 0.00412422 0.00408671 0.00404948 0.00401352 0.00398113 0.00395852 
0.00485494 0.00485746 0.00485908 0.0048598 0.00485964 0.00485857 0.00485661 0.00485375 0.00484999 0.00484533 0.00483977 0.0048333 0.00482593 0.00481765 0.00480846 0.00479836 0.00478735 0.00477542 0.00476258 0.00474882 0.00473415 0.00471855 0.00470203 0.00468458 0.0046662 0.0046469 0.00462666 0.00460549 0.00458339 0.00456035 0.00453637 0.00451146 0.0044856 0.00445881 0.00443107 0.0044024 0.0043728 0.00434227 0.00431083 0.00427848 0.00424525 0.00421115 0.00417626 0.00414061 0.00410431 0.00406753 0.00403053 0.00399381 0.00395835 0.0039264 0.00390411 
0.00478911 0.00479159 0.00479319 0.0047939 0.00479374 0.00479269 0.00479076 0.00478793 0.00478422 0.00477963 0.00477414 0.00476776 0.00476049 0.00475232 0.00474325 0.00473329 0.00472243 0.00471067 0.004698 0.00468443 0.00466995 0.00465456 0.00463826 0.00462105 0.00460293 0.00458388 0.00456392 0.00454304 0.00452124 0.00449851 0.00447486 0.00445028 0.00442478 0.00439834 0.00437098 0.0043427 0.0043135 0.00428339 0.00425237 0.00422046 0.00418768 0.00415405 0.00411962 0.00408446 0.00404865 0.00401237 0.00397588 0.00393966 0.00390467 0.00387315 0.00385117 
0.00472503 0.00472748 0.00472906 0.00472977 0.0047296 0.00472857 0.00472666 0.00472388 0.00472022 0.00471568 0.00471027 0.00470397 0.0046968 0.00468874 0.0046798 0.00466997 0.00465925 0.00464764 0.00463515 0.00462176 0.00460747 0.00459229 0.00457621 0.00455923 0.00454134 0.00452256 0.00450286 0.00448226 0.00446075 0.00443832 0.00441499 0.00439074 0.00436557 0.0043395 0.0043125 0.0042846 0.00425579 0.00422608 0.00419548 0.00416399 0.00413165 0.00409847 0.00406451 0.00402981 0.00399449 0.00395869 0.00392269 0.00388695 0.00385243 0.00382134 0.00379964 
0.00466265 0.00466507 0.00466662 0.00466732 0.00466716 0.00466614 0.00466426 0.00466151 0.0046579 0.00465342 0.00464808 0.00464187 0.00463479 0.00462684 0.00461801 0.00460831 0.00459774 0.00458628 0.00457395 0.00456074 0.00454664 0.00453166 0.00451579 0.00449903 0.00448139 0.00446285 0.00444341 0.00442308 0.00440186 0.00437973 0.0043567 0.00433277 0.00430794 0.00428221 0.00425557 0.00422804 0.00419961 0.00417029 0.00414009 0.00410902 0.0040771 0.00404436 0.00401085 0.00397661 0.00394175 0.00390643 0.0038709 0.00383563 0.00380157 0.00377089 0.00374948 
0.0046019 0.00460428 0.00460582 0.00460651 0.00460635 0.00460534 0.00460348 0.00460077 0.00459721 0.00459279 0.00458751 0.00458139 0.0045744 0.00456655 0.00455784 0.00454826 0.00453783 0.00452652 0.00451435 0.00450131 0.0044874 0.00447261 0.00445695 0.00444041 0.004423 0.0044047 0.00438552 0.00436545 0.0043445 0.00432266 0.00429993 0.00427631 0.00425181 0.00422641 0.00420012 0.00417294 0.00414488 0.00411595 0.00408614 0.00405548 0.00402398 0.00399166 0.00395858 0.00392479 0.00389039 0.00385552 0.00382046 0.00378565 0.00375203 0.00372175 0.00370062 
0.0045427 0.00454506 0.00454657 0.00454725 0.0045471 0.0045461 0.00454427 0.00454159 0.00453807 0.00453371 0.00452851 0.00452246 0.00451556 0.00450781 0.00449921 0.00448976 0.00447946 0.0044683 0.00445629 0.00444341 0.00442968 0.00441508 0.00439962 0.0043833 0.0043661 0.00434804 0.00432911 0.0043093 0.00428862 0.00426706 0.00424462 0.00422131 0.00419712 0.00417204 0.00414609 0.00411927 0.00409157 0.00406301 0.00403358 0.00400331 0.00397222 0.00394032 0.00390766 0.00387431 0.00384035 0.00380593 0.00377132 0.00373696 0.00370377 0.00367388 0.00365302 
0.00448502 0.00448734 0.00448884 0.00448951 0.00448935 0.00448837 0.00448656 0.00448392 0.00448044 0.00447614 0.004471 0.00446502 0.00445821 0.00445056 0.00444207 0.00443274 0.00442257 0.00441156 0.00439969 0.00438698 0.00437342 0.00435901 0.00434375 0.00432763 0.00431066 0.00429282 0.00427413 0.00425457 0.00423415 0.00421287 0.00419072 0.0041677 0.00414382 0.00411906 0.00409344 0.00406696 0.00403961 0.00401141 0.00398236 0.00395247 0.00392177 0.00389028 0.00385804 0.00382511 0.00379158 0.0037576 0.00372342 0.0036895 0.00365674 0.00362722 0.00360663 
0.00442877 0.00443107 0.00443255 0.00443321 0.00443305 0.00443208 0.0044303 0.00442769 0.00442426 0.00442001 0.00441493 0.00440903 0.00440231 0.00439475 0.00438637 0.00437716 0.00436711 0.00435623 0.00434452 0.00433197 0.00431858 0.00430435 0.00428928 0.00427336 0.0042566 0.00423899 0.00422053 0.00420122 0.00418106 0.00416004 0.00413817 0.00411544 0.00409185 0.00406741 0.00404211 0.00401596 0.00398895 0.0039611 0.00393242 0.00390291 0.00387259 0.0038415 0.00380966 0.00377714 0.00374403 0.00371048 0.00367673 0.00364324 0.00361088 0.00358174 0.0035614 
0.00437392 0.00437619 0.00437765 0.0043783 0.00437815 0.00437719 0.00437543 0.00437285 0.00436946 0.00436526 0.00436025 0.00435443 0.00434778 0.00434032 0.00433205 0.00432295 0.00431303 0.00430228 0.00429072 0.00427832 0.0042651 0.00425104 0.00423616 0.00422044 0.00420388 0.00418649 0.00416826 0.00414919 0.00412928 0.00410852 0.00408692 0.00406447 0.00404118 0.00401704 0.00399205 0.00396622 0.00393955 0.00391205 0.00388372 0.00385457 0.00382463 0.00379392 0.00376248 0.00373036 0.00369766 0.00366453 0.0036312 0.00359812 0.00356616 0.00353738 0.00351729 
0.00432042 0.00432265 0.0043241 0.00432474 0.00432459 0.00432365 0.0043219 0.00431936 0.00431601 0.00431186 0.00430691 0.00430116 0.0042946 0.00428723 0.00427905 0.00427006 0.00426026 0.00424965 0.00423823 0.00422598 0.00421292 0.00419904 0.00418433 0.00416881 0.00415246 0.00413528 0.00411727 0.00409843 0.00407876 0.00405826 0.00403692 0.00401475 0.00399174 0.00396789 0.00394321 0.0039177 0.00389136 0.00386419 0.00383621 0.00380742 0.00377784 0.00374751 0.00371645 0.00368473 0.00365243 0.0036197 0.00358677 0.0035541 0.00352254 0.0034941 0.00347427 
0.0042682 0.00427041 0.00427184 0.00427248 0.00427233 0.00427139 0.00426967 0.00426716 0.00426385 0.00425975 0.00425486 0.00424918 0.0042427 0.00423542 0.00422734 0.00421846 0.00420878 0.00419829 0.004187 0.00417491 0.00416201 0.00414829 0.00413377 0.00411843 0.00410227 0.0040853 0.00406751 0.0040489 0.00402947 0.00400921 0.00398813 0.00396623 0.0039435 0.00391994 0.00389556 0.00387035 0.00384433 0.00381749 0.00378984 0.0037614 0.00373219 0.00370222 0.00367153 0.0036402 0.00360829 0.00357595 0.00354343 0.00351114 0.00347996 0.00345187 0.00343228 
0.00421723 0.00421942 0.00422083 0.00422146 0.00422131 0.00422039 0.00421868 0.0042162 0.00421294 0.00420889 0.00420405 0.00419844 0.00419203 0.00418484 0.00417686 0.00416808 0.00415852 0.00414816 0.00413701 0.00412505 0.00411231 0.00409876 0.0040844 0.00406925 0.00405329 0.00403652 0.00401894 0.00400055 0.00398135 0.00396134 0.00394051 0.00391887 0.00389641 0.00387313 0.00384904 0.00382414 0.00379842 0.00377191 0.00374459 0.00371649 0.00368762 0.00365801 0.00362769 0.00359673 0.0035652 0.00353325 0.00350111 0.00346922 0.00343841 0.00341066 0.00339129 
0.00416747 0.00416963 0.00417102 0.00417164 0.0041715 0.00417059 0.0041689 0.00416645 0.00416322 0.00415922 0.00415444 0.0041489 0.00414257 0.00413546 0.00412757 0.0041189 0.00410945 0.00409921 0.00408819 0.00407638 0.00406378 0.00405039 0.00403621 0.00402123 0.00400546 0.00398889 0.00397152 0.00395334 0.00393437 0.00391459 0.00389401 0.00387262 0.00385043 0.00382743 0.00380362 0.00377901 0.0037536 0.0037274 0.0037004 0.00367263 0.00364411 0.00361484 0.00358489 0.00355428 0.00352313 0.00349156 0.0034598 0.00342828 0.00339784 0.00337041 0.00335127 
0.00411887 0.004121 0.00412237 0.00412299 0.00412285 0.00412195 0.00412028 0.00411786 0.00411467 0.00411071 0.00410599 0.00410051 0.00409425 0.00408723 0.00407943 0.00407086 0.00406152 0.0040514 0.00404051 0.00402884 0.00401639 0.00400315 0.00398914 0.00397433 0.00395874 0.00394236 0.0039252 0.00390724 0.00388849 0.00386894 0.0038486 0.00382746 0.00380552 0.00378279 0.00375926 0.00373494 0.00370982 0.00368392 0.00365725 0.0036298 0.00360161 0.00357269 0.00354308 0.00351283 0.00348204 0.00345084 0.00341945 0.0033883 0.00335821 0.0033311 0.00331219 
