0.000949356 0.00098814 0.00103163 0.00108067 0.00113626 0.00119973 0.00127275 0.00135751 0.00145693 0.00157498 0.00171723 0.0018917 0.0021104 0.00239223 0.00276857 0.00329586 0.00408677 
0.00095092 0.000989815 0.00103343 0.00108259 0.00113833 0.00120196 0.00127516 0.00136012 0.00145977 0.00157808 0.00172065 0.0018955 0.00211468 0.0023971 0.00277423 0.00330261 0.00409514 
0.000952559 0.000991565 0.0010353 0.00108459 0.00114048 0.00120427 0.00127765 0.00136281 0.0014627 0.00158129 0.00172417 0.00189941 0.00211907 0.00240211 0.00278004 0.00330954 0.00410373 
0.000954268 0.000993387 0.00103724 0.00108667 0.00114271 0.00120666 0.00128022 0.00136559 0.00146572 0.00158459 0.0017278 0.00190344 0.00212359 0.00240724 0.002786 0.00331664 0.00411252 
0.000956045 0.000995278 0.00103926 0.00108882 0.001145 0.00120912 0.00128287 0.00136846 0.00146882 0.00158797 0.00173152 0.00190756 0.00212821 0.0024125 0.0027921 0.00332391 0.0041215 
0.000957886 0.000997233 0.00104134 0.00109104 0.00114737 0.00121166 0.0012856 0.00137139 0.001472 0.00159145 0.00173534 0.00191179 0.00213295 0.00241788 0.00279833 0.00333132 0.00413067 
0.000959788 0.00099925 0.00104348 0.00109332 0.00114981 0.00121426 0.00128839 0.00137441 0.00147527 0.001595 0.00173924 0.0019161 0.00213778 0.00242337 0.00280469 0.00333888 0.00414002 
0.000961748 0.00100133 0.00104569 0.00109566 0.0011523 0.00121693 0.00129125 0.00137749 0.0014786 0.00159863 0.00174322 0.00192051 0.00214271 0.00242897 0.00281117 0.00334659 0.00414954 
0.000963764 0.00100346 0.00104795 0.00109806 0.00115486 0.00121966 0.00129418 0.00138064 0.00148201 0.00160234 0.00174728 0.001925 0.00214773 0.00243467 0.00281776 0.00335442 0.00415921 
0.000965833 0.00100565 0.00105026 0.00110052 0.00115748 0.00122245 0.00129717 0.00138385 0.00148548 0.00160611 0.00175141 0.00192957 0.00215284 0.00244047 0.00282447 0.00336238 0.00416904 
0.000967952 0.00100789 0.00105263 0.00110303 0.00116014 0.0012253 0.00130022 0.00138713 0.00148902 0.00160996 0.00175562 0.00193422 0.00215804 0.00244636 0.00283128 0.00337047 0.00417902 
0.000970119 0.00101017 0.00105505 0.0011056 0.00116287 0.0012282 0.00130332 0.00139046 0.00149262 0.00161386 0.0017599 0.00193894 0.00216331 0.00245234 0.00283819 0.00337867 0.00418913 
0.000972333 0.00101251 0.00105752 0.00110821 0.00116564 0.00123116 0.00130647 0.00139385 0.00149627 0.00161783 0.00176424 0.00194373 0.00216866 0.0024584 0.00284519 0.00338698 0.00419938 
0.000974591 0.00101489 0.00106003 0.00111087 0.00116846 0.00123416 0.00130968 0.00139729 0.00149999 0.00162186 0.00176864 0.00194859 0.00217409 0.00246455 0.00285229 0.0033954 0.00420976 
0.000976891 0.00101731 0.00106258 0.00111357 0.00117133 0.00123721 0.00131294 0.00140078 0.00150375 0.00162595 0.00177311 0.00195352 0.00217958 0.00247077 0.00285948 0.00340392 0.00422026 
0.000979232 0.00101977 0.00106518 0.00111631 0.00117424 0.0012403 0.00131624 0.00140432 0.00150757 0.00163008 0.00177763 0.0019585 0.00218514 0.00247706 0.00286674 0.00341254 0.00423088 
0.000981611 0.00102227 0.00106782 0.0011191 0.00117719 0.00124344 0.00131959 0.00140791 0.00151143 0.00163427 0.00178221 0.00196355 0.00219077 0.00248343 0.00287409 0.00342125 0.00424161 
