0.000736124 0.000762713 0.000792955 0.000827485 0.000867102 0.000912809 0.000965898 0.00102805 0.00110151 0.00118932 0.00129575 0.00142692 0.00159203 0.00180545 0.00209111 0.0024919 0.00309325 
0.000733028 0.000759514 0.000789637 0.000824031 0.000863491 0.000909016 0.000961892 0.00102379 0.00109696 0.00118441 0.0012904 0.00142104 0.00158546 0.00179801 0.00208248 0.00248158 0.00308039 
0.000729969 0.000756352 0.000786359 0.000820619 0.000859922 0.000905267 0.000957933 0.00101959 0.00109246 0.00117956 0.00128512 0.00141523 0.00157898 0.00179065 0.00207394 0.00247138 0.00306767 
0.000726947 0.000753229 0.000783119 0.000817246 0.000856396 0.000901563 0.000954021 0.00101543 0.00108801 0.00117477 0.0012799 0.00140948 0.00157257 0.00178337 0.0020655 0.0024613 0.0030551 
0.000723961 0.000750143 0.000779918 0.000813913 0.000852912 0.000897903 0.000950156 0.00101133 0.00108362 0.00117003 0.00127474 0.0014038 0.00156623 0.00177618 0.00205716 0.00245134 0.00304268 
0.00072101 0.000747093 0.000776754 0.00081062 0.000849468 0.000894285 0.000946335 0.00100727 0.00107927 0.00116534 0.00126965 0.00139819 0.00155997 0.00176908 0.00204892 0.00244149 0.0030304 
0.000718093 0.000744078 0.000773627 0.000807364 0.000846065 0.000890709 0.000942559 0.00100325 0.00107498 0.00116071 0.00126461 0.00139264 0.00155378 0.00176205 0.00204077 0.00243175 0.00301826 
0.00071521 0.000741098 0.000770537 0.000804147 0.000842701 0.000887175 0.000938825 0.000999286 0.00107074 0.00115614 0.00125962 0.00138716 0.00154766 0.0017551 0.00203271 0.00242212 0.00300625 
0.000712359 0.000738152 0.000767481 0.000800965 0.000839374 0.000883681 0.000935135 0.000995365 0.00106654 0.00115161 0.0012547 0.00138173 0.00154161 0.00174824 0.00202474 0.0024126 0.00299438 
0.000709542 0.00073524 0.000764461 0.00079782 0.000836084 0.000880225 0.000931485 0.000991487 0.00106239 0.00114714 0.00124982 0.00137637 0.00153562 0.00174145 0.00201686 0.00240318 0.00298264 
0.000706756 0.00073236 0.000761474 0.00079471 0.000832833 0.000876809 0.000927876 0.000987653 0.00105829 0.00114271 0.00124501 0.00137107 0.00152971 0.00173473 0.00200907 0.00239387 0.00297102 
0.000704002 0.000729513 0.000758521 0.000791635 0.000829618 0.000873431 0.000924309 0.000983862 0.00105423 0.00113834 0.00124024 0.00136583 0.00152385 0.00172809 0.00200137 0.00238466 0.00295954 
0.000701277 0.000726697 0.0007556 0.000788594 0.000826438 0.00087009 0.00092078 0.000980112 0.00105022 0.00113401 0.00123553 0.00136064 0.00151807 0.00172152 0.00199374 0.00237555 0.00294818 
0.000698584 0.000723913 0.000752711 0.000785587 0.000823293 0.000866786 0.000917291 0.000976403 0.00104625 0.00112973 0.00123087 0.00135551 0.00151234 0.00171502 0.0019862 0.00236654 0.00293694 
0.000695919 0.000721158 0.000749855 0.000782612 0.000820183 0.000863518 0.000913837 0.000972735 0.00104233 0.00112549 0.00122626 0.00135043 0.00150668 0.00170859 0.00197875 0.00235763 0.00292582 
0.000693284 0.000718435 0.000747029 0.00077967 0.000817106 0.000860285 0.000910423 0.000969106 0.00103844 0.0011213 0.0012217 0.00134541 0.00150107 0.00170223 0.00197137 0.0023488 0.00291482 
0.000690677 0.00071574 0.000744234 0.000776759 0.000814062 0.000857087 0.000907044 0.000965515 0.0010346 0.00111716 0.00121719 0.00134044 0.00149553 0.00169594 0.00196406 0.00234008 0.00290393 
