0.000516882 0.00053684 0.000559311 0.000584732 0.000613653 0.000646769 0.000684969 0.000729421 0.000781673 0.000843838 0.000918869 0.00101103 0.00112669 0.00127587 0.00147524 0.00175472 0.00217404 
0.000516794 0.000536754 0.000559225 0.000584647 0.000613569 0.000646685 0.000684886 0.000729337 0.000781588 0.000843752 0.000918781 0.00101094 0.0011266 0.00127577 0.00147513 0.0017546 0.00217391 
0.000516707 0.000536669 0.000559141 0.000584564 0.000613486 0.000646602 0.000684803 0.000729254 0.000781505 0.000843667 0.000918694 0.00101085 0.0011265 0.00127567 0.00147502 0.00175448 0.00217377 
0.000516621 0.000536584 0.000559057 0.000584481 0.000613404 0.00064652 0.000684722 0.000729172 0.000781422 0.000843583 0.000918609 0.00101076 0.00112641 0.00127558 0.00147492 0.00175436 0.00217364 
0.000516536 0.000536499 0.000558973 0.000584398 0.000613322 0.000646439 0.00068464 0.000729091 0.00078134 0.0008435 0.000918524 0.00101067 0.00112632 0.00127548 0.00147482 0.00175425 0.00217351 
0.000516451 0.000536415 0.00055889 0.000584316 0.00061324 0.000646358 0.000684559 0.00072901 0.000781258 0.000843417 0.000918439 0.00101058 0.00112623 0.00127539 0.00147471 0.00175414 0.00217339 
0.000516366 0.000536332 0.000558808 0.000584235 0.00061316 0.000646278 0.00068448 0.000728929 0.000781178 0.000843335 0.000918356 0.0010105 0.00112614 0.00127529 0.00147461 0.00175403 0.00217326 
0.000516282 0.000536249 0.000558727 0.000584154 0.00061308 0.000646198 0.0006844 0.00072885 0.000781097 0.000843255 0.000918273 0.00101041 0.00112605 0.0012752 0.00147451 0.00175391 0.00217314 
0.000516199 0.000536167 0.000558646 0.000584074 0.000613001 0.000646119 0.000684322 0.000728771 0.000781018 0.000843174 0.000918191 0.00101033 0.00112596 0.00127511 0.00147441 0.00175381 0.00217301 
0.000516116 0.000536086 0.000558565 0.000583994 0.000612922 0.000646041 0.000684243 0.000728693 0.00078094 0.000843095 0.00091811 0.00101024 0.00112588 0.00127501 0.00147431 0.0017537 0.00217289 
0.000516034 0.000536005 0.000558486 0.000583915 0.000612844 0.000645964 0.000684166 0.000728616 0.000780862 0.000843016 0.000918029 0.00101016 0.00112579 0.00127492 0.00147422 0.00175359 0.00217277 
0.000515952 0.000535924 0.000558406 0.000583837 0.000612766 0.000645886 0.000684089 0.000728538 0.000780784 0.000842938 0.00091795 0.00101008 0.0011257 0.00127483 0.00147412 0.00175349 0.00217265 
0.000515871 0.000535844 0.000558327 0.00058376 0.000612689 0.00064581 0.000684013 0.000728463 0.000780708 0.00084286 0.000917871 0.00101 0.00112562 0.00127474 0.00147403 0.00175338 0.00217254 
0.00051579 0.000535765 0.000558249 0.000583682 0.000612612 0.000645734 0.000683938 0.000728387 0.000780632 0.000842784 0.000917793 0.00100992 0.00112554 0.00127466 0.00147393 0.00175328 0.00217242 
0.000515711 0.000535687 0.000558172 0.000583606 0.000612537 0.000645659 0.000683863 0.000728312 0.000780557 0.000842708 0.000917716 0.00100984 0.00112545 0.00127457 0.00147384 0.00175318 0.00217231 
0.000515631 0.000535608 0.000558094 0.00058353 0.000612462 0.000645584 0.000683788 0.000728238 0.000780483 0.000842633 0.000917639 0.00100976 0.00112537 0.00127449 0.00147375 0.00175308 0.00217219 
0.000515552 0.000535531 0.000558018 0.000583454 0.000612387 0.00064551 0.000683715 0.000728165 0.000780409 0.000842558 0.000917563 0.00100968 0.00112529 0.0012744 0.00147366 0.00175298 0.00217208 
