0.000762141 0.000762352 0.000762548 0.000762729 0.000762892 0.000763036 0.000763158 0.000763256 0.000763325 0.00076336 0.000763359 0.000763312 0.000763209 0.000763038 0.000762783 0.000762421 0.000761916 
0.000762083 0.000762296 0.000762491 0.000762672 0.000762836 0.000762979 0.000763102 0.000763199 0.000763268 0.000763305 0.000763303 0.000763256 0.000763153 0.000762983 0.000762729 0.000762365 0.000761862 
0.000762027 0.000762239 0.000762435 0.000762615 0.000762779 0.000762923 0.000763045 0.000763143 0.000763212 0.000763249 0.000763247 0.0007632 0.000763097 0.000762927 0.000762673 0.00076231 0.000761806 
0.00076197 0.000762181 0.000762378 0.000762559 0.000762722 0.000762866 0.000762989 0.000763087 0.000763156 0.000763193 0.000763192 0.000763144 0.000763042 0.000762872 0.000762618 0.000762255 0.000761752 
0.000761913 0.000762125 0.000762322 0.000762503 0.000762666 0.000762811 0.000762934 0.000763031 0.0007631 0.000763137 0.000763136 0.000763089 0.000762986 0.000762817 0.000762562 0.0007622 0.000761697 
0.000761856 0.000762068 0.000762265 0.000762446 0.00076261 0.000762754 0.000762877 0.000762975 0.000763044 0.000763082 0.00076308 0.000763033 0.000762931 0.000762762 0.000762507 0.000762146 0.000761643 
0.000761799 0.000762011 0.000762208 0.00076239 0.000762553 0.000762698 0.000762821 0.000762919 0.000762989 0.000763026 0.000763024 0.000762977 0.000762875 0.000762706 0.000762452 0.00076209 0.000761588 
0.000761742 0.000761954 0.000762151 0.000762333 0.000762498 0.000762642 0.000762765 0.000762863 0.000762933 0.00076297 0.000762969 0.000762922 0.00076282 0.00076265 0.000762397 0.000762035 0.000761534 
0.000761686 0.000761898 0.000762095 0.000762277 0.000762441 0.000762585 0.000762708 0.000762807 0.000762877 0.000762914 0.000762913 0.000762866 0.000762764 0.000762596 0.000762342 0.00076198 0.000761478 
0.000761628 0.000761841 0.000762039 0.00076222 0.000762385 0.000762529 0.000762652 0.000762751 0.000762821 0.000762858 0.000762857 0.000762811 0.000762709 0.00076254 0.000762287 0.000761926 0.000761424 
0.000761572 0.000761785 0.000761982 0.000762164 0.000762328 0.000762473 0.000762597 0.000762695 0.000762765 0.000762803 0.000762802 0.000762755 0.000762654 0.000762485 0.000762232 0.000761871 0.00076137 
0.000761515 0.000761727 0.000761926 0.000762108 0.000762272 0.000762417 0.000762541 0.00076264 0.000762709 0.000762748 0.000762746 0.0007627 0.000762598 0.00076243 0.000762177 0.000761816 0.000761315 
0.000761458 0.000761671 0.000761869 0.000762051 0.000762216 0.000762361 0.000762485 0.000762584 0.000762654 0.000762692 0.000762691 0.000762644 0.000762543 0.000762375 0.000762122 0.000761761 0.000761261 
0.000761402 0.000761615 0.000761813 0.000761996 0.00076216 0.000762305 0.000762429 0.000762528 0.000762598 0.000762636 0.000762635 0.000762589 0.000762488 0.000762319 0.000762067 0.000761707 0.000761207 
0.000761345 0.000761558 0.000761757 0.000761939 0.000762104 0.000762249 0.000762373 0.000762472 0.000762543 0.00076258 0.00076258 0.000762534 0.000762433 0.000762264 0.000762012 0.000761652 0.000761152 
0.000761288 0.000761501 0.0007617 0.000761883 0.000762048 0.000762193 0.000762317 0.000762416 0.000762487 0.000762525 0.000762524 0.000762479 0.000762378 0.00076221 0.000761957 0.000761597 0.000761098 
0.000761232 0.000761445 0.000761644 0.000761827 0.000761992 0.000762137 0.000762261 0.000762361 0.000762432 0.000762469 0.000762469 0.000762423 0.000762322 0.000762155 0.000761902 0.000761543 0.000761043 
