0.000545784 0.000567458 0.000591817 0.000619332 0.000650589 0.000686331 0.000727514 0.000775384 0.000831601 0.000898428 0.000979029 0.00107797 0.00120209 0.00136212 0.00157592 0.00187561 0.00232528 
0.000545656 0.000567345 0.000591719 0.000619248 0.000650521 0.00068628 0.00072748 0.000775368 0.000831606 0.000898455 0.000979079 0.00107805 0.0012022 0.00136227 0.00157612 0.00187588 0.00232565 
0.000545542 0.000567245 0.000591634 0.000619179 0.000650467 0.000686244 0.000727461 0.000775368 0.000831626 0.000898498 0.000979148 0.00107814 0.00120233 0.00136244 0.00157635 0.00187618 0.00232607 
0.00054544 0.000567158 0.000591562 0.000619123 0.000650428 0.000686221 0.000727457 0.000775383 0.000831663 0.000898558 0.000979234 0.00107826 0.00120248 0.00136264 0.00157661 0.00187652 0.00232652 
0.000545351 0.000567084 0.000591503 0.00061908 0.000650402 0.000686213 0.000727468 0.000775414 0.000831714 0.000898634 0.000979338 0.0010784 0.00120265 0.00136286 0.00157689 0.00187688 0.002327 
0.000545274 0.000567022 0.000591457 0.00061905 0.000650389 0.000686218 0.000727492 0.000775459 0.000831783 0.000898727 0.000979459 0.00107855 0.00120285 0.0013631 0.00157719 0.00187727 0.00232752 
0.000545209 0.000566973 0.000591424 0.000619033 0.000650389 0.000686236 0.00072753 0.000775519 0.000831865 0.000898835 0.000979597 0.00107872 0.00120306 0.00136336 0.00157752 0.00187769 0.00232807 
0.000545156 0.000566935 0.000591402 0.000619028 0.000650403 0.000686268 0.000727581 0.000775592 0.000831962 0.000898959 0.000979751 0.00107891 0.00120329 0.00136365 0.00157787 0.00187814 0.00232866 
0.000545115 0.000566909 0.000591392 0.000619036 0.000650428 0.000686313 0.000727647 0.00077568 0.000832074 0.000899098 0.000979921 0.00107912 0.00120354 0.00136395 0.00157825 0.00187861 0.00232928 
0.000545084 0.000566894 0.000591394 0.000619055 0.000650465 0.000686369 0.000727725 0.00077578 0.0008322 0.000899252 0.000980107 0.00107934 0.00120381 0.00136428 0.00157865 0.00187911 0.00232993 
0.000545065 0.000566891 0.000591407 0.000619085 0.000650514 0.000686439 0.000727815 0.000775894 0.000832339 0.000899421 0.000980309 0.00107958 0.0012041 0.00136462 0.00157907 0.00187963 0.00233061 
0.000545056 0.000566898 0.000591432 0.000619128 0.000650575 0.00068652 0.000727918 0.00077602 0.000832492 0.000899604 0.000980526 0.00107984 0.0012044 0.00136499 0.00157951 0.00188019 0.00233132 
0.000545058 0.000566917 0.000591467 0.000619181 0.000650648 0.000686613 0.000728033 0.000776159 0.000832659 0.0008998 0.000980757 0.00108011 0.00120473 0.00136537 0.00157998 0.00188076 0.00233206 
0.00054507 0.000566945 0.000591513 0.000619245 0.000650732 0.000686717 0.00072816 0.000776312 0.000832838 0.00090001 0.000981003 0.0010804 0.00120506 0.00136577 0.00158046 0.00188136 0.00233283 
0.000545093 0.000566984 0.000591569 0.00061932 0.000650826 0.000686833 0.000728299 0.000776475 0.000833029 0.000900234 0.000981264 0.0010807 0.00120542 0.0013662 0.00158097 0.00188199 0.00233363 
0.000545125 0.000567033 0.000591636 0.000619406 0.000650931 0.000686959 0.000728449 0.000776651 0.000833234 0.00090047 0.000981537 0.00108102 0.00120579 0.00136663 0.00158149 0.00188264 0.00233446 
0.000545167 0.000567092 0.000591713 0.000619501 0.000651047 0.000687097 0.00072861 0.000776838 0.000833451 0.00090072 0.000981825 0.00108135 0.00120618 0.00136709 0.00158204 0.0018833 0.00233531 
