0.000914862 0.000948977 0.000987614 0.00103157 0.00108182 0.00113964 0.00120662 0.00128487 0.0013772 0.00148742 0.00162088 0.00178529 0.00199223 0.00225988 0.0026185 0.00312257 0.00388098 
0.000913006 0.00094705 0.000985607 0.00102947 0.00107962 0.00113731 0.00120415 0.00128223 0.00137436 0.00148434 0.0016175 0.00178155 0.00198804 0.00225508 0.00261291 0.00311586 0.00387257 
0.000911184 0.00094516 0.000983639 0.00102741 0.00107746 0.00113503 0.00120172 0.00127964 0.00137157 0.00148131 0.00161419 0.00177789 0.00198392 0.00225038 0.00260742 0.00310927 0.00386432 
0.000909395 0.000943304 0.000981706 0.00102539 0.00107533 0.00113279 0.00119934 0.0012771 0.00136883 0.00147834 0.00161094 0.00177428 0.00197987 0.00224576 0.00260203 0.0031028 0.00385621 
0.00090764 0.000941482 0.000979808 0.0010234 0.00107325 0.00113058 0.00119701 0.0012746 0.00136615 0.00147543 0.00160775 0.00177075 0.0019759 0.00224123 0.00259674 0.00309643 0.00384824 
0.000905915 0.000939694 0.000977946 0.00102146 0.0010712 0.00112842 0.00119472 0.00127215 0.00136351 0.00147257 0.00160461 0.00176728 0.001972 0.00223677 0.00259154 0.00309019 0.00384042 
0.000904223 0.000937938 0.000976118 0.00101954 0.00106919 0.0011263 0.00119246 0.00126975 0.00136092 0.00146976 0.00160153 0.00176386 0.00196817 0.0022324 0.00258643 0.00308405 0.00383273 
0.000902561 0.000936215 0.000974323 0.00101767 0.00106722 0.00112422 0.00119025 0.00126739 0.00135838 0.001467 0.00159851 0.00176052 0.00196441 0.0022281 0.00258142 0.00307802 0.00382517 
0.00090093 0.000934522 0.000972561 0.00101583 0.00106529 0.00112218 0.00118808 0.00126507 0.00135588 0.00146429 0.00159555 0.00175723 0.00196072 0.00222389 0.00257649 0.0030721 0.00381775 
0.000899329 0.000932861 0.000970832 0.00101402 0.00106339 0.00112017 0.00118595 0.00126279 0.00135344 0.00146163 0.00159263 0.001754 0.00195709 0.00221974 0.00257165 0.00306628 0.00381045 
0.000897756 0.00093123 0.000969133 0.00101224 0.00106152 0.00111821 0.00118386 0.00126056 0.00135103 0.00145903 0.00158977 0.00175083 0.00195353 0.00221567 0.0025669 0.00306056 0.00380329 
0.000896212 0.000929629 0.000967467 0.0010105 0.00105969 0.00111627 0.00118181 0.00125836 0.00134867 0.00145646 0.00158696 0.00174772 0.00195003 0.00221167 0.00256223 0.00305494 0.00379625 
0.000894696 0.000928057 0.000965829 0.00100879 0.00105789 0.00111437 0.0011798 0.00125621 0.00134635 0.00145394 0.00158421 0.00174466 0.0019466 0.00220775 0.00255764 0.00304943 0.00378933 
0.000893208 0.000926513 0.000964222 0.00100711 0.00105613 0.00111251 0.00117782 0.0012541 0.00134407 0.00145147 0.0015815 0.00174166 0.00194322 0.00220389 0.00255314 0.00304401 0.00378253 
0.000891746 0.000924997 0.000962644 0.00100546 0.0010544 0.00111068 0.00117587 0.00125202 0.00134184 0.00144905 0.00157884 0.00173871 0.00193991 0.0022001 0.00254871 0.00303868 0.00377584 
0.000890311 0.000923509 0.000961095 0.00100384 0.0010527 0.00110888 0.00117397 0.00124998 0.00133964 0.00144666 0.00157622 0.00173581 0.00193665 0.00219638 0.00254436 0.00303345 0.00376927 
0.000888902 0.000922048 0.000959574 0.00100225 0.00105103 0.00110712 0.00117209 0.00124798 0.00133749 0.00144432 0.00157366 0.00173297 0.00193346 0.00219272 0.00254009 0.0030283 0.00376282 
