0.000859656 0.000859767 0.000859788 0.000859713 0.000859544 0.000859276 0.000858904 0.000858427 0.00085784 0.000857136 0.000856311 0.000855355 0.000854258 0.000853003 0.000851563 0.000849902 0.00084794 
0.00085664 0.000856751 0.000856771 0.000856699 0.000856531 0.000856264 0.000855895 0.000855421 0.000854837 0.000854139 0.000853318 0.000852367 0.000851275 0.000850024 0.00084859 0.000846929 0.000844966 
0.000853664 0.000853774 0.000853795 0.000853723 0.000853557 0.000853292 0.000852926 0.000852455 0.000851875 0.00085118 0.000850364 0.000849418 0.00084833 0.000847084 0.000845653 0.000843993 0.000842028 
0.000850728 0.000850837 0.000850858 0.000850787 0.000850621 0.000850359 0.000849995 0.000849527 0.000848951 0.00084826 0.000847449 0.000846507 0.000845424 0.000844181 0.000842753 0.000841094 0.000839126 
0.00084783 0.000847939 0.000847959 0.000847889 0.000847725 0.000847463 0.000847102 0.000846637 0.000846065 0.000845378 0.00084457 0.000843633 0.000842554 0.000841315 0.00083989 0.000838232 0.000836259 
0.00084497 0.000845079 0.000845099 0.000845029 0.000844866 0.000844607 0.000844248 0.000843786 0.000843216 0.000842532 0.000841729 0.000840796 0.000839721 0.000838486 0.000837062 0.000835405 0.000833428 
0.000842147 0.000842255 0.000842276 0.000842205 0.000842044 0.000841786 0.000841429 0.00084097 0.000840403 0.000839723 0.000838924 0.000837994 0.000836923 0.000835691 0.000834269 0.000832611 0.000830631 
0.00083936 0.000839468 0.000839488 0.000839419 0.000839257 0.000839002 0.000838647 0.00083819 0.000837626 0.000836949 0.000836153 0.000835228 0.00083416 0.000832931 0.000831512 0.000829853 0.000827867 
0.000836609 0.000836716 0.000836735 0.000836667 0.000836507 0.000836252 0.000835899 0.000835444 0.000834884 0.00083421 0.000833418 0.000832495 0.000831431 0.000830204 0.000828786 0.000827127 0.000825135 
0.000833893 0.000833999 0.000834019 0.00083395 0.00083379 0.000833538 0.000833187 0.000832735 0.000832176 0.000831506 0.000830716 0.000829797 0.000828736 0.000827511 0.000826094 0.000824433 0.000822437 
0.000831211 0.000831315 0.000831335 0.000831267 0.000831109 0.000830856 0.000830507 0.000830057 0.000829501 0.000828834 0.000828047 0.000827132 0.000826072 0.000824852 0.000823434 0.000821772 0.000819769 
0.000828562 0.000828666 0.000828685 0.000828617 0.00082846 0.000828209 0.000827861 0.000827413 0.00082686 0.000826195 0.000825411 0.000824498 0.000823442 0.000822222 0.000820806 0.000819142 0.000817132 
0.000825946 0.000826049 0.000826068 0.000826001 0.000825843 0.000825593 0.000825248 0.000824801 0.00082425 0.000823588 0.000822807 0.000821897 0.000820843 0.000819625 0.000818209 0.000816543 0.000814526 
0.000823361 0.000823464 0.000823483 0.000823416 0.000823259 0.000823009 0.000822666 0.000822221 0.000821672 0.000821013 0.000820234 0.000819326 0.000818275 0.000817058 0.000815642 0.000813974 0.00081195 
0.000820809 0.00082091 0.000820929 0.000820862 0.000820706 0.000820458 0.000820115 0.000819672 0.000819126 0.000818468 0.000817692 0.000816787 0.000815737 0.000814521 0.000813106 0.000811434 0.000809402 
0.000818287 0.000818388 0.000818406 0.000818339 0.000818184 0.000817936 0.000817594 0.000817154 0.000816609 0.000815954 0.000815179 0.000814277 0.000813229 0.000812014 0.000810598 0.000808923 0.000806884 
0.000815796 0.000815896 0.000815913 0.000815847 0.000815691 0.000815445 0.000815105 0.000814665 0.000814122 0.000813469 0.000812697 0.000811796 0.00081075 0.000809536 0.000808119 0.00080644 0.000804393 
