0.00059427 0.00059925 0.000604745 0.000610866 0.000617755 0.000625592 0.000634615 0.000645136 0.000657575 0.00067251 0.000690756 0.000713496 0.00074251 0.000780607 0.000832479 0.000906576 0.0010198 
0.000594128 0.000599121 0.00060463 0.000610767 0.000617672 0.000625529 0.000634574 0.000645119 0.000657586 0.000672554 0.000690838 0.000713622 0.00074269 0.000780855 0.000832812 0.000907024 0.00102042 
0.000593987 0.000598993 0.000604516 0.000610668 0.00061759 0.000625467 0.000634533 0.000645103 0.000657598 0.000672599 0.00069092 0.000713749 0.000742871 0.000781102 0.000833145 0.000907473 0.00102103 
0.000593847 0.000598866 0.000604402 0.000610569 0.000617509 0.000625405 0.000634493 0.000645088 0.000657611 0.000672643 0.000691003 0.000713876 0.000743052 0.000781351 0.000833479 0.000907923 0.00102165 
0.000593709 0.000598739 0.000604289 0.000610472 0.000617429 0.000625343 0.000634454 0.000645073 0.000657624 0.000672689 0.000691086 0.000714004 0.000743234 0.000781599 0.000833813 0.000908372 0.00102227 
0.000593571 0.000598613 0.000604177 0.000610375 0.000617349 0.000625284 0.000634415 0.000645058 0.000657638 0.000672735 0.000691169 0.000714132 0.000743416 0.000781848 0.000834148 0.000908822 0.00102288 
0.000593434 0.000598489 0.000604067 0.000610279 0.000617271 0.000625224 0.000634377 0.000645045 0.000657653 0.000672782 0.000691254 0.000714261 0.000743598 0.000782097 0.000834482 0.000909271 0.0010235 
0.000593297 0.000598365 0.000603956 0.000610185 0.000617193 0.000625165 0.00063434 0.000645032 0.000657668 0.000672829 0.000691339 0.00071439 0.000743781 0.000782346 0.000834817 0.000909721 0.00102411 
0.000593162 0.000598242 0.000603847 0.00061009 0.000617116 0.000625107 0.000634303 0.000645021 0.000657683 0.000672877 0.000691424 0.00071452 0.000743965 0.000782596 0.000835152 0.000910171 0.00102473 
0.000593028 0.00059812 0.000603739 0.000609997 0.00061704 0.00062505 0.000634267 0.000645009 0.0006577 0.000672926 0.00069151 0.00071465 0.000744148 0.000782846 0.000835487 0.000910621 0.00102535 
0.000592894 0.000597999 0.000603631 0.000609905 0.000616964 0.000624994 0.000634232 0.000644998 0.000657717 0.000672975 0.000691596 0.000714781 0.000744332 0.000783096 0.000835823 0.000911072 0.00102596 
0.000592762 0.000597878 0.000603524 0.000609813 0.000616889 0.000624938 0.000634198 0.000644988 0.000657735 0.000673024 0.000691683 0.000714912 0.000744517 0.000783347 0.000836159 0.000911523 0.00102658 
0.00059263 0.000597759 0.000603418 0.000609722 0.000616816 0.000624883 0.000634164 0.000644978 0.000657753 0.000673074 0.000691771 0.000715044 0.000744702 0.000783599 0.000836495 0.000911973 0.00102719 
0.000592499 0.00059764 0.000603312 0.000609632 0.000616742 0.000624828 0.000634131 0.00064497 0.000657772 0.000673125 0.000691859 0.000715175 0.000744888 0.00078385 0.000836832 0.000912424 0.00102781 
0.000592369 0.000597522 0.000603208 0.000609543 0.00061667 0.000624775 0.000634099 0.000644962 0.000657791 0.000673177 0.000691947 0.000715308 0.000745073 0.000784102 0.000837168 0.000912875 0.00102843 
0.00059224 0.000597405 0.000603105 0.000609454 0.000616598 0.000624722 0.000634067 0.000644954 0.000657811 0.000673228 0.000692036 0.000715441 0.00074526 0.000784354 0.000837505 0.000913327 0.00102904 
0.000592111 0.000597288 0.000603002 0.000609366 0.000616527 0.000624669 0.000634036 0.000644947 0.000657832 0.000673281 0.000692126 0.000715574 0.000745446 0.000784606 0.000837843 0.000913778 0.00102966 
