0.000852182 0.000852122 0.000851985 0.00085177 0.000851477 0.000851103 0.000850646 0.000850104 0.000849472 0.000848746 0.000847916 0.000846972 0.000845898 0.000844668 0.000843244 0.000841561 0.000839507 
0.000848737 0.000848677 0.00084854 0.000848325 0.000848033 0.00084766 0.000847204 0.000846663 0.000846032 0.000845305 0.000844474 0.00084353 0.000842452 0.000841217 0.000839784 0.000838087 0.000836013 
0.000845341 0.000845281 0.000845145 0.00084493 0.000844638 0.000844267 0.00084381 0.00084327 0.00084264 0.000841913 0.000841083 0.000840135 0.000839054 0.000837814 0.000836372 0.00083466 0.000832564 
0.000841995 0.000841934 0.000841798 0.000841585 0.000841293 0.000840921 0.000840467 0.000839926 0.000839296 0.000838569 0.000837738 0.000836788 0.000835704 0.000834457 0.000833005 0.00083128 0.00082916 
0.000838697 0.000838636 0.000838499 0.000838286 0.000837994 0.000837623 0.000837169 0.000836629 0.000835999 0.000835272 0.000834439 0.000833488 0.000832399 0.000831146 0.000829684 0.000827945 0.0008258 
0.000835446 0.000835385 0.000835247 0.000835034 0.000834743 0.000834372 0.000833918 0.000833378 0.000832748 0.00083202 0.000831186 0.000830231 0.000829139 0.000827879 0.000826408 0.000824653 0.000822485 
0.00083224 0.000832178 0.000832041 0.000831827 0.000831536 0.000831165 0.000830712 0.000830172 0.000829541 0.000828812 0.000827976 0.00082702 0.000825924 0.000824657 0.000823175 0.000821404 0.000819212 
0.00082908 0.000829016 0.000828879 0.000828665 0.000828374 0.000828003 0.00082755 0.00082701 0.000826379 0.000825649 0.000824811 0.000823852 0.00082275 0.000821476 0.000819985 0.000818197 0.00081598 
0.000825962 0.000825899 0.000825761 0.000825547 0.000825256 0.000824885 0.000824431 0.000823891 0.000823259 0.000822529 0.000821688 0.000820726 0.000819619 0.000818339 0.000816836 0.000815032 0.00081279 
0.000822888 0.000822824 0.000822686 0.000822471 0.00082218 0.000821808 0.000821354 0.000820814 0.00082018 0.000819449 0.000818607 0.000817641 0.000816529 0.000815241 0.000813727 0.000811907 0.000809639 
0.000819855 0.00081979 0.000819652 0.000819437 0.000819145 0.000818774 0.000818319 0.000817778 0.000817144 0.00081641 0.000815566 0.000814596 0.000813479 0.000812183 0.000810658 0.000808821 0.000806527 
0.000816864 0.000816798 0.000816658 0.000816443 0.000816151 0.000815779 0.000815324 0.000814782 0.000814147 0.000813412 0.000812565 0.000811591 0.000810469 0.000809165 0.000807627 0.000805773 0.000803453 
0.000813912 0.000813845 0.000813705 0.00081349 0.000813196 0.000812824 0.000812368 0.000811825 0.00081119 0.000810452 0.000809602 0.000808625 0.000807497 0.000806185 0.000804636 0.000802764 0.000800417 
0.000811 0.000810932 0.000810791 0.000810575 0.000810281 0.000809908 0.000809451 0.000808907 0.00080827 0.000807531 0.000806678 0.000805697 0.000804563 0.000803243 0.000801681 0.000799791 0.000797418 
0.000808126 0.000808057 0.000807915 0.000807697 0.000807403 0.000807029 0.000806572 0.000806027 0.000805388 0.000804647 0.000803791 0.000802806 0.000801666 0.000800336 0.000798763 0.000796854 0.000794454 
0.00080529 0.000805219 0.000805076 0.000804858 0.000804563 0.000804188 0.00080373 0.000803184 0.000802543 0.0008018 0.000800941 0.000799951 0.000798805 0.000797467 0.00079588 0.000793954 0.000791525 
0.000802489 0.000802418 0.000802274 0.000802054 0.000801759 0.000801384 0.000800924 0.000800376 0.000799734 0.000798988 0.000798127 0.000797132 0.000795979 0.000794631 0.000793032 0.000791087 0.000788632 
