0.000521643 0.000541347 0.000563657 0.000589031 0.000618043 0.000651418 0.000690085 0.000735262 0.000788569 0.00085221 0.000929276 0.00102422 0.00114371 0.00129822 0.0015052 0.00179597 0.00223309 
0.00052035 0.00054 0.000562249 0.000587556 0.000616491 0.000649777 0.000688343 0.000733401 0.000786568 0.000850045 0.00092691 0.00102161 0.00114079 0.00129491 0.00150136 0.00179139 0.00222741 
0.00051907 0.000538668 0.000560858 0.000586097 0.000614955 0.000648154 0.000686619 0.00073156 0.00078459 0.000847903 0.000924571 0.00101902 0.0011379 0.00129163 0.00149755 0.00178685 0.00222178 
0.000517805 0.00053735 0.000559481 0.000584654 0.000613436 0.000646549 0.000684915 0.00072974 0.000782632 0.000845784 0.000922256 0.00101647 0.00113505 0.00128839 0.00149379 0.00178237 0.00221621 
0.000516553 0.000536046 0.000558119 0.000583226 0.000611934 0.000644961 0.000683228 0.000727939 0.000780697 0.000843688 0.000919967 0.00101394 0.00113222 0.00128518 0.00149007 0.00177793 0.0022107 
0.000515314 0.000534755 0.000556771 0.000581813 0.000610448 0.00064339 0.00068156 0.000726157 0.000778783 0.000841615 0.000917703 0.00101144 0.00112943 0.001282 0.00148639 0.00177354 0.00220526 
0.000514088 0.000533479 0.000555438 0.000580416 0.000608977 0.000641837 0.00067991 0.000724395 0.000776889 0.000839565 0.000915463 0.00100897 0.00112666 0.00127886 0.00148274 0.00176919 0.00219986 
0.000512876 0.000532217 0.000554119 0.000579034 0.000607523 0.0006403 0.000678277 0.000722652 0.000775015 0.000837535 0.000913246 0.00100652 0.00112393 0.00127576 0.00147914 0.00176489 0.00219453 
0.000511676 0.000530968 0.000552815 0.000577666 0.000606083 0.000638778 0.000676662 0.000720927 0.000773162 0.000835528 0.000911054 0.0010041 0.00112122 0.00127268 0.00147558 0.00176064 0.00218924 
0.000510489 0.000529731 0.000551523 0.000576313 0.00060466 0.000637274 0.000675065 0.000719221 0.000771328 0.000833542 0.000908885 0.00100171 0.00111855 0.00126964 0.00147205 0.00175643 0.00218402 
0.000509314 0.000528508 0.000550245 0.000574974 0.000603252 0.000635785 0.000673483 0.000717533 0.000769513 0.000831577 0.000906738 0.00099934 0.0011159 0.00126663 0.00146855 0.00175227 0.00217885 
0.000508152 0.000527297 0.000548981 0.000573649 0.000601858 0.000634312 0.000671919 0.000715863 0.000767717 0.000829634 0.000904614 0.000996996 0.00111327 0.00126365 0.0014651 0.00174815 0.00217373 
0.000507 0.0005261 0.00054773 0.000572338 0.000600478 0.000632855 0.000670371 0.00071421 0.000765942 0.00082771 0.000902513 0.000994676 0.00111068 0.0012607 0.00146168 0.00174406 0.00216866 
0.000505862 0.000524914 0.000546492 0.00057104 0.000599113 0.000631412 0.00066884 0.000712573 0.000764183 0.000825807 0.000900434 0.00099238 0.00110811 0.00125778 0.00145829 0.00174003 0.00216365 
0.000504735 0.000523741 0.000545267 0.000569756 0.000597762 0.000629985 0.000667324 0.000710955 0.000762443 0.000823923 0.000898376 0.000990109 0.00110557 0.0012549 0.00145495 0.00173603 0.00215868 
0.000503619 0.00052258 0.000544055 0.000568485 0.000596425 0.000628572 0.000665824 0.000709354 0.000760722 0.000822058 0.00089634 0.000987861 0.00110306 0.00125204 0.00145163 0.00173207 0.00215377 
0.000502515 0.00052143 0.000542855 0.000567228 0.000595102 0.000627174 0.00066434 0.000707768 0.000759018 0.000820214 0.000894324 0.000985635 0.00110057 0.00124921 0.00144835 0.00172816 0.00214891 
