0.000597972 0.000622183 0.000649359 0.000680017 0.000714807 0.00075455 0.000800301 0.000853437 0.000915793 0.000989871 0.00107917 0.00118873 0.00132611 0.0015032 0.00173973 0.00207121 0.00256854 
0.000597996 0.000622211 0.00064939 0.000680052 0.000714846 0.000754594 0.00080035 0.000853491 0.000915853 0.000989938 0.00107924 0.00118881 0.00132621 0.00150331 0.00173986 0.00207137 0.00256874 
0.000598022 0.00062224 0.000649422 0.000680088 0.000714886 0.000754638 0.000800398 0.000853545 0.000915913 0.000990005 0.00107932 0.0011889 0.00132631 0.00150342 0.00173999 0.00207153 0.00256894 
0.000598046 0.000622268 0.000649453 0.000680123 0.000714925 0.000754681 0.000800447 0.000853599 0.000915974 0.000990073 0.00107939 0.00118898 0.00132641 0.00150353 0.00174012 0.00207169 0.00256914 
0.000598072 0.000622297 0.000649486 0.000680159 0.000714965 0.000754726 0.000800496 0.000853654 0.000916035 0.00099014 0.00107947 0.00118907 0.0013265 0.00150365 0.00174026 0.00207185 0.00256934 
0.000598097 0.000622325 0.000649518 0.000680195 0.000715005 0.00075477 0.000800545 0.000853709 0.000916096 0.000990209 0.00107955 0.00118916 0.0013266 0.00150376 0.00174039 0.00207201 0.00256954 
0.000598123 0.000622354 0.00064955 0.000680231 0.000715046 0.000754815 0.000800595 0.000853763 0.000916157 0.000990277 0.00107962 0.00118924 0.0013267 0.00150387 0.00174053 0.00207217 0.00256975 
0.000598149 0.000622383 0.000649583 0.000680267 0.000715087 0.00075486 0.000800645 0.000853819 0.000916219 0.000990346 0.0010797 0.00118933 0.0013268 0.00150399 0.00174066 0.00207234 0.00256995 
0.000598175 0.000622413 0.000649616 0.000680304 0.000715127 0.000754905 0.000800695 0.000853875 0.00091628 0.000990415 0.00107978 0.00118942 0.0013269 0.0015041 0.0017408 0.0020725 0.00257015 
0.000598202 0.000622443 0.000649649 0.000680341 0.000715167 0.000754951 0.000800746 0.000853931 0.000916343 0.000990484 0.00107985 0.0011895 0.001327 0.00150422 0.00174093 0.00207266 0.00257036 
0.000598228 0.000622472 0.000649682 0.000680378 0.000715209 0.000754997 0.000800796 0.000853987 0.000916405 0.000990553 0.00107993 0.00118959 0.0013271 0.00150434 0.00174107 0.00207283 0.00257057 
0.000598255 0.000622502 0.000649716 0.000680415 0.000715251 0.000755042 0.000800847 0.000854043 0.000916467 0.000990623 0.00108001 0.00118968 0.0013272 0.00150445 0.0017412 0.00207299 0.00257077 
0.000598282 0.000622533 0.00064975 0.000680453 0.000715292 0.000755088 0.000800898 0.0008541 0.00091653 0.000990693 0.00108009 0.00118977 0.0013273 0.00150457 0.00174134 0.00207316 0.00257098 
0.00059831 0.000622563 0.000649784 0.000680491 0.000715334 0.000755136 0.00080095 0.000854156 0.000916594 0.000990764 0.00108017 0.00118986 0.0013274 0.00150468 0.00174148 0.00207333 0.00257119 
0.000598337 0.000622594 0.000649818 0.000680529 0.000715377 0.000755182 0.000801001 0.000854214 0.000916657 0.000990834 0.00108025 0.00118995 0.0013275 0.0015048 0.00174161 0.00207349 0.0025714 
0.000598364 0.000622625 0.000649853 0.000680567 0.000715419 0.000755229 0.000801053 0.000854271 0.000916721 0.000990905 0.00108033 0.00119004 0.00132761 0.00150492 0.00174175 0.00207366 0.00257161 
0.000598392 0.000622656 0.000649887 0.000680606 0.000715461 0.000755276 0.000801105 0.000854329 0.000916785 0.000990977 0.00108041 0.00119013 0.00132771 0.00150504 0.00174189 0.00207382 0.00257181 
