0.001233 0.00125764 0.00128419 0.00131301 0.0013445 0.00137923 0.00141788 0.00146138 0.00151097 0.00156833 0.00163584 0.00171693 0.00181677 0.00194348 0.00211061 0.00234255 0.00268807 
0.00123117 0.00125613 0.00128305 0.00131227 0.00134424 0.0013795 0.00141877 0.00146299 0.0015134 0.00157174 0.0016404 0.00172289 0.00182444 0.0019533 0.00212324 0.00235903 0.00271017 
0.00122964 0.0012549 0.00128218 0.00131181 0.00134423 0.00138002 0.0014199 0.00146482 0.00151606 0.00157535 0.00164516 0.00172902 0.00183226 0.00196326 0.00213599 0.0023756 0.00273235 
0.00122838 0.00125395 0.00128157 0.00131159 0.00134448 0.00138079 0.00142126 0.00146688 0.00151892 0.00157916 0.00165009 0.00173532 0.00184024 0.00197335 0.00214885 0.00239225 0.00275457 
0.00122737 0.00125324 0.00128121 0.00131162 0.00134495 0.00138177 0.00142284 0.00146913 0.00152197 0.00158315 0.0016552 0.00174177 0.00184835 0.00198356 0.00216181 0.00240899 0.00277686 
0.00122661 0.00125278 0.00128107 0.00131188 0.00134564 0.00138297 0.00142462 0.00147159 0.00152521 0.00158731 0.00166046 0.00174837 0.00185659 0.00199389 0.00217487 0.0024258 0.0027992 
0.00122607 0.00125253 0.00128116 0.00131234 0.00134654 0.00138437 0.00142659 0.00147422 0.00152862 0.00159164 0.00166588 0.0017551 0.00186496 0.00200433 0.00218802 0.00244268 0.00282158 
0.00122575 0.00125249 0.00128145 0.00131301 0.00134764 0.00138595 0.00142874 0.00147703 0.00153219 0.00159612 0.00167144 0.00176197 0.00187345 0.00201487 0.00220126 0.00245964 0.00284401 
0.00122563 0.00125265 0.00128194 0.00131386 0.00134891 0.00138771 0.00143106 0.00148 0.00153592 0.00160074 0.00167713 0.00176897 0.00188204 0.00202551 0.00221458 0.00247665 0.00286648 
0.0012257 0.001253 0.0012826 0.00131489 0.00135036 0.00138964 0.00143354 0.00148312 0.0015398 0.00160551 0.00168296 0.00177608 0.00189075 0.00203624 0.00222797 0.00249373 0.00288898 
0.00122594 0.00125353 0.00128344 0.00131609 0.00135198 0.00139173 0.00143618 0.0014864 0.00154382 0.0016104 0.0016889 0.0017833 0.00189955 0.00204705 0.00224144 0.00251086 0.00291153 
0.00122636 0.00125422 0.00128445 0.00131746 0.00135375 0.00139397 0.00143896 0.00148981 0.00154796 0.00161542 0.00169496 0.00179062 0.00190845 0.00205795 0.00225498 0.00252804 0.0029341 
0.00122694 0.00125507 0.00128561 0.00131897 0.00135567 0.00139635 0.00144188 0.00149335 0.00155223 0.00162055 0.00170113 0.00179805 0.00191744 0.00206893 0.00226858 0.00254527 0.00295671 
0.00122768 0.00125607 0.00128692 0.00132063 0.00135772 0.00139887 0.00144493 0.00149701 0.00155662 0.0016258 0.0017074 0.00180557 0.00192652 0.00207999 0.00228225 0.00256255 0.00297934 
0.00122856 0.00125722 0.00128837 0.00132242 0.00135991 0.00140152 0.0014481 0.0015008 0.00156113 0.00163115 0.00171378 0.00181319 0.00193567 0.00209111 0.00229597 0.00257988 0.003002 
0.00122957 0.0012585 0.00128995 0.00132434 0.00136223 0.00140429 0.00145139 0.0015047 0.00156574 0.00163661 0.00172024 0.00182089 0.00194491 0.0021023 0.00230975 0.00259724 0.00302468 
0.00123072 0.00125991 0.00129165 0.00132639 0.00136467 0.00140717 0.0014548 0.0015087 0.00157045 0.00164216 0.0017268 0.00182867 0.00195421 0.00211356 0.00232358 0.00261464 0.00304739 
