0.000472661 0.000491349 0.000512293 0.000535891 0.000562641 0.000593172 0.000628295 0.000669067 0.000716896 0.000773702 0.000842166 0.000926162 0.00103148 0.00116723 0.00134853 0.00160256 0.00198354 
0.000472397 0.000491075 0.000512008 0.000535592 0.000562327 0.000592841 0.000627944 0.000668693 0.000716494 0.000773268 0.000841693 0.000925638 0.0010309 0.00116656 0.00134775 0.00160162 0.00198236 
0.000472133 0.000490801 0.000511722 0.000535294 0.000562014 0.000592511 0.000627594 0.00066832 0.000716094 0.000772833 0.000841219 0.000925115 0.00103031 0.00116589 0.00134697 0.00160068 0.00198118 
0.00047187 0.000490528 0.000511437 0.000534996 0.000561701 0.000592181 0.000627245 0.000667947 0.000715694 0.000772401 0.000840746 0.000924593 0.00102973 0.00116522 0.00134619 0.00159974 0.00198001 
0.000471607 0.000490255 0.000511153 0.000534699 0.000561389 0.000591852 0.000626896 0.000667575 0.000715295 0.000771969 0.000840274 0.000924072 0.00102914 0.00116456 0.00134541 0.00159881 0.00197883 
0.000471345 0.000489983 0.00051087 0.000534402 0.000561078 0.000591524 0.000626548 0.000667205 0.000714897 0.000771539 0.000839804 0.000923552 0.00102856 0.0011639 0.00134464 0.00159788 0.00197766 
0.000471084 0.000489711 0.000510587 0.000534106 0.000560767 0.000591197 0.000626201 0.000666834 0.000714499 0.000771108 0.000839334 0.000923032 0.00102798 0.00116323 0.00134386 0.00159695 0.00197649 
0.000470822 0.00048944 0.000510304 0.000533811 0.000560457 0.00059087 0.000625854 0.000666464 0.000714103 0.000770679 0.000838865 0.000922514 0.0010274 0.00116257 0.00134309 0.00159602 0.00197532 
0.000470562 0.00048917 0.000510022 0.000533516 0.000560148 0.000590544 0.000625509 0.000666095 0.000713707 0.00077025 0.000838397 0.000921998 0.00102682 0.00116191 0.00134232 0.00159509 0.00197415 
0.000470302 0.000488899 0.000509741 0.000533223 0.000559839 0.000590218 0.000625163 0.000665728 0.000713311 0.000769823 0.00083793 0.000921481 0.00102624 0.00116125 0.00134155 0.00159417 0.00197298 
0.000470042 0.00048863 0.00050946 0.000532929 0.000559531 0.000589893 0.000624819 0.00066536 0.000712917 0.000769396 0.000837464 0.000920966 0.00102566 0.00116059 0.00134079 0.00159324 0.00197182 
0.000469783 0.000488361 0.00050918 0.000532636 0.000559223 0.000589569 0.000624475 0.000664994 0.000712523 0.00076897 0.000836999 0.000920452 0.00102509 0.00115994 0.00134002 0.00159232 0.00197066 
0.000469524 0.000488093 0.0005089 0.000532343 0.000558916 0.000589245 0.000624132 0.000664628 0.000712131 0.000768544 0.000836534 0.000919938 0.00102451 0.00115928 0.00133925 0.0015914 0.0019695 
0.000469267 0.000487825 0.000508621 0.000532051 0.00055861 0.000588922 0.000623789 0.000664263 0.000711738 0.00076812 0.00083607 0.000919427 0.00102394 0.00115863 0.00133849 0.00159048 0.00196835 
0.000469009 0.000487557 0.000508342 0.00053176 0.000558304 0.000588599 0.000623447 0.000663898 0.000711347 0.000767697 0.000835608 0.000918915 0.00102337 0.00115797 0.00133773 0.00158956 0.00196719 
0.000468752 0.00048729 0.000508065 0.000531469 0.000557999 0.000588277 0.000623106 0.000663534 0.000710956 0.000767274 0.000835146 0.000918405 0.00102279 0.00115732 0.00133697 0.00158865 0.00196604 
0.000468496 0.000487024 0.000507787 0.000531179 0.000557695 0.000587956 0.000622765 0.000663171 0.000710566 0.000766852 0.000834685 0.000917895 0.00102222 0.00115667 0.00133621 0.00158773 0.00196489 
