{
	"process_id" : 9106,
	"version" : "2019.4.16f1",
	"app_path" : "/home/trunghoa/Unity/Hub/Editor/2019.4.16f1/Editor/Unity",
	"app_contents_path" : "/home/trunghoa/Unity/Hub/Editor/2019.4.16f1/Editor/Data"
}