[
{
  "directory": "C:/Code/clang_tidy_score/build",
  "command": "C:\\PROGRA~1\\LLVM\\bin\\CLANG_~1.EXE -g -Xclang -gcodeview -O0 -D_DEBUG -D_DLL -D_MT -Xclang --dependent-lib=msvcrtd -o CMakeFiles\\mylib.dir\\bad.cpp.obj -c C:\\Code\\clang_tidy_score\\tests\\cmake_bad\\bad.cpp",
  "file": "C:\\Code\\clang_tidy_score\\tests\\cmake_bad\\bad.cpp"
}
]