{
	"JSON": {
		"ID": "1ee57b39-3992-6fa2-9f58-c86a8b7d69ba",
		"label": "PDC013",
		"comment": "UUID6 is used"
	},
	"probe": {
		"material": "Messing",
		"mass": {
			"value": 680,
			"unit": "gramm",
			"uncertainty": {
				"value": 1,
				"type": "absolut",
				"unit": "gramm"
			}
		},
		"dimensions": {
			"height": {
				"value": 40,
				"unit": "millimeter"
			},
			"diameter": {
				"value": 60,
				"unit": "millimeter"
			},
			"volume": {
				"value": 80570,
				"unit": "cubic millimeter"
			}
		}
	}
}