14
Energy = -324.5846368008
O    -3.1541228    0.4079628   -1.0360638 
H    -4.0928482    0.4067358   -0.8203826 
H    -2.7021796    0.1899114   -0.2129290 
C    -0.0746481   -0.3425217   -0.8916067 
C    -0.0608292    0.9186819   -0.3032981 
C     0.7405847   -1.3327290   -0.3544311 
C     0.7678381    1.1304922    0.7958668 
C     1.5324716   -1.0180616    0.7469312 
N     1.5542764    0.1874956    1.3220445 
H    -0.7167424   -0.5416436   -1.7404987 
H    -0.6820382    1.7169741   -0.6890652 
H     0.7663020   -2.3294175   -0.7772909 
H     0.8037216    2.1027848    1.2774018 
H     2.1797641   -1.7683297    1.1902046 
