26
Energy = -464.7412312197
O    -1.3868333   -1.2901821    2.7326187 
H    -1.7994613   -2.0605410    2.3269353 
H    -1.5586424   -1.3768917    3.6766221 
O    -0.4533178    1.9183728   -1.7955652 
C    -0.4119790    1.3978417   -0.6988084 
C     0.6718510    1.7574850    0.3041281 
C    -1.4694395    0.3831588   -0.2877219 
C     1.2590528    0.5907003    1.1099375 
C    -1.2477684   -0.9902204   -0.9559378 
C     2.0805710   -0.4080741    0.2846986 
C     0.0055845   -1.7646687   -0.5196515 
C     1.3487572   -1.0909429   -0.8832669 
H     0.2013117    2.4623965    1.0025937 
H     1.4482565    2.3080563   -0.2321211 
H    -2.4262723    0.7815804   -0.6331921 
H    -1.5137968    0.2649018    0.7955434 
H     0.4612107    0.0646695    1.6377125 
H     1.9058961    1.0074846    1.8878514 
H    -2.1309227   -1.6048280   -0.7530937 
H    -1.2181435   -0.8401774   -2.0396079 
H     2.4486634   -1.1829317    0.9663078 
H     2.9678332    0.0979101   -0.1122295 
H    -0.0401869   -2.7474676   -0.9976421 
H    -0.0329679   -1.9494497    0.5584526 
H     1.1877116   -0.3724207   -1.6915361 
H     2.0279586   -1.8413652   -1.2976210 
