12
Energy = -529.1230551371
O    -2.6775608   -1.0013070    0.7177509 
H    -3.2629818   -1.2606540    1.4364118 
H    -1.9942228   -1.6803877    0.6840593 
O    -0.0486650    2.1399021   -0.5877585 
C    -0.4091329    0.7974027   -0.8292465 
C     0.4977073   -0.1705925   -0.0822602 
F     1.7767132   -0.1171994   -0.4901423 
F     0.4889970    0.0695434    1.2488430 
F     0.0710246   -1.4516745   -0.2619275 
H    -0.2929952    2.3658282    0.3177731 
H    -1.4355533    0.5624510   -0.5355770 
H    -0.2812542    0.6071786   -1.8944847 
