18
Energy = -459.2234888363
O     3.2438094    0.8029137    1.2595140 
H     2.8269868    0.6883876    0.3882416 
H     4.1533724    0.5102802    1.1474639 
C     0.5205753   -0.4423749   -0.0036927 
C    -0.8247892    0.2093326   -0.2880958 
O    -1.7855131   -0.2309451    0.5276935 
O    -0.9893170    1.0303281   -1.1623184 
C     0.4756305   -1.9541394   -0.2076709 
O     1.5047357    0.1422511   -0.8535988 
C    -3.0991704    0.3378402    0.3309500 
H     0.7839103   -0.2200959    1.0357843 
H     1.4670688   -2.3651199   -0.0171827 
H    -0.2379159   -2.4140629    0.4764097 
H     0.1940089   -2.1909734   -1.2354025 
H     1.0468264    0.7803489   -1.4243197 
H    -3.0676500    1.4179484    0.4732429 
H    -3.4598787    0.1174694   -0.6737292 
H    -3.7315273   -0.1312408    1.0792438 
