26
Energy = -464.7494349195
O    -1.9375696    0.8548497   -2.2115608 
H    -2.7737907    0.6462066   -2.6391477 
H    -2.1263775    0.8551730   -1.2564481 
O    -1.8168313    0.6559948    0.6111159 
C    -0.6270147    0.7254876    0.8750441 
C     0.3009348    1.6497104    0.1168443 
C    -0.0580574   -0.1266513    1.9932188 
C     1.6514143    1.0416628   -0.2897954 
C     0.0483211   -1.6115210    1.5800299 
C     1.5597324   -0.0910811   -1.3194991 
C     1.0528477   -1.9338548    0.4634347 
C     0.7240306   -1.3171583   -0.9155461 
H     0.4850841    2.4958457    0.7927279 
H    -0.2309018    2.0357112   -0.7537902 
H    -0.7529659   -0.0494564    2.8326039 
H     0.9153629    0.2443219    2.3190081 
H     2.1858131    0.6951176    0.5991107 
H     2.2659982    1.8431747   -0.7085429 
H     0.3125414   -2.1849663    2.4732476 
H    -0.9476158   -1.9458130    1.2748568 
H     2.5808344   -0.4184013   -1.5448903 
H     1.1439922    0.3088508   -2.2487151 
H     1.0833242   -3.0227895    0.3687942 
H     2.0597462   -1.6383062    0.7784002 
H    -0.3382692   -1.0670452   -0.9702188 
H     0.8732737   -2.0740180   -1.6903214 
