33
Energy = -693.5338407189
O     1.3584609    2.4134742    1.6208409 
H     1.7366525    3.1429212    1.1176218 
H     1.9406031    1.6603494    1.4467094 
O    -1.1194647    0.3296647   -1.7284772 
O    -1.2281184    1.6994923    0.6389409 
C    -0.6703422   -0.3502571   -0.5559589 
C    -1.4064764    0.2845063    0.6641451 
C    -1.0470535   -1.8321690   -0.7276228 
C    -2.9076284    0.0162899    0.6234891 
C    -2.5599192   -2.0526069   -0.7700603 
C    -3.2281185   -1.4735586    0.4794811 
C     0.8466895   -0.2054742   -0.3916522 
C     1.6066598    0.4951831   -1.3277408 
C     1.5055239   -0.7600046    0.7121064 
C     2.9800046    0.6587247   -1.1589044 
C     2.8772951   -0.5997524    0.8857929 
C     3.6223096    0.1177429   -0.0496513 
H    -0.9908052   -0.1375507    1.5862901 
H    -0.6177824   -2.4030068    0.1007165 
H    -0.5709865   -2.1927187   -1.6428588 
H    -3.3271219    0.5664231   -0.2228713 
H    -3.3521853    0.4346020    1.5291824 
H    -2.7704982   -3.1221022   -0.8589767 
H    -2.9665691   -1.5670276   -1.6606386 
H    -4.3110514   -1.6170703    0.4370720 
H    -2.8759294   -2.0152046    1.3663385 
H    -1.2353226    1.2566848   -1.4668178 
H    -0.3500278    1.9308590    0.9967903 
H     1.1115382    0.9100210   -2.1947464 
H     0.9463837   -1.3153193    1.4551954 
H     3.5494559    1.2077243   -1.8998326 
H     3.3643899   -1.0358806    1.7499074 
H     4.6899933    0.2437213    0.0831082 
