18
Energy = -459.2258094023
O     2.2455554    1.9210265    0.7219240 
H     1.4112741    2.0125763    0.2283578 
H     2.9071537    2.4188064    0.2305246 
C     0.4911285   -1.0572238    0.2266579 
C    -0.5070200    0.0698932   -0.0721140 
O    -1.7748582   -0.3335389    0.0876444 
O    -0.2148585    1.2077606   -0.3740418 
C     0.1144949   -2.3575831   -0.4772363 
O     1.7983524   -0.7235930   -0.1613486 
C    -2.7950951    0.6707019   -0.0957070 
H     0.4210423   -1.2097017    1.3162470 
H     0.8434497   -3.1224389   -0.2103875 
H    -0.8816032   -2.6888690   -0.1894282 
H     0.1471588   -2.2159677   -1.5590019 
H     2.0811434    0.1097707    0.2612850 
H    -3.7375595    0.1612071    0.0850007 
H    -2.6554168    1.4874211    0.6128976 
H    -2.7588799    1.0673468   -1.1101818 
