16
Energy = -631.6650136010
O    -1.7663084   -2.5762508    0.4519768 
H    -1.0499796   -2.0978004    0.9076682 
H    -1.7608951   -3.4612373    0.8303939 
C    -0.7519592    1.0190104   -0.8447076 
C    -0.1454144   -0.2460294   -1.4562746 
C    -0.9894395    0.7256752    0.6381811 
C     1.0116101   -0.6650887   -0.5484079 
S     0.4525673   -0.3171517    1.1936249 
H    -1.6888202    1.2995087   -1.3322946 
H    -0.0586917    1.8591810   -0.9452719 
H     0.2052712   -0.0779645   -2.4774845 
H    -0.8960230   -1.0394000   -1.4770479 
H    -1.9048581    0.1541372    0.7870263 
H    -1.0233204    1.6271617    1.2477729 
H     1.9126289   -0.0833017   -0.7445631 
H     1.2474097   -1.7249584   -0.6328579 
