16
Energy = -308.7720023999
O    -1.7391703    1.1174299   -1.7125840 
H    -2.0491912    1.9748326   -2.0195717 
H    -1.0550490    1.3090573   -1.0447576 
C    -0.5892761   -1.1479072    0.5021429 
C     0.5179852   -1.1795629   -0.5856779 
C     1.2146878    0.1862954   -0.4426564 
O     0.2731854    1.0338797    0.2356209 
C    -0.3609685    0.1940502    1.2125504 
H    -1.5736467   -1.1607115    0.0362779 
H    -0.5238714   -1.9876962    1.1947311 
H     1.2213092   -2.0002597   -0.4408810 
H     0.0738728   -1.2802416   -1.5748808 
H     2.1287070    0.1096535    0.1595189 
H     1.4576603    0.6603310   -1.3926951 
H     0.3018447    0.0828712    2.0806543 
H    -1.2770429    0.6907209    1.5296880 
