{
	"JSON": {
		"ID": "1ee879cc-47ab-6e55-801c-0448fe5b7411",
		"label": "",
		"comment": "UUID6 is used"
	},
	"group": {
		"number": "09",
		"author": "Thomas Gruber",
		"experiment": "Kalometrie Küchentisch"
	}
}