{
	"JSON": {
		"ID": "1ee879e0-010f-64d4-a045-f88d645a496a",
		"label": "",
		"comment": "UUID6 is used"
	},
	"sensor": {
		"name": "Temperature_Sensor",
		"type": "DS18B20",
		"manufacturer": "keyestudio",
		"serial": "3ce1e38086d5",
		"comment": "",
		"range": {
			"min": -55,
			"max": 125,
			"units": "Grad Celcius"
		},
		"accuracy": {
			"value": 0.5,
			"type": "absolute(relative/absolute/fromMaximum)",
			"unit": "degree_celcius(degree_celcius,percent)"
		}
	}
}
