{
	"JSON": {
		"ID": "1ee879eb-49a9-6636-ae3d-ef2e9204f1c2",
		"label": "",
		"comment": "UUID6 is used"
	},
	"sensor": {
		"name": "Temperature_Sensor",
		"type": "DS18B20",
		"manufacturer": "keyestudio",
		"serial": "3ce1e380979a",
		"comment": "",
		"range": {
			"min": -55,
			"max": 125,
			"units": "Grad Celcius"
		},
		"accuracy": {
			"value": 0.5,
			"type": "absolute(relative/absolute/fromMaximum)",
			"unit": "degree_celcius(degree_celsius/percent)"
		}
	}
}
