{
	"JSON": {
		"ID": "1ee8590f-d4ee-6f7f-9440-88ac616ad432",
		"label": "",
		"comment": "UUID6 is used"
	},
	"group": {
		"number": "100",
		"author": "Thinh Nguyen",
		"experiment": "Kalorimetrie"
	}
}