{
    "assembly": {
        "uuid": "kpi-13a35d35-120d-4ec9-b8c7-bc670fa2329a",
        "properties": {
            "label": "model 1",
            "manufacturer": "Tahsin",
            "mass [g]": 353.0800000000001,
            "price [Euro]": 30.283999999999995,
            "delivery time [days]": 12
        },
        "layer": "kpi-SYSTEM",
        "components": [
            {
                "component": {
                    "uuid": "kpi-3552af32-35df-4bc3-9a40-b91d000afead",
                    "properties": {
                        "label": "battery",
                        "item number": "8881-1",
                        "item description": "Power Functions Battery Box",
                        "category": "battery",
                        "price [Euro]": 12,
                        "mass [g]": 179.4,
                        "delivery time [days]": 3,
                        "data source": "https://www.bricklink.com/v2/catalog/catalogitem.page?S=8881-1#T=S&O={%22iconly%22:0}",
                        "output voltage [V]": 9.0,
                        "dimensions [cm]": "8,8 x 6,3 x 3,2",
                        "color": "grey"
                    },
                    "layer": "kpi-COMPONENT"
                }
            }
        ],
        "assemblies": [
            {
                "assembly": {
                    "uuid": "kpi-0b65dbca-7550-4ff1-85fc-07b7c010cb6a",
                    "properties": {
                        "label": "fahrwerk assembly",
                        "assembly_method": "collect the 4 subassemblies and be prepared to mount them onto the chasis"
                    },
                    "layer": "kpi-ASSEMBLY",
                    "components": [],
                    "assemblies": [
                        {
                            "assembly": {
                                "uuid": "kpi-2dfbaa96-9a8b-425c-83cd-d6904908284e",
                                "properties": {
                                    "label": "front right axle assembly",
                                    "assembly_method": "put the axels into the wheels"
                                },
                                "layer": "kpi-SUBASSEMBLY",
                                "components": [
                                    {
                                        "component": {
                                            "uuid": "kpi-32e0b3e3-4752-456d-aac7-008e620a332b",
                                            "properties": {
                                                "label": "front right wheel",
                                                "item number": "41896c04",
                                                "item description": "wheel 56",
                                                "category": "wheel",
                                                "related items": 41897,
                                                "price [Euro]": 0.45,
                                                "mass [g]": 23.0,
                                                "delivery time [days]": 5,
                                                "data source": "https://www.bricklink.com/v2/catalog/catalogitem.page?P=41896c04#T=C",
                                                "diameter [mm]": 56.0,
                                                "color": "grey"
                                            },
                                            "layer": "kpi-COMPONENT"
                                        }
                                    },
                                    {
                                        "component": {
                                            "uuid": "kpi-832ebe91-9225-4ea7-b5d0-fb1f56fecfaa",
                                            "properties": {
                                                "label": "front right axle",
                                                "item number": 3749,
                                                "item description": "Technic, Axle 1L with Pin without Friction Ridges",
                                                "category": "frame",
                                                "price [Euro]": 0.01,
                                                "mass [g]": 0.22,
                                                "delivery time [days]": 5,
                                                "data source": "https://www.bricklink.com/v2/catalog/catalogitem.page?P=3749&name=Technic,%20Axle%20%201L%20with%20Pin%20without%20Friction%20Ridges&category=%5BTechnic,%20Axle%5D#T=S&O={%22iconly%22:0}",
                                                "dimension [studs]": "0,75 x 2 x 0,55",
                                                "color": "grey"
                                            },
                                            "layer": "kpi-COMPONENT"
                                        }
                                    }
                                ],
                                "assemblies": []
                            }
                        },
                        {
                            "assembly": {
                                "uuid": "kpi-28157fff-3dba-4f80-9464-7902f8779943",
                                "properties": {
                                    "label": "front left axle assembly",
                                    "assembly_method": "put the axels into the wheels"
                                },
                                "layer": "kpi-SUBASSEMBLY",
                                "components": [
                                    {
                                        "component": {
                                            "uuid": "kpi-7af51600-dbdf-41c5-a4f0-236f2fc6dbca",
                                            "properties": {
                                                "label": "front right wheel",
                                                "item number": "41896c04",
                                                "item description": "wheel 56",
                                                "category": "wheel",
                                                "related items": 41897,
                                                "price [Euro]": 0.45,
                                                "mass [g]": 23.0,
                                                "delivery time [days]": 5,
                                                "data source": "https://www.bricklink.com/v2/catalog/catalogitem.page?P=41896c04#T=C",
                                                "diameter [mm]": 56.0,
                                                "color": "grey"
                                            },
                                            "layer": "kpi-COMPONENT"
                                        }
                                    },
                                    {
                                        "component": {
                                            "uuid": "kpi-9e699b07-1189-4476-b15f-0a4e0d690a07",
                                            "properties": {
                                                "label": "front right axle",
                                                "item number": 3749,
                                                "item description": "Technic, Axle 1L with Pin without Friction Ridges",
                                                "category": "frame",
                                                "price [Euro]": 0.01,
                                                "mass [g]": 0.22,
                                                "delivery time [days]": 5,
                                                "data source": "https://www.bricklink.com/v2/catalog/catalogitem.page?P=3749&name=Technic,%20Axle%20%201L%20with%20Pin%20without%20Friction%20Ridges&category=%5BTechnic,%20Axle%5D#T=S&O={%22iconly%22:0}",
                                                "dimension [studs]": "0,75 x 2 x 0,55",
                                                "color": "grey"
                                            },
                                            "layer": "kpi-COMPONENT"
                                        }
                                    }
                                ],
                                "assemblies": []
                            }
                        },
                        {
                            "assembly": {
                                "uuid": "kpi-e5a1cd31-ea02-4725-967c-ff7804badaa0",
                                "properties": {
                                    "label": "back right axle assembly",
                                    "assembly_method": "put the axels into the wheels"
                                },
                                "layer": "kpi-SUBASSEMBLY",
                                "components": [
                                    {
                                        "component": {
                                            "uuid": "kpi-88b13357-74af-4436-8961-845bf1b20b65",
                                            "properties": {
                                                "label": "front right wheel",
                                                "item number": "41896c04",
                                                "item description": "wheel 56",
                                                "category": "wheel",
                                                "related items": 41897,
                                                "price [Euro]": 0.45,
                                                "mass [g]": 23.0,
                                                "delivery time [days]": 5,
                                                "data source": "https://www.bricklink.com/v2/catalog/catalogitem.page?P=41896c04#T=C",
                                                "diameter [mm]": 56.0,
                                                "color": "grey"
                                            },
                                            "layer": "kpi-COMPONENT"
                                        }
                                    },
                                    {
                                        "component": {
                                            "uuid": "kpi-231751eb-e588-4485-bdb8-88bf08a17b17",
                                            "properties": {
                                                "label": "front right axle",
                                                "item number": 3749,
                                                "item description": "Technic, Axle 1L with Pin without Friction Ridges",
                                                "category": "frame",
                                                "price [Euro]": 0.01,
                                                "mass [g]": 0.22,
                                                "delivery time [days]": 5,
                                                "data source": "https://www.bricklink.com/v2/catalog/catalogitem.page?P=3749&name=Technic,%20Axle%20%201L%20with%20Pin%20without%20Friction%20Ridges&category=%5BTechnic,%20Axle%5D#T=S&O={%22iconly%22:0}",
                                                "dimension [studs]": "0,75 x 2 x 0,55",
                                                "color": "grey"
                                            },
                                            "layer": "kpi-COMPONENT"
                                        }
                                    }
                                ],
                                "assemblies": []
                            }
                        },
                        {
                            "assembly": {
                                "uuid": "kpi-be2252de-24ad-4793-bd68-ec261b6d510f",
                                "properties": {
                                    "label": "back left axle assembly",
                                    "assembly_method": "put the 5L axel into the wheels"
                                },
                                "layer": "kpi-SUBASSEMBLY",
                                "components": [
                                    {
                                        "component": {
                                            "uuid": "kpi-19ac8925-264c-452e-a001-b775201077d8",
                                            "properties": {
                                                "label": "back left wheel",
                                                "item number": "41896c04",
                                                "item description": "wheel 56",
                                                "category": "wheel",
                                                "related items": 41897,
                                                "price [Euro]": 0.45,
                                                "mass [g]": 23.0,
                                                "delivery time [days]": 5,
                                                "data source": "https://www.bricklink.com/v2/catalog/catalogitem.page?P=41896c04#T=C",
                                                "diameter [mm]": 56.0,
                                                "color": "grey"
                                            },
                                            "layer": "kpi-COMPONENT"
                                        }
                                    },
                                    {
                                        "component": {
                                            "uuid": "kpi-2c04c52e-5989-439d-9f14-baaaa089fb85",
                                            "properties": {
                                                "label": "back left axel",
                                                "item number": 32073,
                                                "item description": "Axle 5 studs",
                                                "category": "axle",
                                                "price [Euro]": 0.001,
                                                "mass [g]": 0.66,
                                                "delivery time [days]": 3,
                                                "data source": "https://www.bricklink.com/v2/catalog/catalogitem.page?P=32073#T=S&O={%22iconly%22:0}",
                                                "dimension [studs]": 5,
                                                "color": "grey"
                                            },
                                            "layer": "kpi-COMPONENT"
                                        }
                                    }
                                ],
                                "assemblies": []
                            }
                        }
                    ]
                }
            },
            {
                "assembly": {
                    "uuid": "kpi-b7be605a-d80e-4158-92e3-5d6b0b9d7ad2",
                    "properties": {
                        "label": "chasis assembly",
                        "assembly_method": "connect the bars together to make a square like shape, connect the pins, bushs and axles"
                    },
                    "layer": "kpi-ASSEMBLY",
                    "components": [
                        {
                            "component": {
                                "uuid": "kpi-9d99b2c9-7455-47d1-bf17-f763755f8f05",
                                "properties": {
                                    "label": "front_bar",
                                    "item number": 32278,
                                    "item description": "Technic, Liftarm Thick 1 x 15",
                                    "category": "frame",
                                    "price [Euro]": 0.05,
                                    "mass [g]": 4.0,
                                    "delivery time [days]": 3,
                                    "data source": "https://www.bricklink.com/v2/catalog/catalogitem.page?P=32278&name=Technic,%20Liftarm%20Thick%201%20x%2015&category=%5BTechnic,%20Liftarm%5D#T=S&O={%22iconly%22:0}",
                                    "dimension [studs]": "1 x 15"
                                },
                                "layer": "kpi-COMPONENT"
                            }
                        },
                        {
                            "component": {
                                "uuid": "kpi-1fe4e287-6cde-427a-8586-4a38bda47f9d",
                                "properties": {
                                    "label": "back bar",
                                    "item number": 32278,
                                    "item description": "Technic, Liftarm Thick 1 x 15",
                                    "category": "frame",
                                    "price [Euro]": 0.05,
                                    "mass [g]": 4.0,
                                    "delivery time [days]": 3,
                                    "data source": "https://www.bricklink.com/v2/catalog/catalogitem.page?P=32278&name=Technic,%20Liftarm%20Thick%201%20x%2015&category=%5BTechnic,%20Liftarm%5D#T=S&O={%22iconly%22:0}",
                                    "dimension [studs]": "1 x 15"
                                },
                                "layer": "kpi-COMPONENT"
                            }
                        },
                        {
                            "component": {
                                "uuid": "kpi-e2228ae3-03ce-4781-8dfa-dd0323af46d0",
                                "properties": {
                                    "label": "left bar",
                                    "item number": 3703,
                                    "item description": "Technic, Brick 1 x 16 with Holes",
                                    "category": "frame",
                                    "price [Euro]": 0.07,
                                    "mass [g]": 5.87,
                                    "delivery time [days]": 5,
                                    "data source": "https://www.bricklink.com/v2/catalog/catalogitem.page?P=3703#T=C",
                                    "dimension [studs]": "1 x 16 x 1"
                                },
                                "layer": "kpi-COMPONENT"
                            }
                        },
                        {
                            "component": {
                                "uuid": "kpi-9b46e317-f727-4829-8d80-d0f21037294e",
                                "properties": {
                                    "label": "right bar",
                                    "item number": 3703,
                                    "item description": "Technic, Brick 1 x 16 with Holes",
                                    "category": "frame",
                                    "price [Euro]": 0.07,
                                    "mass [g]": 5.87,
                                    "delivery time [days]": 5,
                                    "data source": "https://www.bricklink.com/v2/catalog/catalogitem.page?P=3703#T=C",
                                    "dimension [studs]": "1 x 16 x 1"
                                },
                                "layer": "kpi-COMPONENT"
                            }
                        },
                        {
                            "component": {
                                "uuid": "kpi-f0779782-cacc-49a7-9cae-d98de609f9a6",
                                "properties": {
                                    "label": "motor mounting bar",
                                    "item number": 3895,
                                    "item description": "Technic, Brick 1 x 12 with Holes",
                                    "category": "frame",
                                    "price [Euro]": 0.03,
                                    "mass [g]": 4.2,
                                    "delivery time [days]": 5,
                                    "data source": "https://www.bricklink.com/v2/catalog/catalogitem.page?P=3895#T=C",
                                    "dimension [studs]": "1 x 12 x 1"
                                },
                                "layer": "kpi-COMPONENT"
                            }
                        },
                        {
                            "component": {
                                "uuid": "kpi-e0b23186-6806-43e2-892d-fb0a2fdd24d0",
                                "properties": {
                                    "label": "perpendicular pin",
                                    "item number": 55615,
                                    "item description": "Technic, Pin Connector Perpendicular 3 x 3 Bent with 4 Pins",
                                    "category": "frame",
                                    "price [Euro]": 0.1,
                                    "mass [g]": 1.9,
                                    "delivery time [days]": 5,
                                    "data source": "https://www.bricklink.com/v2/catalog/catalogitem.page?P=55615&name=Technic,%20Pin%20Connector%20Perpendicular%203%20x%203%20Bent%20with%204%20Pins&category=%5BTechnic,%20Connector%5D#T=S&O={%22iconly%22:0}",
                                    "dimension [studs]": "4 x 4 x 1"
                                },
                                "layer": "kpi-COMPONENT"
                            }
                        },
                        {
                            "component": {
                                "uuid": "kpi-9edc8ff3-b7d7-4d2f-921f-23f4da87f647",
                                "properties": {
                                    "label": "motor mounting bar",
                                    "item number": 3673,
                                    "item description": "Technic, Pin without Friction Ridges",
                                    "category": "frame",
                                    "price [Euro]": 0.01,
                                    "mass [g]": 0.16,
                                    "delivery time [days]": 3,
                                    "data source": "https://www.bricklink.com/v2/catalog/catalogitem.page?P=3673&name=Technic,%20Pin%20without%20Friction%20Ridges&category=%5BTechnic,%20Pin%5D#T=S&O={%22iconly%22:0}",
                                    "dimension [studs]": 1
                                },
                                "layer": "kpi-COMPONENT"
                            }
                        },
                        {
                            "component": {
                                "uuid": "kpi-7b86c7b4-ae06-452d-824f-74cd9bb3a215",
                                "properties": {
                                    "label": "right pin",
                                    "item number": 3673,
                                    "item description": "Technic, Pin without Friction Ridges",
                                    "category": "frame",
                                    "price [Euro]": 0.01,
                                    "mass [g]": 0.16,
                                    "delivery time [days]": 3,
                                    "data source": "https://www.bricklink.com/v2/catalog/catalogitem.page?P=3673&name=Technic,%20Pin%20without%20Friction%20Ridges&category=%5BTechnic,%20Pin%5D#T=S&O={%22iconly%22:0}",
                                    "dimension [studs]": 1
                                },
                                "layer": "kpi-COMPONENT"
                            }
                        },
                        {
                            "component": {
                                "uuid": "kpi-e8f31af0-811b-432a-8756-302be5b2972f",
                                "properties": {
                                    "label": "axle 1",
                                    "item number": 32073,
                                    "item description": "Axle 5 studs",
                                    "category": "axle",
                                    "price [Euro]": 0.001,
                                    "mass [g]": 0.66,
                                    "delivery time [days]": 3,
                                    "data source": "https://www.bricklink.com/v2/catalog/catalogitem.page?P=32073#T=S&O={%22iconly%22:0}",
                                    "dimension [studs]": 5,
                                    "color": "grey"
                                },
                                "layer": "kpi-COMPONENT"
                            }
                        },
                        {
                            "component": {
                                "uuid": "kpi-8956c19d-3e47-474b-ac53-63c6be26e4a4",
                                "properties": {
                                    "label": "axle 2",
                                    "item number": 32073,
                                    "item description": "Axle 5 studs",
                                    "category": "axle",
                                    "price [Euro]": 0.001,
                                    "mass [g]": 0.66,
                                    "delivery time [days]": 3,
                                    "data source": "https://www.bricklink.com/v2/catalog/catalogitem.page?P=32073#T=S&O={%22iconly%22:0}",
                                    "dimension [studs]": 5,
                                    "color": "grey"
                                },
                                "layer": "kpi-COMPONENT"
                            }
                        },
                        {
                            "component": {
                                "uuid": "kpi-abec989b-2d48-4fc1-8d3b-588756e7d811",
                                "properties": {
                                    "label": "bush 1",
                                    "item number": 3713,
                                    "item description": "Technic Bush",
                                    "category": "frame",
                                    "price [Euro]": 0.01,
                                    "mass [g]": 0.14,
                                    "delivery time [days]": 3,
                                    "data source": "https://www.bricklink.com/v2/catalog/catalogitem.page?P=3713&name=Technic%20Bush&category=%5BTechnic%5D#T=S&O={%22iconly%22:0}",
                                    "dimension [studs]": 1
                                },
                                "layer": "kpi-COMPONENT"
                            }
                        },
                        {
                            "component": {
                                "uuid": "kpi-8d123b37-7ee3-4b47-8908-9f4f45f53f5b",
                                "properties": {
                                    "label": "bush 2",
                                    "item number": 3713,
                                    "item description": "Technic Bush",
                                    "category": "frame",
                                    "price [Euro]": 0.01,
                                    "mass [g]": 0.14,
                                    "delivery time [days]": 3,
                                    "data source": "https://www.bricklink.com/v2/catalog/catalogitem.page?P=3713&name=Technic%20Bush&category=%5BTechnic%5D#T=S&O={%22iconly%22:0}",
                                    "dimension [studs]": 1
                                },
                                "layer": "kpi-COMPONENT"
                            }
                        },
                        {
                            "component": {
                                "uuid": "kpi-425fb191-6929-4fca-a7a0-602aa2437ed5",
                                "properties": {
                                    "label": "bush 3",
                                    "item number": 3713,
                                    "item description": "Technic Bush",
                                    "category": "frame",
                                    "price [Euro]": 0.01,
                                    "mass [g]": 0.14,
                                    "delivery time [days]": 3,
                                    "data source": "https://www.bricklink.com/v2/catalog/catalogitem.page?P=3713&name=Technic%20Bush&category=%5BTechnic%5D#T=S&O={%22iconly%22:0}",
                                    "dimension [studs]": 1
                                },
                                "layer": "kpi-COMPONENT"
                            }
                        },
                        {
                            "component": {
                                "uuid": "kpi-06014052-45e9-4478-b5a2-7f4fd972971b",
                                "properties": {
                                    "label": "bush 4",
                                    "item number": 3713,
                                    "item description": "Technic Bush",
                                    "category": "frame",
                                    "price [Euro]": 0.01,
                                    "mass [g]": 0.14,
                                    "delivery time [days]": 3,
                                    "data source": "https://www.bricklink.com/v2/catalog/catalogitem.page?P=3713&name=Technic%20Bush&category=%5BTechnic%5D#T=S&O={%22iconly%22:0}",
                                    "dimension [studs]": 1
                                },
                                "layer": "kpi-COMPONENT"
                            }
                        }
                    ],
                    "assemblies": []
                }
            },
            {
                "assembly": {
                    "uuid": "kpi-8fa82c80-166a-49e3-a6e7-a66b694bbeba",
                    "properties": {
                        "label": "antrieb assembly",
                        "assembly_method": "put the motor axel into the motor"
                    },
                    "layer": "kpi-ASSEMBLY",
                    "components": [
                        {
                            "component": {
                                "uuid": "kpi-fa8db3ce-f00c-42ae-923e-39bd6949b577",
                                "properties": {
                                    "label": "motor",
                                    "item number": "88003-1",
                                    "item description": "Power Functions L-Motor",
                                    "category": "motor",
                                    "related items": "8881, 8878, 88000",
                                    "idle current [mA]": 120,
                                    "idle speed [rev per min]": 390,
                                    "locking torque [Ncm]": 18,
                                    "price [Euro]": 15,
                                    "mass [g]": 48.0,
                                    "delivery time [days]": 3,
                                    "data source": "https://www.bricklink.com/v2/catalog/catalogitem.page?S=88003-1&name=Power%20Functions%20L-Motor&category=%5BPower%20Functions%5D#T=S&O={%22iconly%22:0}",
                                    "compatible battery": "8881, 8878, 88000",
                                    "input voltage [V]": 9,
                                    "dimensions [cm]": "13 x 11 x 2.5",
                                    "color": "yellow"
                                },
                                "layer": "kpi-COMPONENT"
                            }
                        }
                    ],
                    "assemblies": [
                        {
                            "assembly": {
                                "uuid": "kpi-cd91367d-5820-4b4b-ab5b-6f859c90566b",
                                "properties": {
                                    "label": "gearbox assembly",
                                    "assembly_method": "Align the gears, put the motor axel into the gear motor"
                                },
                                "layer": "kpi-SUBASSEMBLY",
                                "components": [
                                    {
                                        "component": {
                                            "uuid": "kpi-7e4c38b4-026d-4f08-9d39-e6222eaefd58",
                                            "properties": {
                                                "label": "motor axle",
                                                "item number": 32073,
                                                "item description": "Axle 5 studs",
                                                "category": "axle",
                                                "price [Euro]": 0.001,
                                                "mass [g]": 0.66,
                                                "delivery time [days]": 3,
                                                "data source": "https://www.bricklink.com/v2/catalog/catalogitem.page?P=32073#T=S&O={%22iconly%22:0}",
                                                "dimension [studs]": 5,
                                                "color": "grey"
                                            },
                                            "layer": "kpi-COMPONENT"
                                        }
                                    },
                                    {
                                        "component": {
                                            "uuid": "kpi-99bc20d4-0d9d-4913-a729-e9ca010e7024",
                                            "properties": {
                                                "label": "gear motor",
                                                "item number": 3647,
                                                "item description": "Gear 8 Tooth",
                                                "category": "gear",
                                                "price [Euro]": 0.14,
                                                "mass [g]": 0.16,
                                                "delivery time [days]": 11,
                                                "data source": "https://www.bricklink.com/v2/catalog/catalogitem.page?P=3647#T=C",
                                                "color": "yellow"
                                            },
                                            "layer": "kpi-COMPONENT"
                                        }
                                    },
                                    {
                                        "component": {
                                            "uuid": "kpi-afc91274-5fc9-4447-806b-7b00ca88ac5a",
                                            "properties": {
                                                "label": "gear wheel",
                                                "item number": 32498,
                                                "item description": "Gear 36 Tooth",
                                                "category": "gear",
                                                "price [Euro]": 0.88,
                                                "mass [g]": 3.5,
                                                "delivery time [days]": 12,
                                                "data source": "https://www.bricklink.com/v2/catalog/catalogitem.page?P=32498#T=C",
                                                "color": "grey"
                                            },
                                            "layer": "kpi-COMPONENT"
                                        }
                                    }
                                ],
                                "assemblies": []
                            }
                        }
                    ]
                }
            }
        ]
    }
}