{
	"JSON": {
		"ID": "1ee823ec-9064-6977-8963-933103fbb222",
		"label": "",
		"comment": "UUID6 is used"
	},
	"part": {
		"name": "shaft_testrig_3",
		"material": "20MnVS",
		"young's modulus": {
			"value": 210000,
			"unit": "N/mm**2"
		},
		"dimensions": {
			"length": {
				"value": 0.75,
				"unit": "meter"
			},
			"diameter": {
				"value": 10,
				"unit": "millimeter"
			}
		}
	}
}