{
	"JSON": {
		"ID": "1ee823a0-e8a4-601b-9043-f583956451d4",
		"label": "",
		"comment": "UUID6 is used"
	},
	"instrument": {
		"name": "digital analog converter",
		"type": "MCP4725",
		"model": "com-dac01",
		"manufacturer": "joy-it",
		"bus": "i2c",
		"voltage": "5"
	}
}
