{
    "JSON": {
        "ID": "708debc5-96c2-4e02-a3f2-5d61f0dbcc67",
        "label": "setup_grundig",
        "comment": "UUID6 is used"
    },
    "setup": {
        "1ee846ef-4df0-632a-bfdb-ef2ea3181b39": {
            "type": "general",
            "name": "general_info",
            "comment": ""
        },
        "1ee846f1-b588-6d3c-9659-7c3266d530e8": {
            "type": "instrument",
            "name": "raspberry_pi",
            "comment": ""
        },
        "1ee847be-fddd-6ee4-892a-68c4555b0981": {
            "type": "sensor",
            "name": "accelerometer",
            "range": {
                "min": -2,
                "max": 2,
                "units": "m/s²"
            },
            "frequency": {
                "value": 800,
                "units": "Hertz"
            },
            "comment": ""
        },
        "9ac9d64b-3c2e-4e85-86b4-7e1a90b6a887": {
            "type": "probe",
            "name": "Stabmixer",
            "comment": ""
        }
    }
}