{
	"JSON": {
		"ID": "1ee57b30-ace4-6e8c-9836-7ed05301f708",
		"label": "PDC005",
		"comment": "UUID6 is used"
	},
	"probe": {
		"material": "Edelstahl",
		"mass": {
			"value": 628,
			"unit": "gramm",
			"uncertainty": {
				"value": 1,
				"type": "absolut",
				"unit": "gramm"
			}
		},
		"dimensions": {
			"height": {
				"value": 40,
				"unit": "millimeter"
			},
			"diameter": {
				"value": 60,
				"unit": "millimeter"
			},
			"volume": {
				"value": 80570,
				"unit": "cubic millimeter"
			}
		}
	}
}