{
	"JSON": {
		"ID": "1ee5ec0a-1830-63f5-ac3e-6f8ce4468546",
		"label": "",
		"comment": "UUID6 is used"
	},
	"group": {
		"number": "calorimetry_Group29",
		"author": [
			"Jakob_Knoblach_member01",
			"Tahsin_Ahmad_member02",
			"Frederik_Zahradnik_member03"
		],
		"experiment": "calorimetry",
		"testrig_number": "02"
	}
}
