{
	"JSON": {
		"ID": "1ee81471-466e-6226-9e87-bc8a08613c53",
		"label": "",
		"comment": "UUID6 is used"
	},
	"sensor": {
		"name": "Temperature_Sensor",
		"type": "DS18B20",
		"manufacturer": "keyestudio",
		"serial": "3ce10457690c",
		"comment": "",
		"range": {
			"min": "-55",
			"max": "+125",
			"units": "Celsius"
		},
		"accuracy": {
			"value": "0.5",
			"type": "between -10°C to +85°C",
			"unit": "0.5 Celsius / 0,526 percent"
		}
	}
}
