{
  "antiPatterns": [
    {
      "name": "Our Scripts are Almighty",
      "aliases": [
        "Our pipeline is almighty to test",
        "Lack of smoke testing on deployment scripts"
      ],
      "description": "Pipeline process is not subjected to testing, and outcomes of pipeline actions are not verified. by automated means.",
      "context": "",
      "detection": "Lack of smoke tests in pipeline configuration and deployment scripts.",
      "consequences": "A pipeline unnecessarily continues testing software product even when environment pipeline creates for such a software product to interact with is faulty. Might provide a feedback that indicates a software product is at fault, while it is pipeline that is at fault. Reduces trust put into a pipeline and the accompanying software product. Manual verifications of pipeline process is loss of value and capital.",
      "cause": "Lack of attention and knowledge in smoke testing a pipeline.",
      "solution": "Identify pipeline configuration to identify all the functionalities a pipeline has, and write smoke tests for each, which would be run before unit testing starts.",
      "example": "A pipeline does not verify if it deploys the right version of a dependency and whether it is accessible.",
      "sources": [
        "@article{Duvall2018, author = {Duvall, Paul and Posin, David}, file = {:home/ulfet/Dropbox/Thesis/Articles_Waiting/11565134-dzone-refcard84-cipatternsandantipatterns.pdf:pdf}, pages = {1--8}, title = {{CI Patterns and Anti-Patterns}}, year = {2018} }",
        "@article{Zampetti2020b, abstract = {Continuous Integration (CI) has been claimed to introduce several benefits in software development, including high software quality and reliability. However, recent work pointed out challenges, barriers and bad practices characterizing its adoption. This paper empirically investigates what are the bad practices experienced by developers applying CI. The investigation has been conducted by leveraging semi-structured interviews of 13 experts and mining more than 2,300 Stack Overflow posts. As a result, we compiled a catalog of 79 CI bad smells belonging to 7 categories related to different dimensions of a CI pipeline management and process. We have also investigated the perceived importance of the identified bad smells through a survey involving 26 professional developers, and discussed how the results of our study relate to existing knowledge about CI bad practices. Whilst some results, such as the poor usage of branches, confirm existing literature, the study also highlights uncovered bad practices, e.g., related to static analysis tools or the abuse of shell scripts, and contradict knowledge from existing literature, e.g., about avoiding nightly builds. We discuss the implications of our catalog of CI bad smells for (i) practitioners, e.g., favor specific, portable tools over hacking, and do not ignore nor hide build failures, (ii) educators, e.g., teach CI culture, not just technology, and teach CI by providing examples of what not to do, and (iii) researchers, e.g., developing support for failure analysis, as well as automated CI bad smell detectors.}, author = {Zampetti, Fiorella and Vassallo, Carmine and Panichella, Sebastiano and Canfora, Gerardo and Gall, Harald and {Di Penta}, Massimiliano}, doi = {10.1007/s10664-019-09785-8}, file = {:home/ulfet/.var/app/com.elsevier.MendeleyDesktop/data/data/Mendeley Ltd./Mendeley Desktop/Downloaded/Zampetti et al. - 2020 - An empirical characterization of bad practices in continuous integration(3).pdf:pdf}, isbn = {1066401909785}, issn = {15737616}, journal = {Empirical Software Engineering}, keywords = {Bad practices,Continuous integration,Empirical study,Interview,Survey}, number = {2}, pages = {1095--1135}, publisher = {Empirical Software Engineering}, title = {{An empirical characterization of bad practices in continuous integration}}, volume = {25}, year = {2020} }"
      ],
      "tags": [
        "Automate where Possible",
        "Upholding Confidence",
        "Reliance on Code"
      ],
      "relatedItems": [
        {
          "relation": "relates",
          "name": "DBs not in CD"
        },
        {
          "relation": "relates",
          "name": "Not a Time Machine"
        }
      ]
    }
  ]
}