{
    "antiPatterns": [
      {
        "name": "Dead Element",
        "description": "Dead elements are elements that will never be executed",
        "consequences": "EA Process Model might lose its maintainability due to having a lot of elements that do not serve any purpose.",
        "solution": "",
        "graphical definiton": "",
        "tags": [
          "Control-flow Problems","Process"
        ],
        "sources": [],

        "relatedItems": [
          {
            "relation": "",
            "name": ""
          }
        ]
      }
    ]
  }
  