{
  "antiPatterns": [
    {
      "name": "Hub-like Modularization",
      "aliases": [
        "Bottleneck Service"
      ],
      "description": "This smell arises when an abstraction has dependencies (both incoming and outgoing) with a large number of other abstractions, being a single point of failure.",
      "context": "Derived from: \"Hub-like Modularization\"",
      "detection": "Check the number of incoming and outgoing relations of the corresponding cluster. If the amount is too high, report the smell.",
      "consequences": "The service may have increased response times and low availability. It also becomes a single point of failure in the architecture.",
      "cause": "Functionality may gradually become more and more important and is therefore used by more and more consumers, maybe even external ones via a public service interface. To maximize reuse, service interfaces are sometimes also generalized which leads to more service consumers as well.",
      "solution": "Split according to responsibilities.",
      "example": "",
      "sources": [],
      "tags": [
        "microservices",
        "soa",
        "business",
        "application",
        "technology",
        "between elements",
        "The Couplers",
        "automatic detection"
      ],
      "relatedItems": [
        {
          "relation": "relates",
          "name": "Lazy Component"
        },
        {
          "relation": "relates",
          "name": "Dense Structure"
        },
        {
          "relation": "relates",
          "name": "Weakened Modularity"
        }
      ]
    }
  ]
}