{
    "antiPatterns": [
      {
        "name": "Contradiction in input",
        "description": "Refers to Or Junction conditions that are contradicting in itself. For example, Or Junction conditions that only result in one path if the variable A equals to 10 and 5 at the same time.",
        "consequences": "It results into Dead Element smell because we never could reach one path of junction for example because the rules never apply for that path.",
        "solution": "",
        "graphical definiton":"",
        "tags": [
          "Rule-related defects", "Process"
        ],
        "sources": [],

        "relatedItems": [
          {
            "relation": "",
            "name": ""
          }
        ]
      }
    ]
  }
  