{
  "antiPatterns": [
    {
      "name": "Incomplete Abstraction",
      "aliases": [
        ""
      ],
      "description": "This smell arises when an abstraction does not support complementary or interrelated functionality completely, resulting in another component needing to complete said feature.",
      "context": "Derived from: \"Incomplete Abstraction\"",
      "detection": "Symmetric feature pairs cannot be found.",
      "consequences": "Functionality also has to be implemented multiple times for each user. Unit tests for such functionality (e.g. data validation) may fail or contain a lot of overhead code to properly test such a service.",
      "cause": "Mainly caused by a lack of understanding that abstractions shall be self-contained, standalone functional components. A lack of communication in the development team can also lead to this antipattern, not adhering to language conventions or other standards.",
      "solution": "Refactor the functionality and aim for symmetric feature pairs.",
      "example": "read/write",
      "sources": [],
      "tags": [
        "soa",
        "microservices",
        "business",
        "application",
        "technology",
        "abstraction"
      ],
      "relatedItems": [
        {
          "relation": "relates",
          "name": "Feature Envy"
        },
        {
          "relation": "relates",
          "name": "Nanoservices"
        },
        {
          "relation": "relates",
          "name": "Incomplete Node or Collaboration"
        },
        {
          "relation": "precedes",
          "name": "Duplication"
        },
        {
          "relation": "follows",
          "name": "Deficient Names"
        }
      ]
    }
  ]
}