{
    "antiPatterns": [
      {
        "name": "Break up Component",
        "aliases": [
          ""
        ],
        "description": "When components have too many relations to other components there exists a tight coupling. Therefore some components can be split to make the coupling more loose.",
        "connectedEASmell": "Deficient Encapsulation, Hub-like Modularization",
        "derivedFrom": "Break up Class",
        "prerequirements": "The component with the to permissive accessibility can split up into smaller components that separate concerns better.",
        "impact": "\"Maintainability: An architecture is easier to maintain when there are not more then necessary relations.\nExtensibility: It is easier to extend a more coherent architecture with loose coupling than one with very strict coupling.\"",
        "mechanics": "\"1. Split the to permissive component into two parts A and B by choosing A and B in a way that A provides the minimum accessibility that is needed by the component that called the original component.\n2. The component that used the original component now calls A that onlx provides the neccessary accessibility.\"",
        "discussion": "This refactoring breaks up a component that gives to general access to other components. By breaking this component up the access can be narrow down more precisely, but it can happen, that the split up components need to access the other split components.",
        "summary": "",
        "intent": "Break a component with too many relations up into smaller components.",
        "motivation": "An architecture is hard to maintain when tight coupling exists. Therefore it can be useful make the coupling more loose by splitting some components up.",
        "sources": [
          "@book{fowler2018refactoring,title={Refactoring: improving the design of existing code},author={Fowler, Martin},year={2018},publisher={Addison-Wesley Professional}}"
        ],
        "tags": [
          "business",
          "application",
          "technology"
        ],
        "relatedItems": [
          {
            "relation": "",
            "name": ""
          }
        ]
      }
    ]
}
  