{
    "antiPatterns": [
      {
        "name": "Move Component",
        "aliases": [
          ""
        ],
        "description": "As architecture is constantly changing sub-components sometimes need to be moved from one component to another. Starting with sub-component with the least dependency, this refactoring moves subcomponents. It can be necessary to rename the moved components with the rename component refactoring.",
        "connectedEASmell": "Feature Envy",
        "derivedFrom": "Move function",
        "prerequirements": "A sub-component that belongs to a component and another component where the sub-component should be moved to.",
        "impact": "Efficiency: Moving a component can increase understandability. Maintainability: Moving a component can make the architecture less complicated.",
        "mechanics": "1. Decide if by this component triggered components should move too. Then move them first with the Move Component refactoring.\n2. Copy the component to the target context. Adjust it to ft in there.\n3. If necessary rename the component with the Rename Component refactoring.\n4. Refer from the old home to the moved component.\n5. Remove the component from the old home.\n6. Test.",
        "discussion": "Whether the impact of moving a component is positive or negative depends on the reason why to move the process. In general, moving a process is mainly only meaningful when it removes a smell.",
        "summary": "",
        "intent": "Intent is to move a function from one component to another one.",
        "motivation": "As an enterprise archictecture changes from time to time it can become necessary to move a function to components where they are now better fiiting.",
        "sources": [
          "@book{fowler2018refactoring,title={Refactoring: improving the design of existing code},author={Fowler, Martin},year={2018},publisher={Addison-Wesley Professional}}",
          "@inproceedings{kebir2016automatic,title={Automatic Refactoring of Component-based Software by Detecting and Eliminating Bad Smells},author={Kebir, Salim and Borne, Isabelle and Meslati, Djamel},booktitle={Proceedings of the 11th International Conference on Evaluation of Novel Software Approaches to Software Engineering},pages={210--215},year={2016}}"
        ],
        "tags": [
          "business",
          "application",
          "technology"
        ],
        "relatedItems": [
          {
            "relation": "",
            "name": ""
          }
        ]
      }
    ]
}
  