{
    "antiPatterns": [
      {
        "name": "Inline Service",
        "aliases": [
          ""
        ],
        "description": "Services with very simple and short functionality can be integrated into callers of the service. Thereby the architecture gets de-cluttered. This refactoring moves copies of all the sub-components from a simple service into all the components that call the service. Then the service can be removed safely. As this refactoring increases duplication, it should only be applied to services with simple functionality that change very rarely.",
        "connectedEASmell": ". Lazy Component (a, b, t)",
        "derivedFrom": "Inline Function",
        "prerequirements": "A service with very little complexity. The components that realize this service are self-explaining.",
        "impact": " Efficiency: Faster to understand due to de-cluttered design. Maintainability: Less abstraction leads to less complexity. As duplicates of the former service are now in every caller changing this functionality will be harder than before.",
        "mechanics": " 1. Move components from the service into every component that triggers the service. Start with the one with the least dependency, the last one triggered in the service. Use the Move Component refactoring to do so.\n2. Remove the service.\n3. Test.",
        "discussion": "When the service is triggered by many components and needs to change often, the duplication created by this refactoring will be extreme. In this case, it could be useful to keep the abstraction. But when this is not the case, this refactoring can improve the understandability of the architecture.",
        "summary": "",
        "intent": "The intent is to remove services with to less functionality to be necessary.",
        "motivation": "Services with limited resposibility clutter the design and make it harder to understand the system. They create a misleading sense of abstraction.",
        "sources": [
          "@book{fowler2018refactoring,title={Refactoring: improving the design of existing code},author={Fowler, Martin},year={2018},publisher={Addison-Wesley Professional}}"
        ],
        "tags": [
          "business",
          "application",
          "technology"
        ],
        "relatedItems": [
          {
            "relation": "",
            "name": ""
          }
        ]
      }
    ]
}
  