{
    "antiPatterns": [
      {
        "name": "Reorganization",
        "aliases": [
          ""
        ],
        "description": "When components are split based on technical layers instead of business capabilities, there needs to be done a business process analysis how the architecture can be restructured. Some components need to be rearranged.",
        "connectedEASmell": "Wrong Cuts",
        "derivedFrom": "Move Function",
        "prerequirements": "An architecture with components in the wrong layer.",
        "impact": "Maintainability: The wrong separation of concerns makes a system harder to maintain. By repositioning those components the maintainability can be improved.",
        "mechanics": "1. Perform a Business Process analysis.\n2. Determine components that are not correctly positioned.\n3. Use the Move Component refactoring to bring the components to the desired places.",
        "discussion": "Sometimes the analysis can reveal that it is necessary to split some of the components before moving them into different layers. It is also important to involve all the stakeholders into the analysis before changing the system so everybody who is involved in the architecture can express their needs.",
        "summary": "",
        "intent": "Move components to their right layer due to business needs.",
        "motivation": "It is not optimal for an architecture to be split on the base of only technical layers, because the architecture is meant to suit the business and not the other way around. When the layers are build supporting the business needs the architecture becomes much more coherent.",
        "sources": [
          "@book{fowler2018refactoring,title={Refactoring: improving the design of existing code},author={Fowler, Martin},year={2018},publisher={Addison-Wesley Professional}}"
        ],
        "tags": [
          "business",
          "application",
          "technology"
        ],
        "relatedItems": [
          {
            "relation": "",
            "name": ""
          }
        ]
      }
    ]
}
  