{
    "antiPatterns": [
      {
        "name": "Front End Gate",
        "aliases": [
          ""
        ],
        "description": "A front end gate is created which groups multiple similar points of access from different services into one single point of access. ",
        "connectedEASmell": "Chatty Service, Feature Envy, Nanoservices",
        "derivedFrom": "Front End Gate",
        "prerequirements": "Multiple points of access for services that serve common functionality.",
        "impact": "\"Usability: The architecture becomes more comfortable to use when there is only a single point of access instead of multiple ones the user has to figure out.\nExtensibility: It gets easier to add new components and just add a reference into the front end gate.\nMaintainability: The system is much more coherent when those too fine grained functions are grouped into more coarse ones.\"",
        "mechanics": "\"1. Create a new component that serves as a front end gat.\n2. Group all the access point services with a common functionality together in the front end gate.\n3. Redirect each call to the individual access points to the front end gate and test each of them individually.\"",
        "discussion": "This refactoring can unify the way of accessing a service for which there were many access points before. In situations where there are no access points that can be grouped together one can maybe investigate the usage of the refactorings for other refactorings related to smells like chatty service, feature envy, and nanoservices.",
        "summary": "",
        "intent": "Create a front end gate as a single point of access for the service.",
        "motivation": "Users of the service dont have to bother with multiple points of access when needing the service. They then have a single point of access which is the front end gate.",
        "sources": [
          "@article{article,author = {Král, Jaroslav and Zemlicka, Michal},year = {2005},month = {01},pages = {},title = {Service Orientation in Environmental Information Systems}}"
        ],
        "tags": [
          "business",
          "application",
          "technology"
        ],
        "relatedItems": [
          {
            "relation": "",
            "name": ""
          }
        ]
      }
    ]
}
  