{
    "antiPatterns": [
      {
        "name": "Encapsulate Data Service",
        "aliases": [
          ""
        ],
        "description": "Encapsulate the data from a service.",
        "connectedEASmell": "Data Service",
        "derivedFrom": "Encapsulate Record",
        "prerequirements": "A Service that only serves data operation with primitive data types",
        "impact": "Maintainability: Things that change together are located near to each other",
        "mechanics": "1. Change the names of the versions to be semantically ordered (e.g 1.0.0, 1.0.1, 1.0.2, 1.1.0, 1.2.0, 2.0.0, ...).\n2. Change the references to the service accordingly.\n3. Test.",
        "discussion": "It is best to start semantically versioning from the beginning on. But even when there need to be a lot of services and references changed in can still be worth to apply a semantic versioning scheme. Another possibility is to leave old version names as they are and start with semantic versioning for all new versions.",
        "summary": "",
        "intent": "The data access and the functionality build upon this data should be in the same place. ",
        "motivation": "Things that are changed together should be at the same place. As data access and the functionality build on this data are changed together often, they should be close to each other.",
        "sources": [
          "@book{fowler2018refactoring,title={Refactoring: improving the design of existing code},author={Fowler, Martin},year={2018},publisher={Addison-Wesley Professional}}"
        ],
        "tags": [
          "application, business"
        ],
        "relatedItems": [
          {
            "relation": "",
            "name": ""
          }
        ]
      }
    ]
}
  