{
    "antiPatterns": [
      {
        "name": "Rename Component",
        "aliases": [
          ""
        ],
        "description": "Unfitting names for components slow down the process of understanding the model. They can even lead to errors when they are misleading. This refactoring changes the name of a component to increase efficiency.",
        "connectedEASmell": "Deficient Names, Documentation",
        "derivedFrom": "Rename Field",
        "prerequirements": "A component with a name that does not fit well to the functionality of the component.",
        "impact": "Efficiency: Faster to understand.",
        "mechanics": "1. If the scope of use of this component is limited:\n1.1 Rename the component.\n1.2 Rename all accesses.\n1.3 Test.\n2. Else:\n2.1 Use Add Abstraction to create abstraction.\n2.2 Rename internally.\n2.3 Adjust internal accesses.\n2.4 Test.",
        "discussion": "Renaming a component should only be done when the old name is not fitting anymore or was never fitting. Otherwise, it could lead to increased search times when the name is changed too often.",
        "summary": "",
        "intent": "The intent is to make the name well fitting to the component. A coworker should be able to tell the function of this component just by hearing the name.",
        "motivation": "Unfitting or missleading names confuses a reader. This slows them down in the process of understanding an architecture.",
        "sources": [
          "@book{fowler2018refactoring,title={Refactoring: improving the design of existing code},author={Fowler, Martin},year={2018},publisher={Addison-Wesley Professional}}"
        ],
        "tags": [
          "business",
          "application",
          "technology"
        ],
        "relatedItems": [
          {
            "relation": "",
            "name": ""
          }
        ]
      }
    ]
}
  