,X_0,X_1,X_2,X_3,X_4
0,1.0,0.0,0.0,0.0,0.0
1,1.0,1.0,1.0,0.0,0.0
2,0.0,0.0,0.0,0.0,0.0
3,1.0,1.0,1.0,1.0,1.0
4,0.0,0.0,0.0,0.0,0.0
5,1.0,1.0,0.0,0.0,0.0
6,0.0,0.0,0.0,0.0,0.0
7,0.0,0.0,0.0,0.0,0.0
8,0.0,0.0,0.0,0.0,0.0
9,0.0,0.0,0.0,0.0,0.0
10,0.0,0.0,0.0,0.0,0.0
11,1.0,0.0,0.0,0.0,0.0
12,0.0,0.0,0.0,0.0,0.0
13,1.0,1.0,1.0,0.0,0.0
14,0.0,0.0,0.0,0.0,0.0
15,0.0,0.0,0.0,0.0,0.0
16,0.0,0.0,0.0,0.0,0.0
17,0.0,0.0,0.0,0.0,0.0
18,1.0,1.0,1.0,1.0,1.0
19,0.0,0.0,0.0,0.0,0.0
20,0.0,0.0,0.0,0.0,0.0
21,1.0,0.0,0.0,0.0,0.0
22,1.0,1.0,1.0,1.0,1.0
23,0.0,0.0,0.0,0.0,0.0
24,0.0,0.0,0.0,0.0,0.0
25,1.0,1.0,1.0,0.0,0.0
26,1.0,0.0,0.0,0.0,0.0
27,0.0,0.0,0.0,0.0,0.0
28,0.0,0.0,0.0,0.0,0.0
29,1.0,0.0,0.0,0.0,0.0
30,0.0,0.0,0.0,0.0,0.0
31,0.0,0.0,0.0,0.0,0.0
32,0.0,0.0,0.0,0.0,0.0
33,1.0,1.0,0.0,0.0,0.0
34,0.0,0.0,0.0,0.0,0.0
35,1.0,1.0,0.0,0.0,0.0
36,1.0,0.0,0.0,0.0,0.0
37,0.0,0.0,0.0,0.0,0.0
38,0.0,0.0,0.0,0.0,0.0
39,0.0,0.0,0.0,0.0,0.0
40,1.0,1.0,1.0,1.0,1.0
41,0.0,0.0,0.0,0.0,0.0
42,0.0,0.0,0.0,0.0,0.0
