0,1,2
6.76223293932098,50.529709754151,132851.0
6.53614170883554,50.5321118215132,32763.0
6.22549433664331,50.5313216611711,36301.0
7.13894710512338,50.6026796027721,314261.0
7.02489084434212,50.6177782277501,88259.0
7.25029945786913,50.6323807977432,37444.0
6.50061244366108,50.6300187112556,37698.0
6.95254695803711,50.6428738277651,306111.0
7.19272532486062,50.6489815749228,780.0
7.021470024105,50.671665971141,13681.0
7.30370324572482,50.6876135927548,263436.0
7.09103487041584,50.6914354068616,8417.0
7.23246419864535,50.6949193878055,2476.0
6.19906754200256,50.6834503152256,312943.0
6.41040226962136,50.6992299974291,119685.0
7.00446288314548,50.7162048921602,3599.0
6.25344598058251,50.7122309217337,82501.0
6.03982389991996,50.7230869874238,3239.0
7.5403688828362,50.7648599364749,2565.0
8.07882016083522,50.7750804318376,136212.0
7.07127283382821,50.7808911327449,28395.0
7.52477424949729,50.791507945706,21672.0
7.02647886757695,50.8157283451425,168626.0
7.04065812013274,50.8160926142806,3246.0
6.34542912581566,50.8051744583743,14162.0
7.01172434990328,50.8243431552891,378761.0
7.46563750579472,50.8351945775057,81294.0
7.621254478771,50.8474968517994,64.0
7.64963945342476,50.8480776706375,5877.0
8.11807906727435,50.8566547389926,32976.0
7.9047283630825,50.861976498187,5364.0
6.03067464642811,50.830779174873,10614.0
7.30750766916969,50.8675950282597,17461.0
6.56889212405732,50.8570215407236,4884.0
6.05750824251706,50.8496991966501,686.0
7.17865673784351,50.8825114681029,116.0
6.11348942727533,50.8605964814203,67554.0
6.46821684071076,50.8719839671581,10279.0
7.02188921619102,50.8875748907797,225700.0
7.33435858986036,50.8952002808961,107986.0
7.73217416308431,50.9036844778728,72761.0
7.19177327964115,50.9008204692274,30652.0
7.41909504421641,50.9061162864126,28556.0
6.7650572987295,50.8986667408668,87915.0
7.67443706335296,50.9205242411159,1076.0
6.08285210625129,50.886561980804,84796.0
6.36677460517887,50.8958348001344,37715.0
6.40937180485941,50.897165625861,593.0
6.42357136751891,50.8976057497398,96.0
7.88726923679504,50.9335980700223,7858.0
7.10374347453012,50.9436250466234,9270.0
6.36396643119157,50.9317406524306,12300.0
6.70506739234489,50.9419571658024,86377.0
6.87506359654178,50.9556682821227,13395.0
6.98883658663759,50.95868358633,9275.0
8.09874538785643,50.9822232604013,858.0
8.45467746028724,50.9875171587361,15580.0
6.12094087005929,50.9418455085674,9498.0
6.26233816811238,50.9554986243566,34615.0
6.85962797844301,50.9732427104415,13618.0
6.97285722040905,50.9852535666628,3156.0
7.07247576418034,50.9878142159228,5147.0
7.22903915003956,50.9916650795753,27561.0
7.86975379255873,51.005215632743,31936.0
6.94380492696312,50.9934862755229,5155.0
6.97227099004479,50.9942337818712,96767.0
7.07190877229074,50.9967950005617,48.0
7.0861435613136,50.9971538974757,31164.0
7.24273936271375,51.0009863875737,18005.0
6.97168447800827,51.0032139743981,8410.0
7.0286301133082,51.0046883426892,8443.0
7.39885433877412,51.0135898198495,4483.0
6.80024820341691,51.0076022162186,273389.0
6.85719456181396,51.009160829379,28599.0
7.14197743938597,51.0165342978093,4156.0
6.51489589750708,51.0083670051905,18745.0
8.50961216654936,51.0511709205641,1223.0
6.89870466937439,51.0282708683653,5513.0
6.95567910877541,51.0297812050675,2273.0
6.89810325860417,51.0372505513171,2038.0
6.94084202998688,51.0383861802864,4155.0
7.08331827569518,51.0420578853356,101646.0
7.09756703208256,51.0424154319098,473.0
7.26856757120972,51.0465694820455,6277.0
7.72469815617881,51.0564144760079,32155.0
6.92599936906696,51.0469892160848,2264.0
7.06850109264606,51.0506792398779,3124.0
7.29654586521784,51.0562192044601,2876.0
7.39633084085725,51.0585020009869,651.0
7.61018526567667,51.0631047521224,10965.0
6.91115112331003,51.0555903112696,167.0
7.39582541246506,51.067484373355,412.0
7.49563860371039,51.069681853147,16373.0
7.63824362505313,51.0726722050362,2008.0
7.36679777891152,51.0758229652706,10910.0
6.88143786646164,51.0727866750199,66835.0
7.29497084332712,51.0831647309081,15181.0
7.35202286612822,51.084480571971,581.0
7.48040062301378,51.0873387064042,136.0
7.92269512995856,51.0960966697762,17321.0
8.63635424789023,51.1066712340259,22254.0
6.60994199688,51.0741665802794,79832.0
6.68122091644492,51.0762277477165,1875.0
6.88083224729825,51.0817661601364,11501.0
6.89509186203717,51.0821486277916,70102.0
7.49417891187669,51.09663031423,6367.0
8.33625784309287,51.1117502440856,21548.0
5.91094675543379,51.0606250224581,32362.0
7.05138892754829,51.095220635449,32646.0
7.09418427033955,51.0962999673575,2782.0
7.27965149761217,51.1007948193221,58117.0
7.3795318958958,51.103092433181,107.0
6.87962013404411,51.0997250632225,5611.0
7.03654842028136,51.1038377113879,3073.0
7.05081588896361,51.1042010741574,1626.0
7.25058161503823,51.1091041149616,3046.0
7.53602582753804,51.1155123737946,66.0
6.00912087179909,51.0820461922576,67821.0
6.72208130235858,51.1043788686569,23901.0
7.03597233979561,51.1128180472039,989.0
7.09305450994575,51.1142613047455,553.0
7.12159681719744,51.1149724151987,908.0
7.83539524108478,51.1304702906702,15891.0
6.26498745213183,51.0995654965334,13626.0
7.04909511605042,51.1311422597065,152697.0
7.44889681708739,51.1406110704584,163.0
7.46317816730334,51.1409238023801,3449.0
7.6202845167725,51.144248026361,5923.0
6.24926966338276,51.1170560378448,22023.0
6.47755097530676,51.1242073530659,14948.0
7.11991674910142,51.1419147357421,428.0
7.37698236580113,51.1480032014983,5402.0
6.10587066810682,51.1213328855267,1031.0
6.56250437353915,51.1357508018917,2445.0
6.57677831021331,51.1361724454483,1378.0
6.81947104115365,51.143072129642,1010.0
6.93370193055451,51.146143669598,42084.0
7.14792145880732,51.1516001934965,8318.0
6.21926902880505,51.1340805138866,107946.0
6.46190536375597,51.1417268710201,8307.0
6.49045560940944,51.1425931389669,3858.0
6.9045404853113,51.1543657870507,3629.0
7.13308066244034,51.1602294956265,174.0
7.14736617255461,51.1605810603486,1503.0
7.56172884159886,51.1700127740304,24977.0
6.81823266484709,51.1610300297756,154055.0
7.24683415623981,51.17197425075,73046.0
7.332576156593,51.1739734970008,233.0
7.84716199737369,51.1846411108201,15811.0
6.56049678883563,51.1626827103636,3201.0
6.70332988125807,51.1668230263416,126852.0
6.97477555337531,51.1742061842293,12814.0
7.13196373502098,51.1781910085434,33547.0
7.73234914717638,51.1914510055286,47360.0
7.76094651895904,51.1920051265989,3291.0
6.31701941207887,51.1642172090423,196085.0
6.51697335975247,51.1703833786623,1631.0
7.48880861576998,51.1954397512198,2754.0
7.03077510091378,51.193640095619,5832.0
6.25844184228078,51.1803426076226,41667.0
7.44491786057758,51.2124702371984,919.0
7.8597904909035,51.2208418428624,8601.0
6.27200085124843,51.1897768868274,879.0
7.04391783787426,51.2119646536611,42660.0
7.40150140089033,51.2205019054422,381.0
7.83075101976604,51.2292960332072,676.0
7.17208218347588,51.2241454953531,92754.0
7.77307462675536,51.2371987433347,23994.0
6.18478961802299,51.2049447042436,100982.0
6.92831968942901,51.2269597158037,132.0
6.94262451712218,51.227336522683,220.0
6.97123481644254,51.2280848631572,3955.0
7.12860647646107,51.2320750418285,53633.0
7.30031247892082,51.2361853191869,77625.0
7.38617584702052,51.2381454894743,2288.0
6.67022114475212,51.2288545335999,11614.0
6.84187912504727,51.2336409026463,6669.0
6.87049194480736,51.2344140232002,52868.0
6.98495194917191,51.237436185011,5965.0
6.99926041482968,51.237806043484,1181.0
7.38566551975608,51.2471274489002,22985.0
7.97267892912245,51.2588294112032,57517.0
8.38803267085282,51.2653194396421,43048.0
6.95574146373882,51.2456707935559,19077.0
6.98436332794785,51.2464159521933,3168.0
7.59992555862231,51.2607348320945,68.0
6.7118492106762,51.2480310664343,5493.0
6.74046910142951,51.2488361858462,250.0
6.84064589435512,51.2515987147578,50893.0
6.85495776259389,51.2519863276196,38777.0
7.25577632690653,51.2621253146769,42063.0
7.47056433213813,51.2669894309573,115654.0
7.5135268570412,51.2679147281544,737.0
7.57081267354703,51.2691238109516,493.0
6.76845891765823,51.2586127055199,18924.0
6.85434348662171,51.260965288318,12462.0
6.98318523173558,51.2643754232864,14558.0
7.39845542846995,51.2743940333583,63776.0
7.44142364036496,51.2753459490456,14756.0
7.54168907167443,51.2775054597934,687.0
7.67061420917572,51.2801551845521,1179.0
6.15245464619422,51.2488744771561,59238.0
6.22398544109111,51.2512178294183,576.0
6.23829240123409,51.2516812281125,26943.0
6.52448587216492,51.2605800845982,1405.0
6.93963819116356,51.2722339977455,2302.0
6.96827635385489,51.2729831772317,3663.0
6.98259575635035,51.2733551273037,2185.0
7.01123519862803,51.274093747894,21147.0
7.05419594021947,51.2751884792672,32639.0
7.51255475432558,51.2858797740188,252.0
7.71314521854685,51.2899901604684,2398.0
7.78479248444113,51.2913744781253,207.0
7.79912241100544,51.291646056118,1729.0
6.72424006860607,51.2753689337485,4571.0
7.72702990239024,51.2992540268908,87146.0
8.52984486905968,51.3121459782606,13563.0
6.48017541610702,51.277243120983,245.0
6.7235997924821,51.2843470331566,7345.0
7.46858564423496,51.3029186135349,5267.0
7.43942162574036,51.3112744909904,78909.0
7.58277244407549,51.3143358405655,61475.0
7.62578106872754,51.3152198759634,5173.0
6.87992552833875,51.3066307586917,1609.0
7.13788516689539,51.3132525968698,68624.0
7.16655150275982,51.3139531237553,2702.0
7.56796066646431,51.323020344027,15078.0
6.70734775180681,51.3108771291555,2757.0
6.72167710493595,51.3112812018652,13731.0
6.90797940948035,51.3163738786642,99195.0
6.96531072971456,51.3178809665536,9508.0
6.53473611822072,51.3148677178011,3090.0
6.70670344113918,51.3198550516614,1722.0
6.7210355886413,51.320259215105,76398.0
7.12242616020211,51.3308604986743,214.0
7.15110328613757,51.3315648656928,393.0
7.16544215202978,51.331914405182,24467.0
7.17978121852708,51.3322621819381,860.0
8.65758997597844,51.3586355050369,9777.0
6.40508037907663,51.3199367221887,27009.0
6.56272236664841,51.3246935218553,41293.0
6.8924308875377,51.3339508244093,8234.0
6.94978371910943,51.3354656392852,1022.0
6.96412246921949,51.3358399368413,9618.0
7.10752162195524,51.3394859651548,26744.0
7.66696466540139,51.3520206049267,1045.0
8.34149397510016,51.3635604894072,3348.0
6.5047104594146,51.3319649977845,4325.0
6.90616300759192,51.3433112870709,15888.0
7.00655384338452,51.3459319582278,82474.0
6.87687021312289,51.3515255809942,21432.0
6.94858870604841,51.3534243588136,12280.0
6.99162240425302,51.3545424662845,59283.0
7.13508176788669,51.3581548622325,15326.0
7.22116719811685,51.3602376382222,162428.0
8.06801738230201,51.3773344304862,136066.0
6.71846641545127,51.3561710544873,30848.0
6.7901865751333,51.3581672430325,25889.0
7.34978916210607,51.3722242618504,206.0
7.10525375562555,51.3754069393183,12241.0
7.27749429464092,51.3795531863995,5291.0
8.74248527822072,51.4045286695917,24163.0
6.81762901845202,51.3769104202587,209248.0
6.87503346909698,51.3784622247545,6187.0
6.96114677681765,51.3807370026814,165667.0
7.33439135370192,51.3898602163775,238.0
7.34874958436333,51.3901872783918,1814.0
7.83703483160962,51.4002566171391,40738.0
6.5730294595471,51.3789773330664,36726.0
6.58737906286048,51.3793980082848,1181.0
6.65913069073988,51.3814749273216,10660.0
6.71653626606006,51.3831047112425,39479.0
6.7308882449508,51.3835077469287,11999.0
6.8026515992617,51.3854964612922,731.0
7.80787670299428,51.4087044536185,483.0
6.40014779082763,51.3827674245339,34433.0
6.51495022397909,51.3862535278958,2608.0
6.54365332568847,51.3871074158051,52.0
6.57235740862428,51.3879542477558,20796.0
6.88816477096219,51.3968035973717,7302.0
7.44826119523559,51.4103912218787,15728.0
6.24158439952993,51.3867643590722,9686.0
6.39944176894619,51.3917431505969,73663.0
6.52862086114113,51.3956579605929,316.0
6.75832140846776,51.4022647334738,11453.0
7.14607262781572,51.412388934699,11833.0
7.21789524088365,51.4141225110058,146012.0
7.34718832557655,51.4171316586707,316932.0
7.37592222435858,51.4177809243599,16357.0
7.39028945431203,51.418102906916,6844.0
7.56271040632923,51.4218288683758,254021.0
8.35326581137192,51.4356490437488,31692.0
6.22649531108759,51.395275640197,2614.0
6.67152351596075,51.4088176629258,126026.0
7.31792862746341,51.4254565996537,8201.0
6.52725828939145,51.4136111095575,85399.0
6.90069793229959,51.4241223984031,128503.0
7.69113572910815,51.4424224569219,848.0
9.15822769790521,51.4621978641577,31458.0
7.47500921830471,51.446943842799,10041.0
8.7119773945978,51.4671220849988,714.0
7.76214139592464,51.4617876078962,17366.0
8.23686416344135,51.469912061633,201.0
6.72639329497584,51.4463528478851,3435.0
7.0857575651191,51.4558702511075,5995.0
8.17895582523746,51.4780148899973,86944.0
7.43036437914503,51.4729491069959,7964.0
7.80442792658974,51.4805728166954,1108.0
8.12102677171773,51.4860889664877,73.0
6.91203168529319,51.4693976178468,7604.0
6.99831767245295,51.4716456950004,1149.0
7.01269942599101,51.4720141846149,3523.0
7.02708139271946,51.4723809055697,3130.0
7.04146357161893,51.4727458578226,21744.0
7.68886466822616,51.4873374576635,116982.0
7.77521211932268,51.4890121991794,1152.0
8.509374219138,51.5006732782546,341.0
6.88265843750489,51.4776128350147,16067.0
6.94019108616501,51.4791331173457,16518.0
6.96895872525518,51.4798826456269,3413.0
6.98334286992201,51.4802547563949,12582.0
7.02649659217183,51.4813604746951,24255.0
7.0408815922715,51.481725509319,3963.0
7.44374365499454,51.4912280592449,24044.0
8.13468510236645,51.5042888463637,357.0
6.92520275543438,51.4877346614631,3064.0
6.9395890692685,51.4881121640863,59121.0
7.02591150734623,51.4903400242627,14975.0
7.15540943827353,51.493562370678,24423.0
8.5231912399346,51.5188278513577,83241.0
6.23419631951431,51.4765091902432,63862.0
7.06849871168545,51.5004098429413,31126.0
7.54351543420845,51.511351388134,121948.0
6.85203571197816,51.5037776104709,19104.0
6.90960045552047,51.5053130820709,5318.0
7.03913395596544,51.5086643469227,31551.0
7.06792153408188,51.5093895998434,9719.0
7.12549919892142,51.5108188603213,355.0
7.15428926927618,51.5115228672191,54073.0
7.31264899357551,51.5152682940297,26444.0
6.4772623418394,51.5020830254075,42183.0
6.73627465498171,51.5095994779676,14968.0
6.96657149071944,51.515799391572,40867.0
7.02415454520519,51.5172785561521,353.0
7.12493305003536,51.5197989209213,7028.0
7.3409204939609,51.5249074728885,189.0
7.39852452449467,51.5262024390311,5591.0
7.57135423977266,51.5299172428272,352.0
6.62048303955214,51.5153066062073,20871.0
6.6348758122853,51.5157216271526,601.0
6.96597395620308,51.5247785291453,23336.0
7.10996624186316,51.5284241427859,14867.0
7.34039652207708,51.5338886693331,18490.0
7.35480007796797,51.5342151421223,2875.0
6.67740120472395,51.525933420707,2770.0
7.03738376808738,51.535603010318,26575.0
7.06618831586905,51.5363287551169,22676.0
7.25343800428978,51.5408733491251,32778.0
7.3254660972298,51.542541528353,5342.0
7.4119061245447,51.5444848560173,19447.0
7.44072096247042,51.5451184518358,19701.0
7.45512865721278,51.545432590816,8935.0
8.33430417895492,51.5612417011247,5938.0
7.25289652062946,51.5498540571315,8326.0
7.28171284097135,51.5505267976612,8485.0
7.31052994113429,51.551192447719,5071.0
7.32493878107973,51.5515226137245,5160.0
7.36816644803858,51.5525024751902,8599.0
7.59874202352959,51.5574589061985,5208.0
6.66168954579317,51.5434780711446,112869.0
7.25235477327803,51.5588347465927,744.0
7.78568057913682,51.5701349703345,4865.0
7.25181276205002,51.5678154175623,48519.0
7.35271297691078,51.5701400397477,119.0
7.43920630256981,51.5720634028165,147.0
7.16477524876737,51.574733909335,3066.0
7.19360619124415,51.5754283906867,3919.0
7.2224379399862,51.5761157777126,80244.0
7.35219056604901,51.5791212185851,427.0
6.89030962290619,51.5767611633372,14844.0
6.90472378299266,51.5771430665995,27601.0
7.1786338877813,51.5840622827985,15707.0
7.2939867622734,51.5867840677432,1818.0
7.35166790059035,51.5881023793027,25771.0
7.78436897145447,51.59708460681,2640.0
8.88112312033772,51.6126864109461,184400.0
6.63022914436612,51.5785606985115,86862.0
6.88969586610813,51.5857397374783,4829.0
6.90411286239761,51.5861217272075,84736.0
7.1636558385479,51.5926942251508,1343.0
7.92822674628732,51.6087074130634,946.0
7.95708765023774,51.609214025761,594.0
6.45659541201837,51.5824313502378,1938.0
6.90350164409943,51.5951003685573,29713.0
7.42275592465409,51.6076733403081,9804.0
7.66804584620259,51.612810872646,10572.0
7.91338429667316,51.6174351439097,6399.0
6.74425320651122,51.5997776211451,4603.0
6.77309421629097,51.6005756546953,1364.0
7.07597928447222,51.6085265332481,7351.0
7.23467100605609,51.6123789300442,292.0
7.3068116520944,51.6140590106042,43757.0
6.13805886309262,51.5903539489963,41768.0
7.07540156685421,51.6175061441711,3842.0
7.10425843860843,51.6182227176405,13003.0
7.50833845777504,51.6275089580925,29816.0
6.90166620088962,51.6220361775869,6766.0
7.11811772027628,51.6275581768071,2293.0
7.40679181408437,51.6342992966221,1311.0
7.49340900086613,51.6361830743879,38433.0
7.82549986652145,51.6428115994166,47363.0
8.17211775062413,51.648725779184,330.0
8.22989517508532,51.649611904389,524.0
6.92991685444203,51.631774261196,387.0
6.97321310813905,51.6329002220087,72535.0
7.37740240240969,51.6426383582024,443.0
7.55067310863509,51.6463854414149,39217.0
9.38566279134265,51.6703448414523,24931.0
6.9004410797204,51.6399932882873,36473.0
7.39132470822594,51.6519416447557,25758.0
7.53574548688089,51.6550649234297,14571.0
7.76685530209142,51.6596923945888,37565.0
6.10615988458217,51.625292462089,43780.0
6.94314007327461,51.6501089456065,3971.0
7.20305278752229,51.6565959336684,21835.0
7.23193612610126,51.6572811698854,15531.0
7.24637809562364,51.6576211220484,798.0
7.30414795108243,51.6589631568088,21378.0
7.44858606840322,51.6621938129602,4987.0
7.69417259767966,51.6672778856755,20065.0
7.73751654027008,51.6681217254958,6673.0
7.9253569323207,51.6715933821041,13624.0
7.99761010957035,51.6728485843175,868.0
7.21694372833158,51.6659197567718,28000.0
7.43363356070002,51.6708601849707,4479.0
7.52032137185274,51.6727243337608,1184.0
7.79487426270244,51.678205050573,12443.0
8.05503020750279,51.6828048722825,594.0
8.54655532466441,51.689920103056,12873.0
6.94193024729007,51.6680664590282,21459.0
7.08637475179905,51.6717430847121,848.0
7.17305162386699,51.6738637329258,4272.0
7.89562352255993,51.6890458864881,20878.0
8.38719775617298,51.6968285825449,45093.0
6.39253778785355,51.6614499846754,36771.0
6.56580105785989,51.6666519494774,16557.0
6.95577121567199,51.6774209340684,7582.0
6.9702177600707,51.6777949026769,7368.0
7.30254660738621,51.6859054311334,2138.0
7.79400065307804,51.6961712120428,1608.0
8.18440646988608,51.7028577674325,93.0
8.37241509576322,51.7056142741407,4221.0
6.49290960772339,51.6734914128189,29930.0
6.88292475565807,51.684502790777,36074.0
7.44656460091782,51.6981197464664,47212.0
7.46102086413979,51.6984333191122,26193.0
7.51884774422659,51.69966981403,538.0
6.46332667693191,51.6815998698726,8059.0
7.5328160858022,51.7089563506427,10262.0
7.85098012905618,51.7152102867781,21005.0
6.75161408064653,51.6989313678104,4999.0
7.02623964316643,51.706210592499,10894.0
7.22864544665342,51.7111632662891,107.0
8.15438669990314,51.7293603527726,57010.0
8.1977964128143,51.7300343261073,49.0
6.49082563331692,51.7004188893554,54577.0
6.73651588191775,51.7075078808344,2410.0
7.51737195454197,51.7266151414369,2941.0
7.70544041629851,51.7304396925199,724.0
7.71990841523999,51.7307214203705,4093.0
8.22638509618984,51.7394594129174,4087.0
8.26980535819687,51.7401068042124,58.0
8.25498559619085,51.7488775537416,559.0
8.42871066570676,51.7513286397043,13112.0
8.57349419012179,51.7531750686966,6275.0
8.93549604813871,51.7570108846754,21232.0
9.39892674877776,51.7602938856444,18681.0
7.05340032847498,51.7338773969743,9195.0
7.18359466022077,51.737071446093,1443.0
7.76242575788446,51.7495216321987,3147.0
7.86374982079157,51.7514072931917,4163.0
8.26911850021868,51.7580764148438,46.0
8.31255711431426,51.7587080515404,553.0
8.68906830043162,51.7635098469696,4700.0
6.67672438268392,51.7328171463986,1309.0
7.48694584254825,51.7529447896876,123.0
7.68959779281736,51.7571037778586,4453.0
7.9212401351901,51.7614290995226,7706.0
7.93571911024826,51.7616842777622,14458.0
6.41573706787552,51.7341371401266,14101.0
7.12458768154817,51.7536290192392,9447.0
7.38511416286557,51.7597153590902,2314.0
7.63122356475008,51.7649333781154,12464.0
7.73257748457298,51.7669322302655,643.0
8.47123418951449,51.7788575608386,54290.0
8.64481374794277,51.7899750132503,106.0
6.32752284283283,51.7494058798687,458.0
7.74616215798805,51.7851761105463,6664.0
7.28217207658789,51.7843585233547,49998.0
8.05000731206177,51.7995973900667,9467.0
8.28189219874284,51.8032127480032,35383.0
6.47078042454065,51.7717908344422,4826.0
6.81820048598561,51.7817101440073,11417.0
7.26714653927126,51.7930032166939,1240.0
7.35406237155913,51.7949910442897,99.0
6.02146055767501,51.7664324759339,1140.0
7.23762723756398,51.8013065482676,498.0
6.46937823207981,51.7897418757234,27393.0
6.3093964207032,51.7938247932873,4322.0
6.72938337737971,51.8062582119733,133.0
7.8164225832551,51.8314570136691,1532.0
7.83092348155451,51.8317251610406,855.0
8.04845536185374,51.8355330242779,393.0
8.96239777481088,51.8471355642963,3017.0
8.26567409873882,51.8479235670173,364.0
8.46879994929703,51.8507402995768,73136.0
7.84456668673987,51.8499576312335,9644.0
6.04647057661785,51.812271011931,52680.0
6.77091611669038,51.83439119983,272.0
7.74257287055981,51.8570373236412,2944.0
6.75577547693181,51.8429698138292,4713.0
7.59701623755054,51.8631482915977,145205.0
7.90175992891994,51.8689722197986,1718.0
7.34984749031277,51.8668371110089,272.0
7.71264482215127,51.874442319054,2491.0
7.90092349974012,51.8869386857115,6065.0
8.97568397858492,51.90118162717,4419.0
9.00473920712659,51.9014305379072,26005.0
6.40575157964668,51.8597882979497,3375.0
6.63779262938332,51.8666448138874,1261.0
6.94244127986269,51.8749502417211,18937.0
8.96094923749539,51.9100409260625,99278.0
6.17301586153596,51.861448134709,28530.0
6.81122966378412,51.8804648347125,11154.0
6.84025078909528,51.8812470772301,28476.0
7.10148151210154,51.8879656095079,11021.0
7.6677090128055,51.9005353178148,16614.0
7.6822313532324,51.9008218474654,2379.0
7.8710368498662,51.9043839202098,157.0
6.63645264237555,51.8845978021274,53857.0
6.65096310110084,51.8850113474384,4171.0
6.73803096193387,51.8874551011537,8141.0
7.84155756759882,51.9128385314979,2154.0
6.67932291275566,51.8948098275576,3752.0
6.69383698604235,51.8952181065187,9868.0
6.78092647168377,51.8976302505757,2573.0
7.66677835026527,51.9184996639513,29134.0
8.39337217884927,51.9306395427918,22315.0
8.75678802895993,51.9350304100166,414.0
7.95696420895539,51.932876158234,2768.0
7.98603280351056,51.9333761980581,1491.0
8.00056732318751,51.9336235316227,6096.0
8.05870685972658,51.9345949562173,4141.0
8.36397527231626,51.9392247435895,8358.0
9.04737238347383,51.9467233854689,2531.0
6.67799825826438,51.9127632715541,229.0
7.37520586651212,51.9303521247088,195.0
7.41879729692337,51.9313145479304,1316.0
7.69491477503102,51.9370357423102,12796.0
8.23243296888541,51.9553060516775,2314.0
8.24697564239751,51.9555230348855,4416.0
8.2615184448473,51.9557382258704,565.0
8.68331100481672,51.9611990392539,9300.0
7.57767964798038,51.9526690133503,28973.0
8.2611710326879,51.9647226888008,2276.0
8.78489336400466,51.971277246173,3746.0
7.41725043137357,51.9582573221735,2205.0
7.28586096577709,51.9642999294387,11388.0
7.41673430226703,51.9672382155871,1387.0
7.83853808164576,51.975718697988,25221.0
7.2562318881488,51.9726073219374,280.0
7.66351381720733,51.981374396177,4861.0
7.82355563749882,51.9844341208509,156.0
8.33290179425066,51.992726027749,2025.0
8.65314220068174,51.9968133124709,86424.0
8.74048931720792,51.9977772977385,9010.0
8.76960577732554,51.9980842694272,7944.0
7.22659174897261,51.9809072219662,30217.0
7.27022943285668,51.9819247353326,1861.0
9.06041288988488,52.0187321124926,32556.0
7.31279423496181,52.0008867551329,2992.0
7.44326396322545,52.0127764219438,5269.0
7.73444524096561,52.0187214632503,3959.0
8.06938587811011,52.0246708795539,35502.0
8.08395031993782,52.0249080102036,13549.0
8.4332231122861,52.0390454353044,20299.0
6.78710954237035,52.0147317217955,18471.0
6.80166314438915,52.0151268776778,49951.0
7.31118021366147,52.0278275907311,66.0
7.76267131495284,52.0372413561354,17288.0
8.01033270904634,52.0416713023278,12267.0
7.15044737350368,52.0330520796588,7162.0
6.78582285679669,52.0326861875519,4946.0
7.79092047281165,52.0557545169617,7244.0
9.14678337158207,52.0733144077026,7805.0
7.2215902713337,52.0617254156639,52.0
7.23616213036751,52.0620670838415,2755.0
8.4170667372005,52.0837755104579,6204.0
8.47540766640417,52.0845419446529,251136.0
9.11726204641111,52.0910733561673,6070.0
8.44592516741323,52.0931472058686,82342.0
8.78148109509222,52.0970794061514,61855.0
7.58497702987674,52.0876914311595,1787.0
7.13243889852619,52.0865753763938,1963.0
7.52615253940485,52.0954671086693,294.0
6.986052617471,52.0919280835126,7865.0
7.01521303607799,52.0926677552538,1276.0
7.02979357775521,52.0930348960999,569.0
7.19019382998808,52.0969548509602,116.0
8.59096383114962,52.1219296222145,36525.0
6.86879173365474,52.0978751832202,2105.0
7.29173634643597,52.1083161961474,63557.0
7.53974965253706,52.1137338750822,378.0
7.55434036611631,52.1140363768617,7313.0
6.86816319363754,52.1068528144344,9949.0
7.53925550058927,52.1227151565338,33313.0
7.5241647224988,52.1313919831422,43297.0
8.89687917561869,52.1521400828335,74730.0
7.8740989269484,52.1471846067122,17045.0
7.47936373368942,52.1484297909032,479.0
8.96909485875934,52.188742307205,53091.0
8.47141844408209,52.2013455623054,22370.0
8.50066586469501,52.2017191069272,1670.0
9.01236149698141,52.2160741603751,87046.0
7.15359792486678,52.2129885519133,33625.0
7.15302438261695,52.2219676970093,1298.0
8.46987728448012,52.2462694796067,36413.0
8.71874455150778,52.2492180164484,1352.0
7.0787317466788,52.2381465781979,37620.0
7.83967832426407,52.2544471174473,17030.0
7.85431669166393,52.254712759448,3549.0
7.82460124710381,52.2631620668626,3212.0
7.32528731135631,52.2799325266389,99074.0
7.73538672597071,52.2884650612939,31562.0
8.81860489036074,52.3491222244748,22824.0
7.7317205936618,52.3603204268879,47119.0
8.56830286632347,52.3733363625597,68498.0
7.67208900625754,52.3771492965236,3588.0
