longitude,latitude
6.77305766045323,51.21321085
6.78207940958327,51.225113
6.86389370395204,51.1644236
6.7493957,51.3003466
6.82460376538923,51.26669
6.84446590596739,51.24391775
6.7855567720581,51.2359614
6.8208559,51.2347233
6.75947797707107,51.2545299
6.85614545634393,51.24321105
6.7279705,51.2314343
6.7610062,51.2117563
6.78982079482326,51.19596785
6.78256482844832,51.38028375
6.76142729993009,51.4172328
6.7686068,51.5146302
6.70817455972796,51.53106825
6.7612916505057,51.49050415
6.69932656162615,51.4120253
6.7551325562992,51.36487375
6.78387287389617,51.39661495
7.09198237315183,51.44994975
7.00760638933522,51.426264
7.03282228441032,51.44543695
7.00593250958802,51.39001815
7.08578627656613,51.3916617
7.00628117897768,51.49960565
7.03044899155328,51.4416251
6.98708346299411,51.43395925
7.0050073,51.4316032
6.98896885994726,51.3629684
7.00642021453176,51.38912905
6.98878377961576,51.43510215
6.5659735,51.3210998
6.57442615703796,51.3145822
6.58668408827188,51.32549175
6.64806390828032,51.3523825
6.4253206,51.1988759
6.4185146,51.218778
6.4624879,51.2239388
6.4388997,51.1659464
6.4199089,51.1580847
6.88241681464446,51.4245961
6.88674122670344,51.4259815
6.8448097,51.5175112
6.86637365309779,51.47506275
6.8544788945967,51.4617695
7.1805601661683,51.1801058
7.1887229,51.1616257
7.22503932755576,51.20571455
7.0260116,51.1441026
7.0971981,51.1553472
6.98450952415528,51.1544767
7.0694225,51.1854782
7.13065301442482,51.26771575
7.17390598123583,51.2752619
7.1434161,51.2595935
6.17684544839026,51.7620027
6.2394841436139,51.83292705
6.3281822424433,51.5283752
6.18156695122259,51.6766995
6.29331274206398,51.74006085
6.24998925558064,51.5840564
6.1317779,51.7737551
7.02083443942495,51.1988702
6.93820521052792,51.16433485
6.94302575865586,51.16817455
6.95829779199821,51.09294075
6.94257926610953,51.13010775
6.96999197688826,51.2505573
6.85968836350653,51.30009345
6.8176905,51.3328799
6.85247551929676,51.3002134
7.0116891,51.3503039
7.09299393159911,51.2862751
6.80882729003421,51.072616
6.5935641,51.0904685
6.67520815747608,51.24826485
6.67685057819533,51.304449
6.62779837679367,51.2795106
6.65922468940911,51.2136843
6.67159572250744,51.1915915
6.70131826886301,51.191389
6.4111677,51.3637523
6.2718329,51.3091533
6.4884405,51.3226757
6.3826005,51.2507606
6.3514562,51.2910089
6.3592081,51.2889109
6.3750181,51.2859409
6.7273369,51.5600174
6.5156163,51.491867
6.63448578412398,51.46197715
6.6410419251292,51.4454023
6.65458823919631,51.6596655
6.6114467032911,51.6555381
6.4534566,51.6434031
7.1587758,50.6804662
7.0990144,50.7283174
7.09460592643269,50.7169664680995
7.12853745707022,50.6822014
7.13192340559644,50.7126513
7.0892373,50.7454106
7.03195435395893,50.70769405
7.1107122,50.7042854
7.1033862,50.7005537
7.04226153449198,50.898464
6.98099265943257,50.9325433
6.92565742107664,50.9275116
7.00931018773429,50.94122875
6.92534612115976,50.9916327
6.97875275136805,50.9652739
7.05342792379311,50.9395039
6.96656092160293,50.9628043
7.05613239968937,50.96657035
6.95705889737217,50.9248388
7.0492494,50.8933168
7.05205043018166,50.9355732
6.9225166,50.9305554
6.90440194446973,50.9366714
6.96037698326023,50.98733835
6.96685869206603,50.9105366
6.89750621218602,50.9234619
6.91752477850436,50.9541498
6.96213497178055,50.9475427
6.9471043,50.9669681
6.9614053,50.9219839
6.9168277,50.9240258
7.03201986539346,51.0323417
7.00510449911953,51.06817385
6.0819447,50.7714029
6.06912871362521,50.76534
6.07674695424526,50.76764305
6.09537676636156,50.762603
6.04457271641676,50.7769086
6.26425646347213,50.81844525
6.30153189780322,50.60472025
6.2295346,50.7727632
6.14291527838274,50.8151704
6.49799834558905,50.8081874
6.48367856402568,50.8169633
6.48805306526433,50.76974235
6.46659900171709,50.8224091
6.36387675194627,50.92618775
6.26922688453691,50.977031
6.57684269582481,50.99796135
6.63776840922971,50.952468
6.90055384883167,50.82738015
6.8091411,50.8072923
6.8052929,50.9233569
6.86692547970122,50.8711734
6.8872826,50.8838385
6.98537649746578,50.8217732
6.7917599,50.6425281
6.6512631752104,50.5925382
6.6449733,50.6837556
6.3131428,51.0751273
5.9919845,50.9928558
6.12286765540779,50.9653139
6.0949778502284,51.064924
7.3787145,50.9861438
7.5679775,51.0138613
7.5497878443976,50.90747835
7.35074648262712,51.1985461
7.68597873128264,50.9884245
7.38547642196017,51.11306385
7.13739276517294,50.98979785
7.1751856,50.9599321
7.09884951052022,50.9782114
7.2217432,51.1346477
7.22254790175814,50.64484025
7.45161356964288,50.7678148
7.1812121,50.7753881
7.2066585,50.799105
7.21848555894253,50.78844605
7.159248,50.8173494
6.9071859,51.514846
6.91813474325444,51.53447475
7.08390105284166,51.5630498
7.08876264016393,51.50963915
7.0605877785142,51.57082005
7.10196352815302,51.4967408
7.0470349,51.5879966
7.56401430938433,51.87726125
7.62482912544023,51.97252545
7.7089762986915,52.013197
7.6343733,51.9091249
7.6299834,51.9588239
7.61429876896765,51.9324359
7.61735849007959,51.97823425
7.64929600960686,51.9609413
7.59595440313304,51.96077045
6.99319159110996,52.06878965
6.6269824,51.8554534
6.859968,51.8422467
7.03062422164513,52.2172475504689
7.02088886928312,52.2081007
6.43306756688847,51.8488373
6.9087075266359,51.9910718
7.1700403,51.9441642
7.28180518740986,51.82647375
7.4474958,51.769372
7.31978792109765,51.5674516
7.34509313072544,51.65181555
7.33834727702369,51.64298305
6.98739955650769,51.57490705
7.12729463202847,51.5918093
7.1240495262435,51.59247895
7.08437075303797,51.6522828
7.18271530672327,51.69120535
7.20730028024069,51.5675713
7.17606561264348,51.6199679
7.1918889,51.6066353
7.38738919575472,51.62077745
7.61067972463001,52.08809915
7.5843052,52.3020212
7.71387205625001,52.27835015
7.84337002224023,52.19873785
7.85515308828809,52.19490115
7.1887695530047,52.21170535
7.4246568,52.2772899
7.40119580545057,52.1264171
7.88478398192842,51.76732895
8.03879750744921,51.75269
7.79394113531874,51.76209125
7.8214167,51.8428747
7.7640555,51.9778603
8.00211828869003,51.96087455
8.52755574752716,52.01280775
8.522761612668,52.02268635
8.5215595,52.0230786
8.54310777957589,52.01475575
8.5284907,52.0067193
8.38505573893262,51.89744355
8.35170194542094,51.89463225
8.3815945,51.8831165
8.59450609906582,52.19809955
8.5651037,52.1398055
8.7008852,52.1264272
9.36538082803295,51.78503145
9.14077187864902,51.48745605
8.75240197740914,52.0862628622275
8.75034909138742,52.0973687
8.8910396,51.9461086
8.879868456613,51.9411846
9.04759603243149,52.1090688
8.9015081,52.0379436
8.8004363,52.2036831
8.78647758372916,52.2073572248515
8.7944596,52.1924794
8.7974241,52.1934095
8.79991082752968,52.2012353
8.60356759187564,52.29600705
8.91786334705603,52.29628495
8.88907744983845,52.2612135
8.8262101,51.7818446
8.7588218,51.7102562
8.74651598425309,51.72295125
8.76371021834826,51.7190387
8.7591599,51.7184446
7.2213858,51.4855095
7.2098464,51.4679825
7.15758501673637,51.42629785
7.229061,51.4934613
7.2293132,51.4902007
7.14320510245831,51.4825622
7.32722320648126,51.4639837
7.51014509865103,51.48071815
7.36770578356039,51.52421005
7.4569014,51.5079809
7.32868063879249,51.5017299
7.54736706518924,51.5029673
7.54806442635664,51.5067633
7.44183355703547,51.4785915
7.49894609694354,51.4853509
7.58296346785691,51.55436135
7.4573908,51.5107362
7.50513229297483,51.4850979
7.4660777,51.3540265
7.4121521,51.3478947
7.5148275,51.3149273
7.4721,51.395205
7.827715,51.6703317
7.84313005112741,51.6902647
7.86306626130706,51.685393
7.8417801,51.7084954
7.81829587620387,51.67911175
7.2288282,51.5338764
7.22647381510134,51.52871075
7.16313670458914,51.5355764
7.1590378,51.5374037
7.182092703375,51.5152136
7.33801618896187,51.3173386
7.192719,51.394145
7.3993967,51.411517
7.31282167264406,51.2938619806675
7.37464923688159,51.369344
7.34360045860294,51.4459513
7.3365924,51.4449958
7.96109325197084,51.4513973
8.5821148,51.3864036
8.84147287180053,51.45747435
8.85677774274789,51.4573936
8.8440701,51.4650438
8.4735955,51.3568724
8.3243853,51.1442407
7.95047847801428,51.34958345
7.97468395152641,51.38329845
8.53775385840244,51.1932897
7.76581885949715,51.39211275
7.7600521,51.344996
7.75741805168539,51.3899594
7.6933065,51.3711188
7.6914737,51.3794943
7.60291118643954,51.3646819
7.63735,51.2073491
7.66224442936959,51.2077232
7.65836759431377,51.2083726
7.8864972,51.2133812
7.76555504819572,51.2570132
7.89756167752809,51.1261671
7.84649971578175,51.02797635
8.4031694,51.0609491
8.40836062929397,51.0598361
8.01840003241874,50.85151035
8.02007738083255,50.88433135
8.02052337326565,50.9025222
8.02983947826863,50.87908485
8.50979236745135,51.6366551
8.33862894397582,51.6735896
8.34225387099249,51.68480425
8.23841905909466,51.6549495
8.0786488,51.5651643
8.11204613182192,51.5749411
8.3571491,51.4406793
8.35727577287066,51.4569234
7.90619480567642,51.5513043
7.44226168495947,51.59007315
7.5193567,51.6185191
7.57503672865714,51.44449125
7.56755566893782,51.44390565
7.56716044623071,51.4418567
7.67660077299413,51.5334346
7.6818405,51.5508787
7.6851426,51.5364042
