\relax 
\providecommand\hyper@newdestlabel[2]{}
\providecommand\HyperFirstAtBeginDocument{\AtBeginDocument}
\HyperFirstAtBeginDocument{\ifx\hyper@anchor\@undefined
\global\let\oldnewlabel\newlabel
\gdef\newlabel#1#2{\newlabelxx{#1}#2}
\gdef\newlabelxx#1#2#3#4#5#6{\oldnewlabel{#1}{{#2}{#3}}}
\AtEndDocument{\ifx\hyper@anchor\@undefined
\let\newlabel\oldnewlabel
\fi}
\fi}
\global\let\hyper@last\relax 
\gdef\HyperFirstAtBeginDocument#1{#1}
\providecommand\HyField@AuxAddToFields[1]{}
\providecommand\HyField@AuxAddToCoFields[2]{}
\citation{BS}
\citation{augurzky2014krankenhausplanung}
\citation{schmidt2014krankenhaus}
\citation{kretzler2020deutschland}
\citation{BS}
\citation{sundmacher2015hospitalisations}
\@writefile{toc}{\contentsline {section}{\numberline {1}Introduction}{2}{section.1}\protected@file@percent }
\citation{BS}
\@writefile{toc}{\contentsline {section}{\numberline {2}Background}{3}{section.2}\protected@file@percent }
\@writefile{toc}{\contentsline {section}{\numberline {3}Problem Formulation}{4}{section.3}\protected@file@percent }
\@writefile{toc}{\contentsline {section}{\numberline {4}Mathematical Model}{4}{section.4}\protected@file@percent }
\newlabel{sec:model}{{4}{4}{Mathematical Model}{section.4}{}}
\newlabel{def:problem}{{2}{6}{Constrained Facility Reduction Problem (\textsc {CFR})}{definition.2}{}}
\citation{weber1909standort}
\@writefile{toc}{\contentsline {subsection}{\numberline {4.1}Mathematical Background}{7}{subsection.4.1}\protected@file@percent }
\citation{karp1972reducibility}
\citation{ahmadi2017survey}
\citation{farahani2010multiple}
\citation{farahani2012covering}
\@writefile{toc}{\contentsline {section}{\numberline {5}Trees}{9}{section.5}\protected@file@percent }
\newlabel{lem:tree}{{1}{10}{}{lemma.1}{}}
\@writefile{lof}{\contentsline {figure}{\numberline {1}{\ignorespaces An example of an unweighed tree (i.e. $c(e)=1$ for all edges $e$) with locations $V=\{v_1,...,v_5\}$, facilities $F=\{f_1,...,f_5\}$ and $d=3$. For the location $v$ with highest depth $d(v)=3$ we obtain $F_d(v)=\{f_3,f_4,f_5\}$ with nearest common ancestor $z=v_2$ and the resulting nearest facilitiy $f^*=f_4$. Note that $f^*=f_3$ would have been an equally valid choice.\relax }}{11}{figure.caption.4}\protected@file@percent }
\providecommand*\caption@xref[2]{\@setref\relax\@undefined{#1}}
\newlabel{fig:tikz_tree}{{1}{11}{An example of an unweighed tree (i.e. $c(e)=1$ for all edges $e$) with locations $V=\{v_1,...,v_5\}$, facilities $F=\{f_1,...,f_5\}$ and $d=3$. For the location $v$ with highest depth $d(v)=3$ we obtain $F_d(v)=\{f_3,f_4,f_5\}$ with nearest common ancestor $z=v_2$ and the resulting nearest facilitiy $f^*=f_4$. Note that $f^*=f_3$ would have been an equally valid choice.\relax }{figure.caption.4}{}}
\newlabel{alg:tree}{{\caption@xref {alg:tree}{ on input line 81}}{12}{Trees}{figure.caption.4}{}}
\@writefile{loa}{\contentsline {algorithm}{\numberline {1}{\ignorespaces Location Elimination Algorithm for Trees\relax }}{12}{algorithm.1}\protected@file@percent }
\@writefile{toc}{\contentsline {section}{\numberline {6}Complexity}{14}{section.6}\protected@file@percent }
\newlabel{sec:complexity}{{6}{14}{Complexity}{section.6}{}}
\newlabel{lem:reduction}{{2}{14}{}{lemma.2}{}}
\citation{karp1972reducibility}
\@writefile{lof}{\contentsline {figure}{\numberline {2}{\ignorespaces A \textsc  {Set Cover} instance (left) and its corresponding \textsc  {CFR} instance (right)\relax }}{16}{figure.caption.5}\protected@file@percent }
\newlabel{fig:reduction}{{2}{16}{A \textsc {Set Cover} instance (left) and its corresponding \textsc {CFR} instance (right)\relax }{figure.caption.5}{}}
\newlabel{thm:complexity}{{2}{16}{}{theorem.2}{}}
\@writefile{toc}{\contentsline {section}{\numberline {7}Integer Program}{17}{section.7}\protected@file@percent }
\newlabel{sec:ip}{{7}{17}{Integer Program}{section.7}{}}
\newlabel{lem:monotonicmap}{{3}{18}{}{lemma.3}{}}
\newlabel{def:ip}{{5}{20}{IP Formulation of Constrained Facility Reduction}{definition.5}{}}
\@writefile{toc}{\contentsline {section}{\numberline {8}Instance Optimization}{20}{section.8}\protected@file@percent }
\newlabel{sec:instanceopt}{{8}{20}{Instance Optimization}{section.8}{}}
\@writefile{toc}{\contentsline {paragraph}{Dominating Facilities and Locations}{21}{section*.6}\protected@file@percent }
\@writefile{lof}{\contentsline {figure}{\numberline {3}{\ignorespaces Example instance with locations $V=\{v_1,...,v_6\}$, facilities $F=\{f_1,f_2\}$, $k=1$ and $\alpha =0$.  Here, the coverage classes are $V/_{\sim }=\{\{v_1,v_2\},\{v_3,v_4\},\{v_5,v_6\}\}$, and a possible set of representatives is $V_{\sim }=\{v_1,v_3,v_5\}$. A possible set of non-dominated locations is $\{v_1,v_5\}$.\relax }}{23}{figure.caption.8}\protected@file@percent }
\newlabel{fig:tikz_locations}{{3}{23}{Example instance with locations $V=\{v_1,...,v_6\}$, facilities $F=\{f_1,f_2\}$, $k=1$ and $\alpha =0$.\\ Here, the coverage classes are $V/_{\sim }=\{\{v_1,v_2\},\{v_3,v_4\},\{v_5,v_6\}\}$, and a possible set of representatives is $V_{\sim }=\{v_1,v_3,v_5\}$. A possible set of non-dominated locations is $\{v_1,v_5\}$.\relax }{figure.caption.8}{}}
\@writefile{toc}{\contentsline {section}{\numberline {9}Algorithms}{24}{section.9}\protected@file@percent }
\newlabel{sec:algorithms}{{9}{24}{Algorithms}{section.9}{}}
\citation{chvatal1979greedy}
\citation{dinur2014analytical}
\@writefile{toc}{\contentsline {subsection}{\numberline {9.1}Set Cover and R-CFR}{25}{subsection.9.1}\protected@file@percent }
\newlabel{alg:RCFR}{{\caption@xref {alg:RCFR}{ on input line 37}}{26}{Set Cover and R-CFR}{subsection.9.1}{}}
\@writefile{loa}{\contentsline {algorithm}{\numberline {2}{\ignorespaces Greedy Algorithm for R-CFR\relax }}{26}{algorithm.2}\protected@file@percent }
\newlabel{lem:approx}{{5}{26}{}{lemma.5}{}}
\@writefile{toc}{\contentsline {subsection}{\numberline {9.2}Margin of Error}{27}{subsection.9.2}\protected@file@percent }
\@writefile{toc}{\contentsline {paragraph}{Static Reduction.}{28}{section*.9}\protected@file@percent }
\@writefile{loa}{\contentsline {algorithm}{\numberline {3}{\ignorespaces Anchor Deletion\relax }}{29}{algorithm.3}\protected@file@percent }
\@writefile{loa}{\contentsline {algorithm}{\numberline {4}{\ignorespaces Area Sweep\relax }}{29}{algorithm.4}\protected@file@percent }
\@writefile{toc}{\contentsline {paragraph}{Greedy Selection}{30}{section*.10}\protected@file@percent }
\@writefile{toc}{\contentsline {subsection}{\numberline {9.3}Final Solution Heuristics}{30}{subsection.9.3}\protected@file@percent }
\@writefile{toc}{\contentsline {paragraph}{Essential Facilities.}{30}{section*.11}\protected@file@percent }
\@writefile{toc}{\contentsline {paragraph}{Multiple Levels.}{31}{section*.12}\protected@file@percent }
\@writefile{loa}{\contentsline {algorithm}{\numberline {5}{\ignorespaces Top-Down Covering\relax }}{34}{algorithm.5}\protected@file@percent }
\@writefile{loa}{\contentsline {algorithm}{\numberline {6}{\ignorespaces Bottom-Up Covering\relax }}{35}{algorithm.6}\protected@file@percent }
\@writefile{loa}{\contentsline {algorithm}{\numberline {7}{\ignorespaces Balanced Covering\relax }}{36}{algorithm.7}\protected@file@percent }
\@writefile{toc}{\contentsline {section}{\numberline {10}Evaluation}{36}{section.10}\protected@file@percent }
\@writefile{toc}{\contentsline {subsection}{\numberline {10.1}Instance Generation}{36}{subsection.10.1}\protected@file@percent }
\@writefile{toc}{\contentsline {paragraph}{Number of Levels - $k$.}{37}{section*.18}\protected@file@percent }
\@writefile{toc}{\contentsline {paragraph}{Level Restrictions - $(F_1,...,F_k)$.}{37}{section*.19}\protected@file@percent }
\@writefile{lot}{\contentsline {table}{\numberline {1}{\ignorespaces Parameters for instance generation. Yields a total of 40 unique instances.\relax }}{39}{table.caption.23}\protected@file@percent }
\newlabel{tab:instance_parameters}{{1}{39}{Parameters for instance generation. Yields a total of 40 unique instances.\relax }{table.caption.23}{}}
\@writefile{lot}{\contentsline {table}{\numberline {2}{\ignorespaces Classification of instances into instance types\relax }}{39}{table.caption.24}\protected@file@percent }
\newlabel{tab:types}{{2}{39}{Classification of instances into instance types\relax }{table.caption.24}{}}
\@writefile{toc}{\contentsline {subsection}{\numberline {10.2}Algorithms}{39}{subsection.10.2}\protected@file@percent }
\@writefile{toc}{\contentsline {subsection}{\numberline {10.3}Results}{40}{subsection.10.3}\protected@file@percent }
\@writefile{toc}{\contentsline {subsubsection}{\numberline {10.3.1}Static Reduction Heuristics}{40}{subsubsection.10.3.1}\protected@file@percent }
\@writefile{lof}{\contentsline {figure}{\numberline {4}{\ignorespaces Comparison of the effect of different static reduction heuristics on the computation time of the final solution heuristics (including essential facility calculation)\relax }}{42}{figure.caption.32}\protected@file@percent }
\newlabel{fig:static_reduction_final_time}{{4}{42}{Comparison of the effect of different static reduction heuristics on the computation time of the final solution heuristics (including essential facility calculation)\relax }{figure.caption.32}{}}
\@writefile{lof}{\contentsline {figure}{\numberline {5}{\ignorespaces Solution quality depending on the use of static reduction heuristics, measured using the gap in the first partial solution value, $\gap  (x_1)$.\relax }}{43}{figure.caption.34}\protected@file@percent }
\newlabel{fig:static_reduction_quality}{{5}{43}{Solution quality depending on the use of static reduction heuristics, measured using the gap in the first partial solution value, $\gap (x_1)$.\relax }{figure.caption.34}{}}
\@writefile{lof}{\contentsline {figure}{\numberline {6}{\ignorespaces Computation time of the static reduction heuristics.\relax }}{44}{figure.caption.36}\protected@file@percent }
\newlabel{fig:static_reduction_time}{{6}{44}{Computation time of the static reduction heuristics.\relax }{figure.caption.36}{}}
\@writefile{toc}{\contentsline {subsubsection}{\numberline {10.3.2}Instance Optimization}{44}{subsubsection.10.3.2}\protected@file@percent }
\@writefile{lof}{\contentsline {figure}{\numberline {7}{\ignorespaces Results of the computation of nondominated facilities\relax }}{45}{figure.caption.39}\protected@file@percent }
\newlabel{fig:instance_opt_facilities}{{7}{45}{Results of the computation of nondominated facilities\relax }{figure.caption.39}{}}
\@writefile{lof}{\contentsline {figure}{\numberline {8}{\ignorespaces Number of nondominated locations and coverage classes\relax }}{46}{figure.caption.41}\protected@file@percent }
\newlabel{fig:instance_opt_locations_quality}{{8}{46}{Number of nondominated locations and coverage classes\relax }{figure.caption.41}{}}
\@writefile{lof}{\contentsline {figure}{\numberline {9}{\ignorespaces Computation time for nondominated locations and coverage classes\relax }}{46}{figure.caption.43}\protected@file@percent }
\newlabel{fig:instance_opt_locations_time}{{9}{46}{Computation time for nondominated locations and coverage classes\relax }{figure.caption.43}{}}
\@writefile{toc}{\contentsline {subsubsection}{\numberline {10.3.3}Essential Facilities}{47}{subsubsection.10.3.3}\protected@file@percent }
\@writefile{lof}{\contentsline {figure}{\numberline {10}{\ignorespaces Results of the computation of essential facilities\relax }}{47}{figure.caption.45}\protected@file@percent }
\newlabel{fig:essential_facilities}{{10}{47}{Results of the computation of essential facilities\relax }{figure.caption.45}{}}
\@writefile{toc}{\contentsline {subsubsection}{\numberline {10.3.4}Solution Heuristics}{48}{subsubsection.10.3.4}\protected@file@percent }
\@writefile{lof}{\contentsline {figure}{\numberline {11}{\ignorespaces Solution quality of solution heuristics dependent on instance type. Only includes data from dynamic instances.\relax }}{49}{figure.caption.47}\protected@file@percent }
\newlabel{fig:solution_heuristics_quality}{{11}{49}{Solution quality of solution heuristics dependent on instance type. Only includes data from dynamic instances.\relax }{figure.caption.47}{}}
\@writefile{lof}{\contentsline {figure}{\numberline {12}{\ignorespaces Computation time of solution heuristics\relax }}{50}{figure.caption.50}\protected@file@percent }
\newlabel{fig:solution_heuristics_time}{{12}{50}{Computation time of solution heuristics\relax }{figure.caption.50}{}}
\@writefile{toc}{\contentsline {subsubsection}{\numberline {10.3.5}Conclusion and Example}{50}{subsubsection.10.3.5}\protected@file@percent }
\@writefile{lof}{\contentsline {figure}{\numberline {13}{\ignorespaces Nordrhein-Westfalen instance with $k=2, F_1\supsetneq F_2, \beta =1$ and $\alpha =0.05$, including the instance itself and a visualization of the population distribution.\relax }}{51}{figure.caption.52}\protected@file@percent }
\newlabel{fig:instance}{{13}{51}{Nordrhein-Westfalen instance with $k=2, F_1\supsetneq F_2, \beta =1$ and $\alpha =0.05$, including the instance itself and a visualization of the population distribution.\relax }{figure.caption.52}{}}
\@writefile{lof}{\contentsline {figure}{\numberline {14}{\ignorespaces The optimized instance after eliminating dominated facilities and applying the coverage reduction, and the final solution obtained using the top-down heuristic.\relax }}{52}{figure.caption.53}\protected@file@percent }
\newlabel{fig:dynamic_solve}{{14}{52}{The optimized instance after eliminating dominated facilities and applying the coverage reduction, and the final solution obtained using the top-down heuristic.\relax }{figure.caption.53}{}}
\@writefile{lof}{\contentsline {figure}{\numberline {15}{\ignorespaces The optimized instance after eliminating dominated facilities and dominated locations, and the final solution obtained using pre-calculation of essential facilities and the top-down heuristic.\relax }}{53}{figure.caption.54}\protected@file@percent }
\newlabel{fig:static_solve}{{15}{53}{The optimized instance after eliminating dominated facilities and dominated locations, and the final solution obtained using pre-calculation of essential facilities and the top-down heuristic.\relax }{figure.caption.54}{}}
\@writefile{toc}{\contentsline {section}{\numberline {11}Conclusion and Outlook}{54}{section.11}\protected@file@percent }
\citation{Zensus}
\@writefile{toc}{\contentsline {section}{\numberline {12}Appendix I: Instance Generation}{56}{section.12}\protected@file@percent }
\newlabel{cha:instance}{{12}{56}{Appendix I: Instance Generation}{section.12}{}}
\@writefile{toc}{\contentsline {subsection}{\numberline {12.1}Locations}{56}{subsection.12.1}\protected@file@percent }
\citation{Hospitals}
\@writefile{lof}{\contentsline {figure}{\numberline {16}{\ignorespaces comparison}}{58}{figure.caption.55}\protected@file@percent }
\newlabel{fig:locations}{{16}{58}{comparison}{figure.caption.55}{}}
\@writefile{toc}{\contentsline {subsection}{\numberline {12.2}Hospitals}{58}{subsection.12.2}\protected@file@percent }
\@writefile{toc}{\contentsline {subsection}{\numberline {12.3}Distances}{59}{subsection.12.3}\protected@file@percent }
\citation{*}
\bibstyle{abbrv}
\bibdata{references}
\bibcite{ahmadi2017survey}{1}
\bibcite{augurzky2014krankenhausplanung}{2}
\bibcite{busse2018planerischen}{3}
\bibcite{chvatal1979greedy}{4}
\@writefile{lof}{\contentsline {figure}{\numberline {17}{\ignorespaces comparison}}{60}{figure.caption.56}\protected@file@percent }
\newlabel{fig:hospitals}{{17}{60}{comparison}{figure.caption.56}{}}
\newlabel{cha:references}{{12.3}{60}{Distances}{subsection.12.3}{}}
\bibcite{dinur2014analytical}{5}
\bibcite{farahani2012covering}{6}
\bibcite{farahani2010multiple}{7}
\bibcite{DLM}{8}
\bibcite{karp1972reducibility}{9}
\bibcite{kretzler2020deutschland}{10}
\bibcite{BS}{11}
\bibcite{schmidt2014krankenhaus}{12}
\bibcite{Hospitals}{13}
\bibcite{Zensus}{14}
\bibcite{sundmacher2015hospitalisations}{15}
\bibcite{weber1909standort}{16}
\gdef \@abspage@last{63}
