PWD /home/svend/dev/facilityreduction/thesis
INPUT /usr/local/texlive/2022/texmf.cnf
INPUT /usr/local/texlive/2022/texmf-dist/web2c/texmf.cnf
INPUT /usr/local/texlive/2022/texmf-var/web2c/pdftex/pdflatex.fmt
INPUT /home/svend/dev/facilityreduction/thesis/main.tex
OUTPUT main.log
INPUT /usr/local/texlive/2022/texmf-dist/tex/latex/base/article.cls
INPUT /usr/local/texlive/2022/texmf-dist/tex/latex/base/article.cls
INPUT /usr/local/texlive/2022/texmf-dist/tex/latex/base/article.cls
INPUT /usr/local/texlive/2022/texmf-dist/tex/latex/base/article.cls
INPUT /usr/local/texlive/2022/texmf-dist/tex/latex/base/article.cls
INPUT /usr/local/texlive/2022/texmf-dist/tex/latex/base/article.cls
INPUT /usr/local/texlive/2022/texmf-dist/tex/latex/base/article.cls
INPUT /usr/local/texlive/2022/texmf-dist/tex/latex/base/article.cls
INPUT /usr/local/texlive/2022/texmf-dist/tex/latex/base/article.cls
INPUT /usr/local/texlive/2022/texmf-dist/tex/latex/base/article.cls
INPUT /usr/local/texlive/2022/texmf-dist/tex/latex/base/article.cls
INPUT /usr/local/texlive/2022/texmf-dist/tex/latex/base/size11.clo
INPUT /usr/local/texlive/2022/texmf-dist/tex/latex/base/size11.clo
INPUT /usr/local/texlive/2022/texmf-dist/tex/latex/base/size11.clo
INPUT /usr/local/texlive/2022/texmf-dist/tex/latex/base/size11.clo
INPUT /usr/local/texlive/2022/texmf-dist/fonts/map/fontname/texfonts.map
INPUT /usr/local/texlive/2022/texmf-dist/fonts/tfm/public/cm/cmr10.tfm
INPUT ./header.tex
INPUT ./header.tex
INPUT ./header.tex
INPUT header.tex
INPUT ./header.tex
INPUT ./header.tex
INPUT header.tex
INPUT /usr/local/texlive/2022/texmf-dist/tex/latex/geometry/geometry.sty
INPUT /usr/local/texlive/2022/texmf-dist/tex/latex/geometry/geometry.sty
INPUT /usr/local/texlive/2022/texmf-dist/tex/latex/geometry/geometry.sty
INPUT /usr/local/texlive/2022/texmf-dist/tex/latex/geometry/geometry.sty
INPUT /usr/local/texlive/2022/texmf-dist/tex/latex/geometry/geometry.sty
INPUT /usr/local/texlive/2022/texmf-dist/tex/latex/geometry/geometry.sty
INPUT /usr/local/texlive/2022/texmf-dist/tex/latex/geometry/geometry.sty
INPUT /usr/local/texlive/2022/texmf-dist/tex/latex/geometry/geometry.sty
INPUT /usr/local/texlive/2022/texmf-dist/tex/latex/geometry/geometry.sty
INPUT /usr/local/texlive/2022/texmf-dist/tex/latex/geometry/geometry.sty
INPUT /usr/local/texlive/2022/texmf-dist/tex/latex/geometry/geometry.sty
INPUT /usr/local/texlive/2022/texmf-dist/tex/latex/graphics/keyval.sty
INPUT /usr/local/texlive/2022/texmf-dist/tex/latex/graphics/keyval.sty
INPUT /usr/local/texlive/2022/texmf-dist/tex/latex/graphics/keyval.sty
INPUT /usr/local/texlive/2022/texmf-dist/tex/latex/graphics/keyval.sty
INPUT /usr/local/texlive/2022/texmf-dist/tex/latex/graphics/keyval.sty
INPUT /usr/local/texlive/2022/texmf-dist/tex/latex/graphics/keyval.sty
INPUT /usr/local/texlive/2022/texmf-dist/tex/latex/graphics/keyval.sty
INPUT /usr/local/texlive/2022/texmf-dist/tex/latex/graphics/keyval.sty
INPUT /usr/local/texlive/2022/texmf-dist/tex/latex/graphics/keyval.sty
INPUT /usr/local/texlive/2022/texmf-dist/tex/latex/graphics/keyval.sty
INPUT /usr/local/texlive/2022/texmf-dist/tex/latex/graphics/keyval.sty
INPUT /usr/local/texlive/2022/texmf-dist/tex/generic/iftex/ifvtex.sty
INPUT /usr/local/texlive/2022/texmf-dist/tex/generic/iftex/ifvtex.sty
INPUT /usr/local/texlive/2022/texmf-dist/tex/generic/iftex/ifvtex.sty
INPUT /usr/local/texlive/2022/texmf-dist/tex/generic/iftex/ifvtex.sty
INPUT /usr/local/texlive/2022/texmf-dist/tex/generic/iftex/ifvtex.sty
INPUT /usr/local/texlive/2022/texmf-dist/tex/generic/iftex/ifvtex.sty
INPUT /usr/local/texlive/2022/texmf-dist/tex/generic/iftex/ifvtex.sty
INPUT /usr/local/texlive/2022/texmf-dist/tex/generic/iftex/ifvtex.sty
INPUT /usr/local/texlive/2022/texmf-dist/tex/generic/iftex/ifvtex.sty
INPUT /usr/local/texlive/2022/texmf-dist/tex/generic/iftex/ifvtex.sty
INPUT /usr/local/texlive/2022/texmf-dist/tex/generic/iftex/ifvtex.sty
INPUT /usr/local/texlive/2022/texmf-dist/tex/generic/iftex/iftex.sty
INPUT /usr/local/texlive/2022/texmf-dist/tex/generic/iftex/iftex.sty
INPUT /usr/local/texlive/2022/texmf-dist/tex/generic/iftex/iftex.sty
INPUT /usr/local/texlive/2022/texmf-dist/tex/generic/iftex/iftex.sty
INPUT /usr/local/texlive/2022/texmf-dist/tex/generic/iftex/iftex.sty
INPUT /usr/local/texlive/2022/texmf-dist/tex/generic/iftex/iftex.sty
INPUT /usr/local/texlive/2022/texmf-dist/tex/generic/iftex/iftex.sty
INPUT /usr/local/texlive/2022/texmf-dist/tex/generic/iftex/iftex.sty
INPUT /usr/local/texlive/2022/texmf-dist/tex/generic/iftex/iftex.sty
INPUT /usr/local/texlive/2022/texmf-dist/tex/generic/iftex/iftex.sty
INPUT /usr/local/texlive/2022/texmf-dist/tex/generic/iftex/iftex.sty
INPUT /usr/local/texlive/2022/texmf-dist/tex/latex/graphics/graphicx.sty
INPUT /usr/local/texlive/2022/texmf-dist/tex/latex/graphics/graphicx.sty
INPUT /usr/local/texlive/2022/texmf-dist/tex/latex/graphics/graphicx.sty
INPUT /usr/local/texlive/2022/texmf-dist/tex/latex/graphics/graphicx.sty
INPUT /usr/local/texlive/2022/texmf-dist/tex/latex/graphics/graphicx.sty
INPUT /usr/local/texlive/2022/texmf-dist/tex/latex/graphics/graphicx.sty
INPUT /usr/local/texlive/2022/texmf-dist/tex/latex/graphics/graphicx.sty
INPUT /usr/local/texlive/2022/texmf-dist/tex/latex/graphics/graphicx.sty
INPUT /usr/local/texlive/2022/texmf-dist/tex/latex/graphics/graphicx.sty
INPUT /usr/local/texlive/2022/texmf-dist/tex/latex/graphics/graphicx.sty
INPUT /usr/local/texlive/2022/texmf-dist/tex/latex/graphics/graphicx.sty
INPUT /usr/local/texlive/2022/texmf-dist/tex/latex/graphics/keyval.sty
INPUT /usr/local/texlive/2022/texmf-dist/tex/latex/graphics/graphics.sty
INPUT /usr/local/texlive/2022/texmf-dist/tex/latex/graphics/graphics.sty
INPUT /usr/local/texlive/2022/texmf-dist/tex/latex/graphics/graphics.sty
INPUT /usr/local/texlive/2022/texmf-dist/tex/latex/graphics/graphics.sty
INPUT /usr/local/texlive/2022/texmf-dist/tex/latex/graphics/graphics.sty
INPUT /usr/local/texlive/2022/texmf-dist/tex/latex/graphics/graphics.sty
INPUT /usr/local/texlive/2022/texmf-dist/tex/latex/graphics/graphics.sty
INPUT /usr/local/texlive/2022/texmf-dist/tex/latex/graphics/graphics.sty
INPUT /usr/local/texlive/2022/texmf-dist/tex/latex/graphics/graphics.sty
INPUT /usr/local/texlive/2022/texmf-dist/tex/latex/graphics/graphics.sty
INPUT /usr/local/texlive/2022/texmf-dist/tex/latex/graphics/graphics.sty
INPUT /usr/local/texlive/2022/texmf-dist/tex/latex/graphics/trig.sty
INPUT /usr/local/texlive/2022/texmf-dist/tex/latex/graphics/trig.sty
INPUT /usr/local/texlive/2022/texmf-dist/tex/latex/graphics/trig.sty
INPUT /usr/local/texlive/2022/texmf-dist/tex/latex/graphics/trig.sty
INPUT /usr/local/texlive/2022/texmf-dist/tex/latex/graphics/trig.sty
INPUT /usr/local/texlive/2022/texmf-dist/tex/latex/graphics/trig.sty
INPUT /usr/local/texlive/2022/texmf-dist/tex/latex/graphics/trig.sty
INPUT /usr/local/texlive/2022/texmf-dist/tex/latex/graphics/trig.sty
INPUT /usr/local/texlive/2022/texmf-dist/tex/latex/graphics/trig.sty
INPUT /usr/local/texlive/2022/texmf-dist/tex/latex/graphics/trig.sty
INPUT /usr/local/texlive/2022/texmf-dist/tex/latex/graphics/trig.sty
INPUT /usr/local/texlive/2022/texmf-dist/tex/latex/graphics-cfg/graphics.cfg
INPUT /usr/local/texlive/2022/texmf-dist/tex/latex/graphics-cfg/graphics.cfg
INPUT /usr/local/texlive/2022/texmf-dist/tex/latex/graphics-cfg/graphics.cfg
INPUT /usr/local/texlive/2022/texmf-dist/tex/latex/graphics-cfg/graphics.cfg
INPUT /usr/local/texlive/2022/texmf-dist/tex/latex/graphics-def/pdftex.def
INPUT /usr/local/texlive/2022/texmf-dist/tex/latex/graphics-def/pdftex.def
INPUT /usr/local/texlive/2022/texmf-dist/tex/latex/graphics-def/pdftex.def
INPUT /usr/local/texlive/2022/texmf-dist/tex/latex/graphics-def/pdftex.def
INPUT /usr/local/texlive/2022/texmf-dist/tex/latex/base/inputenc.sty
INPUT /usr/local/texlive/2022/texmf-dist/tex/latex/base/inputenc.sty
INPUT /usr/local/texlive/2022/texmf-dist/tex/latex/base/inputenc.sty
INPUT /usr/local/texlive/2022/texmf-dist/tex/latex/base/inputenc.sty
INPUT /usr/local/texlive/2022/texmf-dist/tex/latex/base/inputenc.sty
INPUT /usr/local/texlive/2022/texmf-dist/tex/latex/base/inputenc.sty
INPUT /usr/local/texlive/2022/texmf-dist/tex/latex/base/inputenc.sty
INPUT /usr/local/texlive/2022/texmf-dist/tex/latex/base/inputenc.sty
INPUT /usr/local/texlive/2022/texmf-dist/tex/latex/base/inputenc.sty
INPUT /usr/local/texlive/2022/texmf-dist/tex/latex/base/inputenc.sty
INPUT /usr/local/texlive/2022/texmf-dist/tex/latex/base/inputenc.sty
INPUT /usr/local/texlive/2022/texmf-dist/tex/latex/mathtools/mathtools.sty
INPUT /usr/local/texlive/2022/texmf-dist/tex/latex/mathtools/mathtools.sty
INPUT /usr/local/texlive/2022/texmf-dist/tex/latex/mathtools/mathtools.sty
INPUT /usr/local/texlive/2022/texmf-dist/tex/latex/mathtools/mathtools.sty
INPUT /usr/local/texlive/2022/texmf-dist/tex/latex/mathtools/mathtools.sty
INPUT /usr/local/texlive/2022/texmf-dist/tex/latex/mathtools/mathtools.sty
INPUT /usr/local/texlive/2022/texmf-dist/tex/latex/mathtools/mathtools.sty
INPUT /usr/local/texlive/2022/texmf-dist/tex/latex/mathtools/mathtools.sty
INPUT /usr/local/texlive/2022/texmf-dist/tex/latex/mathtools/mathtools.sty
INPUT /usr/local/texlive/2022/texmf-dist/tex/latex/mathtools/mathtools.sty
INPUT /usr/local/texlive/2022/texmf-dist/tex/latex/mathtools/mathtools.sty
INPUT /usr/local/texlive/2022/texmf-dist/tex/latex/graphics/keyval.sty
INPUT /usr/local/texlive/2022/texmf-dist/tex/latex/tools/calc.sty
INPUT /usr/local/texlive/2022/texmf-dist/tex/latex/tools/calc.sty
INPUT /usr/local/texlive/2022/texmf-dist/tex/latex/tools/calc.sty
INPUT /usr/local/texlive/2022/texmf-dist/tex/latex/tools/calc.sty
INPUT /usr/local/texlive/2022/texmf-dist/tex/latex/tools/calc.sty
INPUT /usr/local/texlive/2022/texmf-dist/tex/latex/tools/calc.sty
INPUT /usr/local/texlive/2022/texmf-dist/tex/latex/tools/calc.sty
INPUT /usr/local/texlive/2022/texmf-dist/tex/latex/tools/calc.sty
INPUT /usr/local/texlive/2022/texmf-dist/tex/latex/tools/calc.sty
INPUT /usr/local/texlive/2022/texmf-dist/tex/latex/tools/calc.sty
INPUT /usr/local/texlive/2022/texmf-dist/tex/latex/tools/calc.sty
INPUT /usr/local/texlive/2022/texmf-dist/tex/latex/mathtools/mhsetup.sty
INPUT /usr/local/texlive/2022/texmf-dist/tex/latex/mathtools/mhsetup.sty
INPUT /usr/local/texlive/2022/texmf-dist/tex/latex/mathtools/mhsetup.sty
INPUT /usr/local/texlive/2022/texmf-dist/tex/latex/mathtools/mhsetup.sty
INPUT /usr/local/texlive/2022/texmf-dist/tex/latex/mathtools/mhsetup.sty
INPUT /usr/local/texlive/2022/texmf-dist/tex/latex/mathtools/mhsetup.sty
INPUT /usr/local/texlive/2022/texmf-dist/tex/latex/mathtools/mhsetup.sty
INPUT /usr/local/texlive/2022/texmf-dist/tex/latex/mathtools/mhsetup.sty
INPUT /usr/local/texlive/2022/texmf-dist/tex/latex/mathtools/mhsetup.sty
INPUT /usr/local/texlive/2022/texmf-dist/tex/latex/mathtools/mhsetup.sty
INPUT /usr/local/texlive/2022/texmf-dist/tex/latex/mathtools/mhsetup.sty
INPUT /usr/local/texlive/2022/texmf-dist/tex/latex/amsmath/amsmath.sty
INPUT /usr/local/texlive/2022/texmf-dist/tex/latex/amsmath/amsmath.sty
INPUT /usr/local/texlive/2022/texmf-dist/tex/latex/amsmath/amsmath.sty
INPUT /usr/local/texlive/2022/texmf-dist/tex/latex/amsmath/amsmath.sty
INPUT /usr/local/texlive/2022/texmf-dist/tex/latex/amsmath/amsmath.sty
INPUT /usr/local/texlive/2022/texmf-dist/tex/latex/amsmath/amsmath.sty
INPUT /usr/local/texlive/2022/texmf-dist/tex/latex/amsmath/amsmath.sty
INPUT /usr/local/texlive/2022/texmf-dist/tex/latex/amsmath/amsmath.sty
INPUT /usr/local/texlive/2022/texmf-dist/tex/latex/amsmath/amsmath.sty
INPUT /usr/local/texlive/2022/texmf-dist/tex/latex/amsmath/amsmath.sty
INPUT /usr/local/texlive/2022/texmf-dist/tex/latex/amsmath/amsmath.sty
INPUT /usr/local/texlive/2022/texmf-dist/tex/latex/amsmath/amsopn.sty
INPUT /usr/local/texlive/2022/texmf-dist/tex/latex/amsmath/amsopn.sty
INPUT /usr/local/texlive/2022/texmf-dist/tex/latex/amsmath/amstext.sty
INPUT /usr/local/texlive/2022/texmf-dist/tex/latex/amsmath/amstext.sty
INPUT /usr/local/texlive/2022/texmf-dist/tex/latex/amsmath/amstext.sty
INPUT /usr/local/texlive/2022/texmf-dist/tex/latex/amsmath/amstext.sty
INPUT /usr/local/texlive/2022/texmf-dist/tex/latex/amsmath/amstext.sty
INPUT /usr/local/texlive/2022/texmf-dist/tex/latex/amsmath/amstext.sty
INPUT /usr/local/texlive/2022/texmf-dist/tex/latex/amsmath/amstext.sty
INPUT /usr/local/texlive/2022/texmf-dist/tex/latex/amsmath/amstext.sty
INPUT /usr/local/texlive/2022/texmf-dist/tex/latex/amsmath/amstext.sty
INPUT /usr/local/texlive/2022/texmf-dist/tex/latex/amsmath/amstext.sty
INPUT /usr/local/texlive/2022/texmf-dist/tex/latex/amsmath/amstext.sty
INPUT /usr/local/texlive/2022/texmf-dist/tex/latex/amsmath/amsgen.sty
INPUT /usr/local/texlive/2022/texmf-dist/tex/latex/amsmath/amsgen.sty
INPUT /usr/local/texlive/2022/texmf-dist/tex/latex/amsmath/amsgen.sty
INPUT /usr/local/texlive/2022/texmf-dist/tex/latex/amsmath/amsgen.sty
INPUT /usr/local/texlive/2022/texmf-dist/tex/latex/amsmath/amsgen.sty
INPUT /usr/local/texlive/2022/texmf-dist/tex/latex/amsmath/amsgen.sty
INPUT /usr/local/texlive/2022/texmf-dist/tex/latex/amsmath/amsgen.sty
INPUT /usr/local/texlive/2022/texmf-dist/tex/latex/amsmath/amsgen.sty
INPUT /usr/local/texlive/2022/texmf-dist/tex/latex/amsmath/amsgen.sty
INPUT /usr/local/texlive/2022/texmf-dist/tex/latex/amsmath/amsgen.sty
INPUT /usr/local/texlive/2022/texmf-dist/tex/latex/amsmath/amsgen.sty
INPUT /usr/local/texlive/2022/texmf-dist/tex/latex/amsmath/amsbsy.sty
INPUT /usr/local/texlive/2022/texmf-dist/tex/latex/amsmath/amsbsy.sty
INPUT /usr/local/texlive/2022/texmf-dist/tex/latex/amsmath/amsbsy.sty
INPUT /usr/local/texlive/2022/texmf-dist/tex/latex/amsmath/amsbsy.sty
INPUT /usr/local/texlive/2022/texmf-dist/tex/latex/amsmath/amsbsy.sty
INPUT /usr/local/texlive/2022/texmf-dist/tex/latex/amsmath/amsbsy.sty
INPUT /usr/local/texlive/2022/texmf-dist/tex/latex/amsmath/amsbsy.sty
INPUT /usr/local/texlive/2022/texmf-dist/tex/latex/amsmath/amsbsy.sty
INPUT /usr/local/texlive/2022/texmf-dist/tex/latex/amsmath/amsbsy.sty
INPUT /usr/local/texlive/2022/texmf-dist/tex/latex/amsmath/amsbsy.sty
INPUT /usr/local/texlive/2022/texmf-dist/tex/latex/amsmath/amsbsy.sty
INPUT /usr/local/texlive/2022/texmf-dist/tex/latex/amsmath/amsgen.sty
INPUT /usr/local/texlive/2022/texmf-dist/tex/latex/amsmath/amsopn.sty
INPUT /usr/local/texlive/2022/texmf-dist/tex/latex/amsmath/amsopn.sty
INPUT /usr/local/texlive/2022/texmf-dist/tex/latex/amsmath/amsopn.sty
INPUT /usr/local/texlive/2022/texmf-dist/tex/latex/amsmath/amsopn.sty
INPUT /usr/local/texlive/2022/texmf-dist/tex/latex/amsmath/amsopn.sty
INPUT /usr/local/texlive/2022/texmf-dist/tex/latex/amsmath/amsopn.sty
INPUT /usr/local/texlive/2022/texmf-dist/tex/latex/amsmath/amsopn.sty
INPUT /usr/local/texlive/2022/texmf-dist/tex/latex/amsmath/amsopn.sty
INPUT /usr/local/texlive/2022/texmf-dist/tex/latex/amsmath/amsopn.sty
INPUT /usr/local/texlive/2022/texmf-dist/tex/latex/amsmath/amsopn.sty
INPUT /usr/local/texlive/2022/texmf-dist/tex/latex/amsmath/amsopn.sty
INPUT /usr/local/texlive/2022/texmf-dist/tex/latex/amsmath/amsgen.sty
INPUT /usr/local/texlive/2022/texmf-dist/tex/latex/xcolor/xcolor.sty
INPUT /usr/local/texlive/2022/texmf-dist/tex/latex/xcolor/xcolor.sty
INPUT /usr/local/texlive/2022/texmf-dist/tex/latex/xcolor/xcolor.sty
INPUT /usr/local/texlive/2022/texmf-dist/tex/latex/xcolor/xcolor.sty
INPUT /usr/local/texlive/2022/texmf-dist/tex/latex/xcolor/xcolor.sty
INPUT /usr/local/texlive/2022/texmf-dist/tex/latex/xcolor/xcolor.sty
INPUT /usr/local/texlive/2022/texmf-dist/tex/latex/xcolor/xcolor.sty
INPUT /usr/local/texlive/2022/texmf-dist/tex/latex/xcolor/xcolor.sty
INPUT /usr/local/texlive/2022/texmf-dist/tex/latex/xcolor/xcolor.sty
INPUT /usr/local/texlive/2022/texmf-dist/tex/latex/xcolor/xcolor.sty
INPUT /usr/local/texlive/2022/texmf-dist/tex/latex/xcolor/xcolor.sty
INPUT /usr/local/texlive/2022/texmf-dist/tex/latex/graphics-cfg/color.cfg
INPUT /usr/local/texlive/2022/texmf-dist/tex/latex/graphics-cfg/color.cfg
INPUT /usr/local/texlive/2022/texmf-dist/tex/latex/graphics-cfg/color.cfg
INPUT /usr/local/texlive/2022/texmf-dist/tex/latex/graphics-cfg/color.cfg
INPUT /usr/local/texlive/2022/texmf-dist/tex/latex/graphics/mathcolor.ltx
INPUT /usr/local/texlive/2022/texmf-dist/tex/latex/graphics/mathcolor.ltx
INPUT /usr/local/texlive/2022/texmf-dist/tex/latex/graphics/mathcolor.ltx
INPUT /usr/local/texlive/2022/texmf-dist/tex/latex/graphics/mathcolor.ltx
INPUT /usr/local/texlive/2022/texmf-dist/tex/latex/graphics/dvipsnam.def
INPUT /usr/local/texlive/2022/texmf-dist/tex/latex/graphics/dvipsnam.def
INPUT /usr/local/texlive/2022/texmf-dist/tex/latex/graphics/dvipsnam.def
INPUT /usr/local/texlive/2022/texmf-dist/tex/latex/graphics/dvipsnam.def
INPUT /usr/local/texlive/2022/texmf-dist/tex/latex/pgf/frontendlayer/tikz.sty
INPUT /usr/local/texlive/2022/texmf-dist/tex/latex/pgf/frontendlayer/tikz.sty
INPUT /usr/local/texlive/2022/texmf-dist/tex/latex/pgf/frontendlayer/tikz.sty
INPUT /usr/local/texlive/2022/texmf-dist/tex/latex/pgf/frontendlayer/tikz.sty
INPUT /usr/local/texlive/2022/texmf-dist/tex/latex/pgf/frontendlayer/tikz.sty
INPUT /usr/local/texlive/2022/texmf-dist/tex/latex/pgf/frontendlayer/tikz.sty
INPUT /usr/local/texlive/2022/texmf-dist/tex/latex/pgf/frontendlayer/tikz.sty
INPUT /usr/local/texlive/2022/texmf-dist/tex/latex/pgf/frontendlayer/tikz.sty
INPUT /usr/local/texlive/2022/texmf-dist/tex/latex/pgf/frontendlayer/tikz.sty
INPUT /usr/local/texlive/2022/texmf-dist/tex/latex/pgf/frontendlayer/tikz.sty
INPUT /usr/local/texlive/2022/texmf-dist/tex/latex/pgf/frontendlayer/tikz.sty
INPUT /usr/local/texlive/2022/texmf-dist/tex/latex/pgf/basiclayer/pgf.sty
INPUT /usr/local/texlive/2022/texmf-dist/tex/latex/pgf/basiclayer/pgf.sty
INPUT /usr/local/texlive/2022/texmf-dist/tex/latex/pgf/basiclayer/pgf.sty
INPUT /usr/local/texlive/2022/texmf-dist/tex/latex/pgf/basiclayer/pgf.sty
INPUT /usr/local/texlive/2022/texmf-dist/tex/latex/pgf/basiclayer/pgf.sty
INPUT /usr/local/texlive/2022/texmf-dist/tex/latex/pgf/basiclayer/pgf.sty
INPUT /usr/local/texlive/2022/texmf-dist/tex/latex/pgf/basiclayer/pgf.sty
INPUT /usr/local/texlive/2022/texmf-dist/tex/latex/pgf/basiclayer/pgf.sty
INPUT /usr/local/texlive/2022/texmf-dist/tex/latex/pgf/basiclayer/pgf.sty
INPUT /usr/local/texlive/2022/texmf-dist/tex/latex/pgf/basiclayer/pgf.sty
INPUT /usr/local/texlive/2022/texmf-dist/tex/latex/pgf/basiclayer/pgf.sty
INPUT /usr/local/texlive/2022/texmf-dist/tex/latex/pgf/utilities/pgfrcs.sty
INPUT /usr/local/texlive/2022/texmf-dist/tex/latex/pgf/utilities/pgfrcs.sty
INPUT /usr/local/texlive/2022/texmf-dist/tex/latex/pgf/utilities/pgfrcs.sty
INPUT /usr/local/texlive/2022/texmf-dist/tex/latex/pgf/utilities/pgfrcs.sty
INPUT /usr/local/texlive/2022/texmf-dist/tex/latex/pgf/utilities/pgfrcs.sty
INPUT /usr/local/texlive/2022/texmf-dist/tex/latex/pgf/utilities/pgfrcs.sty
INPUT /usr/local/texlive/2022/texmf-dist/tex/latex/pgf/utilities/pgfrcs.sty
INPUT /usr/local/texlive/2022/texmf-dist/tex/latex/pgf/utilities/pgfrcs.sty
INPUT /usr/local/texlive/2022/texmf-dist/tex/latex/pgf/utilities/pgfrcs.sty
INPUT /usr/local/texlive/2022/texmf-dist/tex/latex/pgf/utilities/pgfrcs.sty
INPUT /usr/local/texlive/2022/texmf-dist/tex/latex/pgf/utilities/pgfrcs.sty
INPUT /usr/local/texlive/2022/texmf-dist/tex/generic/pgf/utilities/pgfutil-common.tex
INPUT /usr/local/texlive/2022/texmf-dist/tex/generic/pgf/utilities/pgfutil-common-lists.tex
INPUT /usr/local/texlive/2022/texmf-dist/tex/generic/pgf/utilities/pgfutil-latex.def
INPUT /usr/local/texlive/2022/texmf-dist/tex/generic/pgf/utilities/pgfrcs.code.tex
INPUT /usr/local/texlive/2022/texmf-dist/tex/generic/pgf/utilities/pgfrcs.code.tex
INPUT /usr/local/texlive/2022/texmf-dist/tex/generic/pgf/utilities/pgfrcs.code.tex
INPUT /usr/local/texlive/2022/texmf-dist/tex/generic/pgf/utilities/pgfrcs.code.tex
INPUT /usr/local/texlive/2022/texmf-dist/tex/generic/pgf/pgf.revision.tex
INPUT /usr/local/texlive/2022/texmf-dist/tex/generic/pgf/pgf.revision.tex
INPUT /usr/local/texlive/2022/texmf-dist/tex/latex/pgf/basiclayer/pgfcore.sty
INPUT /usr/local/texlive/2022/texmf-dist/tex/latex/pgf/basiclayer/pgfcore.sty
INPUT /usr/local/texlive/2022/texmf-dist/tex/latex/pgf/basiclayer/pgfcore.sty
INPUT /usr/local/texlive/2022/texmf-dist/tex/latex/pgf/basiclayer/pgfcore.sty
INPUT /usr/local/texlive/2022/texmf-dist/tex/latex/pgf/basiclayer/pgfcore.sty
INPUT /usr/local/texlive/2022/texmf-dist/tex/latex/pgf/basiclayer/pgfcore.sty
INPUT /usr/local/texlive/2022/texmf-dist/tex/latex/pgf/basiclayer/pgfcore.sty
INPUT /usr/local/texlive/2022/texmf-dist/tex/latex/pgf/basiclayer/pgfcore.sty
INPUT /usr/local/texlive/2022/texmf-dist/tex/latex/pgf/basiclayer/pgfcore.sty
INPUT /usr/local/texlive/2022/texmf-dist/tex/latex/pgf/basiclayer/pgfcore.sty
INPUT /usr/local/texlive/2022/texmf-dist/tex/latex/pgf/basiclayer/pgfcore.sty
INPUT /usr/local/texlive/2022/texmf-dist/tex/latex/graphics/graphicx.sty
INPUT /usr/local/texlive/2022/texmf-dist/tex/latex/pgf/systemlayer/pgfsys.sty
INPUT /usr/local/texlive/2022/texmf-dist/tex/latex/pgf/systemlayer/pgfsys.sty
INPUT /usr/local/texlive/2022/texmf-dist/tex/latex/pgf/systemlayer/pgfsys.sty
INPUT /usr/local/texlive/2022/texmf-dist/tex/latex/pgf/systemlayer/pgfsys.sty
INPUT /usr/local/texlive/2022/texmf-dist/tex/latex/pgf/systemlayer/pgfsys.sty
INPUT /usr/local/texlive/2022/texmf-dist/tex/latex/pgf/systemlayer/pgfsys.sty
INPUT /usr/local/texlive/2022/texmf-dist/tex/latex/pgf/systemlayer/pgfsys.sty
INPUT /usr/local/texlive/2022/texmf-dist/tex/latex/pgf/systemlayer/pgfsys.sty
INPUT /usr/local/texlive/2022/texmf-dist/tex/latex/pgf/systemlayer/pgfsys.sty
INPUT /usr/local/texlive/2022/texmf-dist/tex/latex/pgf/systemlayer/pgfsys.sty
INPUT /usr/local/texlive/2022/texmf-dist/tex/latex/pgf/systemlayer/pgfsys.sty
INPUT /usr/local/texlive/2022/texmf-dist/tex/latex/pgf/utilities/pgfrcs.sty
INPUT /usr/local/texlive/2022/texmf-dist/tex/generic/pgf/systemlayer/pgfsys.code.tex
INPUT /usr/local/texlive/2022/texmf-dist/tex/generic/pgf/systemlayer/pgfsys.code.tex
INPUT /usr/local/texlive/2022/texmf-dist/tex/generic/pgf/systemlayer/pgfsys.code.tex
INPUT /usr/local/texlive/2022/texmf-dist/tex/generic/pgf/systemlayer/pgfsys.code.tex
INPUT /usr/local/texlive/2022/texmf-dist/tex/generic/pgf/utilities/pgfkeys.code.tex
INPUT /usr/local/texlive/2022/texmf-dist/tex/generic/pgf/utilities/pgfkeysfiltered.code.tex
INPUT /usr/local/texlive/2022/texmf-dist/tex/generic/pgf/systemlayer/pgf.cfg
INPUT /usr/local/texlive/2022/texmf-dist/tex/generic/pgf/systemlayer/pgfsys-pdftex.def
INPUT /usr/local/texlive/2022/texmf-dist/tex/generic/pgf/systemlayer/pgfsys-pdftex.def
INPUT /usr/local/texlive/2022/texmf-dist/tex/generic/pgf/systemlayer/pgfsys-common-pdf.def
INPUT /usr/local/texlive/2022/texmf-dist/tex/generic/pgf/systemlayer/pgfsyssoftpath.code.tex
INPUT /usr/local/texlive/2022/texmf-dist/tex/generic/pgf/systemlayer/pgfsyssoftpath.code.tex
INPUT /usr/local/texlive/2022/texmf-dist/tex/generic/pgf/systemlayer/pgfsyssoftpath.code.tex
INPUT /usr/local/texlive/2022/texmf-dist/tex/generic/pgf/systemlayer/pgfsyssoftpath.code.tex
INPUT /usr/local/texlive/2022/texmf-dist/tex/generic/pgf/systemlayer/pgfsysprotocol.code.tex
INPUT /usr/local/texlive/2022/texmf-dist/tex/generic/pgf/systemlayer/pgfsysprotocol.code.tex
INPUT /usr/local/texlive/2022/texmf-dist/tex/generic/pgf/systemlayer/pgfsysprotocol.code.tex
INPUT /usr/local/texlive/2022/texmf-dist/tex/generic/pgf/systemlayer/pgfsysprotocol.code.tex
INPUT /usr/local/texlive/2022/texmf-dist/tex/latex/graphics/keyval.sty
INPUT /usr/local/texlive/2022/texmf-dist/tex/latex/xcolor/xcolor.sty
INPUT /usr/local/texlive/2022/texmf-dist/tex/generic/pgf/basiclayer/pgfcore.code.tex
INPUT /usr/local/texlive/2022/texmf-dist/tex/generic/pgf/basiclayer/pgfcore.code.tex
INPUT /usr/local/texlive/2022/texmf-dist/tex/generic/pgf/basiclayer/pgfcore.code.tex
INPUT /usr/local/texlive/2022/texmf-dist/tex/generic/pgf/basiclayer/pgfcore.code.tex
INPUT /usr/local/texlive/2022/texmf-dist/tex/generic/pgf/math/pgfmath.code.tex
INPUT /usr/local/texlive/2022/texmf-dist/tex/generic/pgf/math/pgfmathcalc.code.tex
INPUT /usr/local/texlive/2022/texmf-dist/tex/generic/pgf/math/pgfmathutil.code.tex
INPUT /usr/local/texlive/2022/texmf-dist/tex/generic/pgf/math/pgfmathparser.code.tex
INPUT /usr/local/texlive/2022/texmf-dist/tex/generic/pgf/math/pgfmathfunctions.code.tex
INPUT /usr/local/texlive/2022/texmf-dist/tex/generic/pgf/math/pgfmathfunctions.basic.code.tex
INPUT /usr/local/texlive/2022/texmf-dist/tex/generic/pgf/math/pgfmathfunctions.trigonometric.code.tex
INPUT /usr/local/texlive/2022/texmf-dist/tex/generic/pgf/math/pgfmathfunctions.random.code.tex
INPUT /usr/local/texlive/2022/texmf-dist/tex/generic/pgf/math/pgfmathfunctions.comparison.code.tex
INPUT /usr/local/texlive/2022/texmf-dist/tex/generic/pgf/math/pgfmathfunctions.base.code.tex
INPUT /usr/local/texlive/2022/texmf-dist/tex/generic/pgf/math/pgfmathfunctions.round.code.tex
INPUT /usr/local/texlive/2022/texmf-dist/tex/generic/pgf/math/pgfmathfunctions.misc.code.tex
INPUT /usr/local/texlive/2022/texmf-dist/tex/generic/pgf/math/pgfmathfunctions.integerarithmetics.code.tex
INPUT /usr/local/texlive/2022/texmf-dist/tex/generic/pgf/math/pgfmathfloat.code.tex
INPUT /usr/local/texlive/2022/texmf-dist/tex/generic/pgf/math/pgfint.code.tex
INPUT /usr/local/texlive/2022/texmf-dist/tex/generic/pgf/basiclayer/pgfcorepoints.code.tex
INPUT /usr/local/texlive/2022/texmf-dist/tex/generic/pgf/basiclayer/pgfcorepathconstruct.code.tex
INPUT /usr/local/texlive/2022/texmf-dist/tex/generic/pgf/basiclayer/pgfcorepathusage.code.tex
INPUT /usr/local/texlive/2022/texmf-dist/tex/generic/pgf/basiclayer/pgfcorescopes.code.tex
INPUT /usr/local/texlive/2022/texmf-dist/tex/generic/pgf/basiclayer/pgfcoregraphicstate.code.tex
INPUT /usr/local/texlive/2022/texmf-dist/tex/generic/pgf/basiclayer/pgfcoretransformations.code.tex
INPUT /usr/local/texlive/2022/texmf-dist/tex/generic/pgf/basiclayer/pgfcorequick.code.tex
INPUT /usr/local/texlive/2022/texmf-dist/tex/generic/pgf/basiclayer/pgfcoreobjects.code.tex
INPUT /usr/local/texlive/2022/texmf-dist/tex/generic/pgf/basiclayer/pgfcorepathprocessing.code.tex
INPUT /usr/local/texlive/2022/texmf-dist/tex/generic/pgf/basiclayer/pgfcorearrows.code.tex
INPUT /usr/local/texlive/2022/texmf-dist/tex/generic/pgf/basiclayer/pgfcoreshade.code.tex
INPUT /usr/local/texlive/2022/texmf-dist/tex/generic/pgf/basiclayer/pgfcoreimage.code.tex
INPUT /usr/local/texlive/2022/texmf-dist/tex/generic/pgf/basiclayer/pgfcoreexternal.code.tex
INPUT /usr/local/texlive/2022/texmf-dist/tex/generic/pgf/basiclayer/pgfcorelayers.code.tex
INPUT /usr/local/texlive/2022/texmf-dist/tex/generic/pgf/basiclayer/pgfcoretransparency.code.tex
INPUT /usr/local/texlive/2022/texmf-dist/tex/generic/pgf/basiclayer/pgfcorepatterns.code.tex
INPUT /usr/local/texlive/2022/texmf-dist/tex/generic/pgf/basiclayer/pgfcorerdf.code.tex
INPUT /usr/local/texlive/2022/texmf-dist/tex/generic/pgf/modules/pgfmoduleshapes.code.tex
INPUT /usr/local/texlive/2022/texmf-dist/tex/generic/pgf/modules/pgfmoduleplot.code.tex
INPUT /usr/local/texlive/2022/texmf-dist/tex/latex/pgf/compatibility/pgfcomp-version-0-65.sty
INPUT /usr/local/texlive/2022/texmf-dist/tex/latex/pgf/compatibility/pgfcomp-version-0-65.sty
INPUT /usr/local/texlive/2022/texmf-dist/tex/latex/pgf/compatibility/pgfcomp-version-0-65.sty
INPUT /usr/local/texlive/2022/texmf-dist/tex/latex/pgf/compatibility/pgfcomp-version-0-65.sty
INPUT /usr/local/texlive/2022/texmf-dist/tex/latex/pgf/compatibility/pgfcomp-version-0-65.sty
INPUT /usr/local/texlive/2022/texmf-dist/tex/latex/pgf/compatibility/pgfcomp-version-0-65.sty
INPUT /usr/local/texlive/2022/texmf-dist/tex/latex/pgf/compatibility/pgfcomp-version-0-65.sty
INPUT /usr/local/texlive/2022/texmf-dist/tex/latex/pgf/compatibility/pgfcomp-version-0-65.sty
INPUT /usr/local/texlive/2022/texmf-dist/tex/latex/pgf/compatibility/pgfcomp-version-0-65.sty
INPUT /usr/local/texlive/2022/texmf-dist/tex/latex/pgf/compatibility/pgfcomp-version-0-65.sty
INPUT /usr/local/texlive/2022/texmf-dist/tex/latex/pgf/compatibility/pgfcomp-version-0-65.sty
INPUT /usr/local/texlive/2022/texmf-dist/tex/latex/pgf/utilities/pgfrcs.sty
INPUT /usr/local/texlive/2022/texmf-dist/tex/latex/pgf/compatibility/pgfcomp-version-1-18.sty
INPUT /usr/local/texlive/2022/texmf-dist/tex/latex/pgf/compatibility/pgfcomp-version-1-18.sty
INPUT /usr/local/texlive/2022/texmf-dist/tex/latex/pgf/compatibility/pgfcomp-version-1-18.sty
INPUT /usr/local/texlive/2022/texmf-dist/tex/latex/pgf/compatibility/pgfcomp-version-1-18.sty
INPUT /usr/local/texlive/2022/texmf-dist/tex/latex/pgf/compatibility/pgfcomp-version-1-18.sty
INPUT /usr/local/texlive/2022/texmf-dist/tex/latex/pgf/compatibility/pgfcomp-version-1-18.sty
INPUT /usr/local/texlive/2022/texmf-dist/tex/latex/pgf/compatibility/pgfcomp-version-1-18.sty
INPUT /usr/local/texlive/2022/texmf-dist/tex/latex/pgf/compatibility/pgfcomp-version-1-18.sty
INPUT /usr/local/texlive/2022/texmf-dist/tex/latex/pgf/compatibility/pgfcomp-version-1-18.sty
INPUT /usr/local/texlive/2022/texmf-dist/tex/latex/pgf/compatibility/pgfcomp-version-1-18.sty
INPUT /usr/local/texlive/2022/texmf-dist/tex/latex/pgf/compatibility/pgfcomp-version-1-18.sty
INPUT /usr/local/texlive/2022/texmf-dist/tex/latex/pgf/utilities/pgfrcs.sty
INPUT /usr/local/texlive/2022/texmf-dist/tex/latex/pgf/utilities/pgffor.sty
INPUT /usr/local/texlive/2022/texmf-dist/tex/latex/pgf/utilities/pgffor.sty
INPUT /usr/local/texlive/2022/texmf-dist/tex/latex/pgf/utilities/pgffor.sty
INPUT /usr/local/texlive/2022/texmf-dist/tex/latex/pgf/utilities/pgffor.sty
INPUT /usr/local/texlive/2022/texmf-dist/tex/latex/pgf/utilities/pgffor.sty
INPUT /usr/local/texlive/2022/texmf-dist/tex/latex/pgf/utilities/pgffor.sty
INPUT /usr/local/texlive/2022/texmf-dist/tex/latex/pgf/utilities/pgffor.sty
INPUT /usr/local/texlive/2022/texmf-dist/tex/latex/pgf/utilities/pgffor.sty
INPUT /usr/local/texlive/2022/texmf-dist/tex/latex/pgf/utilities/pgffor.sty
INPUT /usr/local/texlive/2022/texmf-dist/tex/latex/pgf/utilities/pgffor.sty
INPUT /usr/local/texlive/2022/texmf-dist/tex/latex/pgf/utilities/pgffor.sty
INPUT /usr/local/texlive/2022/texmf-dist/tex/latex/pgf/utilities/pgfrcs.sty
INPUT /usr/local/texlive/2022/texmf-dist/tex/latex/pgf/utilities/pgfkeys.sty
INPUT /usr/local/texlive/2022/texmf-dist/tex/latex/pgf/utilities/pgfkeys.sty
INPUT /usr/local/texlive/2022/texmf-dist/tex/latex/pgf/utilities/pgfkeys.sty
INPUT /usr/local/texlive/2022/texmf-dist/tex/latex/pgf/utilities/pgfkeys.sty
INPUT /usr/local/texlive/2022/texmf-dist/tex/latex/pgf/utilities/pgfkeys.sty
INPUT /usr/local/texlive/2022/texmf-dist/tex/latex/pgf/utilities/pgfkeys.sty
INPUT /usr/local/texlive/2022/texmf-dist/tex/latex/pgf/utilities/pgfkeys.sty
INPUT /usr/local/texlive/2022/texmf-dist/tex/latex/pgf/utilities/pgfkeys.sty
INPUT /usr/local/texlive/2022/texmf-dist/tex/latex/pgf/utilities/pgfkeys.sty
INPUT /usr/local/texlive/2022/texmf-dist/tex/latex/pgf/utilities/pgfkeys.sty
INPUT /usr/local/texlive/2022/texmf-dist/tex/latex/pgf/utilities/pgfkeys.sty
INPUT /usr/local/texlive/2022/texmf-dist/tex/generic/pgf/utilities/pgfkeys.code.tex
INPUT /usr/local/texlive/2022/texmf-dist/tex/generic/pgf/utilities/pgfkeys.code.tex
INPUT /usr/local/texlive/2022/texmf-dist/tex/generic/pgf/utilities/pgfkeys.code.tex
INPUT /usr/local/texlive/2022/texmf-dist/tex/generic/pgf/utilities/pgfkeys.code.tex
INPUT /usr/local/texlive/2022/texmf-dist/tex/latex/pgf/math/pgfmath.sty
INPUT /usr/local/texlive/2022/texmf-dist/tex/latex/pgf/math/pgfmath.sty
INPUT /usr/local/texlive/2022/texmf-dist/tex/latex/pgf/math/pgfmath.sty
INPUT /usr/local/texlive/2022/texmf-dist/tex/latex/pgf/math/pgfmath.sty
INPUT /usr/local/texlive/2022/texmf-dist/tex/latex/pgf/math/pgfmath.sty
INPUT /usr/local/texlive/2022/texmf-dist/tex/latex/pgf/math/pgfmath.sty
INPUT /usr/local/texlive/2022/texmf-dist/tex/latex/pgf/math/pgfmath.sty
INPUT /usr/local/texlive/2022/texmf-dist/tex/latex/pgf/math/pgfmath.sty
INPUT /usr/local/texlive/2022/texmf-dist/tex/latex/pgf/math/pgfmath.sty
INPUT /usr/local/texlive/2022/texmf-dist/tex/latex/pgf/math/pgfmath.sty
INPUT /usr/local/texlive/2022/texmf-dist/tex/latex/pgf/math/pgfmath.sty
INPUT /usr/local/texlive/2022/texmf-dist/tex/latex/pgf/utilities/pgfrcs.sty
INPUT /usr/local/texlive/2022/texmf-dist/tex/latex/pgf/utilities/pgfkeys.sty
INPUT /usr/local/texlive/2022/texmf-dist/tex/generic/pgf/math/pgfmath.code.tex
INPUT /usr/local/texlive/2022/texmf-dist/tex/generic/pgf/math/pgfmath.code.tex
INPUT /usr/local/texlive/2022/texmf-dist/tex/generic/pgf/math/pgfmath.code.tex
INPUT /usr/local/texlive/2022/texmf-dist/tex/generic/pgf/math/pgfmath.code.tex
INPUT /usr/local/texlive/2022/texmf-dist/tex/generic/pgf/utilities/pgffor.code.tex
INPUT /usr/local/texlive/2022/texmf-dist/tex/generic/pgf/utilities/pgffor.code.tex
INPUT /usr/local/texlive/2022/texmf-dist/tex/generic/pgf/utilities/pgffor.code.tex
INPUT /usr/local/texlive/2022/texmf-dist/tex/generic/pgf/utilities/pgffor.code.tex
INPUT /usr/local/texlive/2022/texmf-dist/tex/generic/pgf/math/pgfmath.code.tex
INPUT /usr/local/texlive/2022/texmf-dist/tex/generic/pgf/frontendlayer/tikz/tikz.code.tex
INPUT /usr/local/texlive/2022/texmf-dist/tex/generic/pgf/frontendlayer/tikz/tikz.code.tex
INPUT /usr/local/texlive/2022/texmf-dist/tex/generic/pgf/frontendlayer/tikz/tikz.code.tex
INPUT /usr/local/texlive/2022/texmf-dist/tex/generic/pgf/frontendlayer/tikz/tikz.code.tex
INPUT /usr/local/texlive/2022/texmf-dist/tex/generic/pgf/libraries/pgflibraryplothandlers.code.tex
INPUT /usr/local/texlive/2022/texmf-dist/tex/generic/pgf/libraries/pgflibraryplothandlers.code.tex
INPUT /usr/local/texlive/2022/texmf-dist/tex/generic/pgf/modules/pgfmodulematrix.code.tex
INPUT /usr/local/texlive/2022/texmf-dist/tex/generic/pgf/frontendlayer/tikz/libraries/tikzlibrarytopaths.code.tex
INPUT /usr/local/texlive/2022/texmf-dist/tex/generic/pgf/frontendlayer/tikz/libraries/tikzlibrarytopaths.code.tex
INPUT /usr/local/texlive/2022/texmf-dist/tex/latex/tikz-qtree/tikz-qtree.sty
INPUT /usr/local/texlive/2022/texmf-dist/tex/latex/tikz-qtree/tikz-qtree.sty
INPUT /usr/local/texlive/2022/texmf-dist/tex/latex/tikz-qtree/tikz-qtree.sty
INPUT /usr/local/texlive/2022/texmf-dist/tex/latex/tikz-qtree/tikz-qtree.sty
INPUT /usr/local/texlive/2022/texmf-dist/tex/latex/tikz-qtree/tikz-qtree.sty
INPUT /usr/local/texlive/2022/texmf-dist/tex/latex/tikz-qtree/tikz-qtree.sty
INPUT /usr/local/texlive/2022/texmf-dist/tex/latex/tikz-qtree/tikz-qtree.sty
INPUT /usr/local/texlive/2022/texmf-dist/tex/latex/tikz-qtree/tikz-qtree.sty
INPUT /usr/local/texlive/2022/texmf-dist/tex/latex/tikz-qtree/tikz-qtree.sty
INPUT /usr/local/texlive/2022/texmf-dist/tex/latex/tikz-qtree/tikz-qtree.sty
INPUT /usr/local/texlive/2022/texmf-dist/tex/latex/tikz-qtree/tikz-qtree.sty
INPUT /usr/local/texlive/2022/texmf-dist/tex/latex/pgf/frontendlayer/tikz.sty
INPUT /usr/local/texlive/2022/texmf-dist/tex/latex/tikz-qtree/pgftree.sty
INPUT /usr/local/texlive/2022/texmf-dist/tex/latex/tikz-qtree/pgftree.sty
INPUT /usr/local/texlive/2022/texmf-dist/tex/latex/tikz-qtree/pgftree.sty
INPUT /usr/local/texlive/2022/texmf-dist/tex/latex/tikz-qtree/pgftree.sty
INPUT /usr/local/texlive/2022/texmf-dist/tex/latex/tikz-qtree/pgftree.sty
INPUT /usr/local/texlive/2022/texmf-dist/tex/latex/tikz-qtree/pgftree.sty
INPUT /usr/local/texlive/2022/texmf-dist/tex/latex/tikz-qtree/pgftree.sty
INPUT /usr/local/texlive/2022/texmf-dist/tex/latex/tikz-qtree/pgftree.sty
INPUT /usr/local/texlive/2022/texmf-dist/tex/latex/tikz-qtree/pgftree.sty
INPUT /usr/local/texlive/2022/texmf-dist/tex/latex/tikz-qtree/pgftree.sty
INPUT /usr/local/texlive/2022/texmf-dist/tex/latex/tikz-qtree/pgftree.sty
INPUT /usr/local/texlive/2022/texmf-dist/tex/latex/pgf/basiclayer/pgf.sty
INPUT /usr/local/texlive/2022/texmf-dist/tex/latex/pgf/utilities/pgffor.sty
INPUT /usr/local/texlive/2022/texmf-dist/tex/latex/tikz-qtree/pgfsubpic.sty
INPUT /usr/local/texlive/2022/texmf-dist/tex/latex/tikz-qtree/pgfsubpic.sty
INPUT /usr/local/texlive/2022/texmf-dist/tex/latex/tikz-qtree/pgfsubpic.sty
INPUT /usr/local/texlive/2022/texmf-dist/tex/latex/tikz-qtree/pgfsubpic.sty
INPUT /usr/local/texlive/2022/texmf-dist/tex/latex/tikz-qtree/pgfsubpic.sty
INPUT /usr/local/texlive/2022/texmf-dist/tex/latex/tikz-qtree/pgfsubpic.sty
INPUT /usr/local/texlive/2022/texmf-dist/tex/latex/tikz-qtree/pgfsubpic.sty
INPUT /usr/local/texlive/2022/texmf-dist/tex/latex/tikz-qtree/pgfsubpic.sty
INPUT /usr/local/texlive/2022/texmf-dist/tex/latex/tikz-qtree/pgfsubpic.sty
INPUT /usr/local/texlive/2022/texmf-dist/tex/latex/tikz-qtree/pgfsubpic.sty
INPUT /usr/local/texlive/2022/texmf-dist/tex/latex/tikz-qtree/pgfsubpic.sty
INPUT /usr/local/texlive/2022/texmf-dist/tex/latex/pgf/basiclayer/pgf.sty
INPUT /usr/local/texlive/2022/texmf-dist/tex/latex/tikz-qtree/pgfsubpic.tex
INPUT /usr/local/texlive/2022/texmf-dist/tex/latex/tikz-qtree/pgfsubpic.tex
INPUT /usr/local/texlive/2022/texmf-dist/tex/latex/tikz-qtree/pgfsubpic.tex
INPUT /usr/local/texlive/2022/texmf-dist/tex/latex/tikz-qtree/pgfsubpic.tex
INPUT /usr/local/texlive/2022/texmf-dist/tex/latex/tikz-qtree/pgftree.tex
INPUT /usr/local/texlive/2022/texmf-dist/tex/latex/tikz-qtree/pgftree.tex
INPUT /usr/local/texlive/2022/texmf-dist/tex/latex/tikz-qtree/pgftree.tex
INPUT /usr/local/texlive/2022/texmf-dist/tex/latex/tikz-qtree/pgftree.tex
INPUT /usr/local/texlive/2022/texmf-dist/tex/latex/tikz-qtree/tikz-qtree.tex
INPUT /usr/local/texlive/2022/texmf-dist/tex/latex/tikz-qtree/tikz-qtree.tex
INPUT /usr/local/texlive/2022/texmf-dist/tex/latex/tikz-qtree/tikz-qtree.tex
INPUT /usr/local/texlive/2022/texmf-dist/tex/latex/tikz-qtree/tikz-qtree.tex
INPUT /usr/local/texlive/2022/texmf-dist/tex/generic/pgf/frontendlayer/tikz/libraries/tikzlibraryfit.code.tex
INPUT /usr/local/texlive/2022/texmf-dist/tex/generic/pgf/frontendlayer/tikz/libraries/tikzlibraryfit.code.tex
INPUT /usr/local/texlive/2022/texmf-dist/tex/generic/pgf/frontendlayer/tikz/libraries/tikzlibrarybackgrounds.code.tex
INPUT /usr/local/texlive/2022/texmf-dist/tex/generic/pgf/frontendlayer/tikz/libraries/tikzlibrarybackgrounds.code.tex
INPUT /usr/local/texlive/2022/texmf-dist/tex/generic/pgf/frontendlayer/tikz/libraries/tikzlibrarymath.code.tex
INPUT /usr/local/texlive/2022/texmf-dist/tex/generic/pgf/frontendlayer/tikz/libraries/tikzlibrarymath.code.tex
INPUT /usr/local/texlive/2022/texmf-dist/tex/generic/pgf/frontendlayer/tikz/libraries/tikzlibraryfpu.code.tex
INPUT /usr/local/texlive/2022/texmf-dist/tex/generic/pgf/frontendlayer/tikz/libraries/tikzlibraryfpu.code.tex
INPUT /usr/local/texlive/2022/texmf-dist/tex/generic/pgf/libraries/pgflibraryfpu.code.tex
INPUT /usr/local/texlive/2022/texmf-dist/tex/generic/pgf/libraries/pgflibraryfpu.code.tex
INPUT /usr/local/texlive/2022/texmf-dist/tex/generic/pgf/frontendlayer/tikz/libraries/tikzlibraryshapes.code.tex
INPUT /usr/local/texlive/2022/texmf-dist/tex/generic/pgf/frontendlayer/tikz/libraries/tikzlibraryshapes.code.tex
INPUT /usr/local/texlive/2022/texmf-dist/tex/generic/pgf/frontendlayer/tikz/libraries/tikzlibraryshapes.geometric.code.tex
INPUT /usr/local/texlive/2022/texmf-dist/tex/generic/pgf/frontendlayer/tikz/libraries/tikzlibraryshapes.geometric.code.tex
INPUT /usr/local/texlive/2022/texmf-dist/tex/generic/pgf/libraries/shapes/pgflibraryshapes.geometric.code.tex
INPUT /usr/local/texlive/2022/texmf-dist/tex/generic/pgf/libraries/shapes/pgflibraryshapes.geometric.code.tex
INPUT /usr/local/texlive/2022/texmf-dist/tex/generic/pgf/frontendlayer/tikz/libraries/tikzlibraryshapes.misc.code.tex
INPUT /usr/local/texlive/2022/texmf-dist/tex/generic/pgf/frontendlayer/tikz/libraries/tikzlibraryshapes.misc.code.tex
INPUT /usr/local/texlive/2022/texmf-dist/tex/generic/pgf/libraries/shapes/pgflibraryshapes.misc.code.tex
INPUT /usr/local/texlive/2022/texmf-dist/tex/generic/pgf/libraries/shapes/pgflibraryshapes.misc.code.tex
INPUT /usr/local/texlive/2022/texmf-dist/tex/generic/pgf/frontendlayer/tikz/libraries/tikzlibraryshapes.symbols.code.tex
INPUT /usr/local/texlive/2022/texmf-dist/tex/generic/pgf/frontendlayer/tikz/libraries/tikzlibraryshapes.symbols.code.tex
INPUT /usr/local/texlive/2022/texmf-dist/tex/generic/pgf/libraries/shapes/pgflibraryshapes.symbols.code.tex
INPUT /usr/local/texlive/2022/texmf-dist/tex/generic/pgf/libraries/shapes/pgflibraryshapes.symbols.code.tex
INPUT /usr/local/texlive/2022/texmf-dist/tex/generic/pgf/frontendlayer/tikz/libraries/tikzlibraryshapes.arrows.code.tex
INPUT /usr/local/texlive/2022/texmf-dist/tex/generic/pgf/frontendlayer/tikz/libraries/tikzlibraryshapes.arrows.code.tex
INPUT /usr/local/texlive/2022/texmf-dist/tex/generic/pgf/libraries/shapes/pgflibraryshapes.arrows.code.tex
INPUT /usr/local/texlive/2022/texmf-dist/tex/generic/pgf/libraries/shapes/pgflibraryshapes.arrows.code.tex
INPUT /usr/local/texlive/2022/texmf-dist/tex/generic/pgf/frontendlayer/tikz/libraries/tikzlibraryshapes.callouts.code.tex
INPUT /usr/local/texlive/2022/texmf-dist/tex/generic/pgf/frontendlayer/tikz/libraries/tikzlibraryshapes.callouts.code.tex
INPUT /usr/local/texlive/2022/texmf-dist/tex/generic/pgf/libraries/shapes/pgflibraryshapes.callouts.code.tex
INPUT /usr/local/texlive/2022/texmf-dist/tex/generic/pgf/libraries/shapes/pgflibraryshapes.callouts.code.tex
INPUT /usr/local/texlive/2022/texmf-dist/tex/generic/pgf/frontendlayer/tikz/libraries/tikzlibraryshapes.multipart.code.tex
INPUT /usr/local/texlive/2022/texmf-dist/tex/generic/pgf/frontendlayer/tikz/libraries/tikzlibraryshapes.multipart.code.tex
INPUT /usr/local/texlive/2022/texmf-dist/tex/generic/pgf/libraries/shapes/pgflibraryshapes.multipart.code.tex
INPUT /usr/local/texlive/2022/texmf-dist/tex/generic/pgf/libraries/shapes/pgflibraryshapes.multipart.code.tex
INPUT /usr/local/texlive/2022/texmf-dist/tex/latex/amsmath/amsmath.sty
INPUT /usr/local/texlive/2022/texmf-dist/tex/latex/amscls/amsthm.sty
INPUT /usr/local/texlive/2022/texmf-dist/tex/latex/amscls/amsthm.sty
INPUT /usr/local/texlive/2022/texmf-dist/tex/latex/amscls/amsthm.sty
INPUT /usr/local/texlive/2022/texmf-dist/tex/latex/amscls/amsthm.sty
INPUT /usr/local/texlive/2022/texmf-dist/tex/latex/amscls/amsthm.sty
INPUT /usr/local/texlive/2022/texmf-dist/tex/latex/amscls/amsthm.sty
INPUT /usr/local/texlive/2022/texmf-dist/tex/latex/amscls/amsthm.sty
INPUT /usr/local/texlive/2022/texmf-dist/tex/latex/amscls/amsthm.sty
INPUT /usr/local/texlive/2022/texmf-dist/tex/latex/amscls/amsthm.sty
INPUT /usr/local/texlive/2022/texmf-dist/tex/latex/amscls/amsthm.sty
INPUT /usr/local/texlive/2022/texmf-dist/tex/latex/amscls/amsthm.sty
INPUT /usr/local/texlive/2022/texmf-dist/tex/latex/amsfonts/amssymb.sty
INPUT /usr/local/texlive/2022/texmf-dist/tex/latex/amsfonts/amssymb.sty
INPUT /usr/local/texlive/2022/texmf-dist/tex/latex/amsfonts/amssymb.sty
INPUT /usr/local/texlive/2022/texmf-dist/tex/latex/amsfonts/amssymb.sty
INPUT /usr/local/texlive/2022/texmf-dist/tex/latex/amsfonts/amssymb.sty
INPUT /usr/local/texlive/2022/texmf-dist/tex/latex/amsfonts/amssymb.sty
INPUT /usr/local/texlive/2022/texmf-dist/tex/latex/amsfonts/amssymb.sty
INPUT /usr/local/texlive/2022/texmf-dist/tex/latex/amsfonts/amssymb.sty
INPUT /usr/local/texlive/2022/texmf-dist/tex/latex/amsfonts/amssymb.sty
INPUT /usr/local/texlive/2022/texmf-dist/tex/latex/amsfonts/amssymb.sty
INPUT /usr/local/texlive/2022/texmf-dist/tex/latex/amsfonts/amssymb.sty
INPUT /usr/local/texlive/2022/texmf-dist/tex/latex/amsfonts/amsfonts.sty
INPUT /usr/local/texlive/2022/texmf-dist/tex/latex/amsfonts/amsfonts.sty
INPUT /usr/local/texlive/2022/texmf-dist/tex/latex/amsfonts/amsfonts.sty
INPUT /usr/local/texlive/2022/texmf-dist/tex/latex/amsfonts/amsfonts.sty
INPUT /usr/local/texlive/2022/texmf-dist/tex/latex/amsfonts/amsfonts.sty
INPUT /usr/local/texlive/2022/texmf-dist/tex/latex/amsfonts/amsfonts.sty
INPUT /usr/local/texlive/2022/texmf-dist/tex/latex/amsfonts/amsfonts.sty
INPUT /usr/local/texlive/2022/texmf-dist/tex/latex/amsfonts/amsfonts.sty
INPUT /usr/local/texlive/2022/texmf-dist/tex/latex/amsfonts/amsfonts.sty
INPUT /usr/local/texlive/2022/texmf-dist/tex/latex/amsfonts/amsfonts.sty
INPUT /usr/local/texlive/2022/texmf-dist/tex/latex/amsfonts/amsfonts.sty
INPUT /usr/local/texlive/2022/texmf-dist/tex/latex/framed/framed.sty
INPUT /usr/local/texlive/2022/texmf-dist/tex/latex/framed/framed.sty
INPUT /usr/local/texlive/2022/texmf-dist/tex/latex/framed/framed.sty
INPUT /usr/local/texlive/2022/texmf-dist/tex/latex/framed/framed.sty
INPUT /usr/local/texlive/2022/texmf-dist/tex/latex/framed/framed.sty
INPUT /usr/local/texlive/2022/texmf-dist/tex/latex/framed/framed.sty
INPUT /usr/local/texlive/2022/texmf-dist/tex/latex/framed/framed.sty
INPUT /usr/local/texlive/2022/texmf-dist/tex/latex/framed/framed.sty
INPUT /usr/local/texlive/2022/texmf-dist/tex/latex/framed/framed.sty
INPUT /usr/local/texlive/2022/texmf-dist/tex/latex/framed/framed.sty
INPUT /usr/local/texlive/2022/texmf-dist/tex/latex/framed/framed.sty
INPUT /usr/local/texlive/2022/texmf-dist/tex/latex/hyperref/hyperref.sty
INPUT /usr/local/texlive/2022/texmf-dist/tex/latex/hyperref/hyperref.sty
INPUT /usr/local/texlive/2022/texmf-dist/tex/latex/hyperref/hyperref.sty
INPUT /usr/local/texlive/2022/texmf-dist/tex/latex/hyperref/hyperref.sty
INPUT /usr/local/texlive/2022/texmf-dist/tex/latex/hyperref/hyperref.sty
INPUT /usr/local/texlive/2022/texmf-dist/tex/latex/hyperref/hyperref.sty
INPUT /usr/local/texlive/2022/texmf-dist/tex/latex/hyperref/hyperref.sty
INPUT /usr/local/texlive/2022/texmf-dist/tex/latex/hyperref/hyperref.sty
INPUT /usr/local/texlive/2022/texmf-dist/tex/latex/hyperref/hyperref.sty
INPUT /usr/local/texlive/2022/texmf-dist/tex/latex/hyperref/hyperref.sty
INPUT /usr/local/texlive/2022/texmf-dist/tex/latex/hyperref/hyperref.sty
INPUT /usr/local/texlive/2022/texmf-dist/tex/generic/ltxcmds/ltxcmds.sty
INPUT /usr/local/texlive/2022/texmf-dist/tex/generic/ltxcmds/ltxcmds.sty
INPUT /usr/local/texlive/2022/texmf-dist/tex/generic/ltxcmds/ltxcmds.sty
INPUT /usr/local/texlive/2022/texmf-dist/tex/generic/ltxcmds/ltxcmds.sty
INPUT /usr/local/texlive/2022/texmf-dist/tex/generic/ltxcmds/ltxcmds.sty
INPUT /usr/local/texlive/2022/texmf-dist/tex/generic/ltxcmds/ltxcmds.sty
INPUT /usr/local/texlive/2022/texmf-dist/tex/generic/ltxcmds/ltxcmds.sty
INPUT /usr/local/texlive/2022/texmf-dist/tex/generic/ltxcmds/ltxcmds.sty
INPUT /usr/local/texlive/2022/texmf-dist/tex/generic/ltxcmds/ltxcmds.sty
INPUT /usr/local/texlive/2022/texmf-dist/tex/generic/ltxcmds/ltxcmds.sty
INPUT /usr/local/texlive/2022/texmf-dist/tex/generic/ltxcmds/ltxcmds.sty
INPUT /usr/local/texlive/2022/texmf-dist/tex/generic/iftex/iftex.sty
INPUT /usr/local/texlive/2022/texmf-dist/tex/generic/pdftexcmds/pdftexcmds.sty
INPUT /usr/local/texlive/2022/texmf-dist/tex/generic/pdftexcmds/pdftexcmds.sty
INPUT /usr/local/texlive/2022/texmf-dist/tex/generic/pdftexcmds/pdftexcmds.sty
INPUT /usr/local/texlive/2022/texmf-dist/tex/generic/pdftexcmds/pdftexcmds.sty
INPUT /usr/local/texlive/2022/texmf-dist/tex/generic/pdftexcmds/pdftexcmds.sty
INPUT /usr/local/texlive/2022/texmf-dist/tex/generic/pdftexcmds/pdftexcmds.sty
INPUT /usr/local/texlive/2022/texmf-dist/tex/generic/pdftexcmds/pdftexcmds.sty
INPUT /usr/local/texlive/2022/texmf-dist/tex/generic/pdftexcmds/pdftexcmds.sty
INPUT /usr/local/texlive/2022/texmf-dist/tex/generic/pdftexcmds/pdftexcmds.sty
INPUT /usr/local/texlive/2022/texmf-dist/tex/generic/pdftexcmds/pdftexcmds.sty
INPUT /usr/local/texlive/2022/texmf-dist/tex/generic/pdftexcmds/pdftexcmds.sty
INPUT /usr/local/texlive/2022/texmf-dist/tex/generic/infwarerr/infwarerr.sty
INPUT /usr/local/texlive/2022/texmf-dist/tex/generic/infwarerr/infwarerr.sty
INPUT /usr/local/texlive/2022/texmf-dist/tex/generic/infwarerr/infwarerr.sty
INPUT /usr/local/texlive/2022/texmf-dist/tex/generic/infwarerr/infwarerr.sty
INPUT /usr/local/texlive/2022/texmf-dist/tex/generic/infwarerr/infwarerr.sty
INPUT /usr/local/texlive/2022/texmf-dist/tex/generic/infwarerr/infwarerr.sty
INPUT /usr/local/texlive/2022/texmf-dist/tex/generic/infwarerr/infwarerr.sty
INPUT /usr/local/texlive/2022/texmf-dist/tex/generic/infwarerr/infwarerr.sty
INPUT /usr/local/texlive/2022/texmf-dist/tex/generic/infwarerr/infwarerr.sty
INPUT /usr/local/texlive/2022/texmf-dist/tex/generic/infwarerr/infwarerr.sty
INPUT /usr/local/texlive/2022/texmf-dist/tex/generic/infwarerr/infwarerr.sty
INPUT /usr/local/texlive/2022/texmf-dist/tex/generic/iftex/iftex.sty
INPUT /usr/local/texlive/2022/texmf-dist/tex/generic/ltxcmds/ltxcmds.sty
INPUT /usr/local/texlive/2022/texmf-dist/tex/generic/infwarerr/infwarerr.sty
INPUT /usr/local/texlive/2022/texmf-dist/tex/latex/graphics/keyval.sty
INPUT /usr/local/texlive/2022/texmf-dist/tex/latex/kvsetkeys/kvsetkeys.sty
INPUT /usr/local/texlive/2022/texmf-dist/tex/latex/kvsetkeys/kvsetkeys.sty
INPUT /usr/local/texlive/2022/texmf-dist/tex/latex/kvsetkeys/kvsetkeys.sty
INPUT /usr/local/texlive/2022/texmf-dist/tex/latex/kvsetkeys/kvsetkeys.sty
INPUT /usr/local/texlive/2022/texmf-dist/tex/latex/kvsetkeys/kvsetkeys.sty
INPUT /usr/local/texlive/2022/texmf-dist/tex/latex/kvsetkeys/kvsetkeys.sty
INPUT /usr/local/texlive/2022/texmf-dist/tex/latex/kvsetkeys/kvsetkeys.sty
INPUT /usr/local/texlive/2022/texmf-dist/tex/latex/kvsetkeys/kvsetkeys.sty
INPUT /usr/local/texlive/2022/texmf-dist/tex/latex/kvsetkeys/kvsetkeys.sty
INPUT /usr/local/texlive/2022/texmf-dist/tex/latex/kvsetkeys/kvsetkeys.sty
INPUT /usr/local/texlive/2022/texmf-dist/tex/latex/kvsetkeys/kvsetkeys.sty
INPUT /usr/local/texlive/2022/texmf-dist/tex/generic/kvdefinekeys/kvdefinekeys.sty
INPUT /usr/local/texlive/2022/texmf-dist/tex/generic/kvdefinekeys/kvdefinekeys.sty
INPUT /usr/local/texlive/2022/texmf-dist/tex/generic/kvdefinekeys/kvdefinekeys.sty
INPUT /usr/local/texlive/2022/texmf-dist/tex/generic/kvdefinekeys/kvdefinekeys.sty
INPUT /usr/local/texlive/2022/texmf-dist/tex/generic/kvdefinekeys/kvdefinekeys.sty
INPUT /usr/local/texlive/2022/texmf-dist/tex/generic/kvdefinekeys/kvdefinekeys.sty
INPUT /usr/local/texlive/2022/texmf-dist/tex/generic/kvdefinekeys/kvdefinekeys.sty
INPUT /usr/local/texlive/2022/texmf-dist/tex/generic/kvdefinekeys/kvdefinekeys.sty
INPUT /usr/local/texlive/2022/texmf-dist/tex/generic/kvdefinekeys/kvdefinekeys.sty
INPUT /usr/local/texlive/2022/texmf-dist/tex/generic/kvdefinekeys/kvdefinekeys.sty
INPUT /usr/local/texlive/2022/texmf-dist/tex/generic/kvdefinekeys/kvdefinekeys.sty
INPUT /usr/local/texlive/2022/texmf-dist/tex/generic/pdfescape/pdfescape.sty
INPUT /usr/local/texlive/2022/texmf-dist/tex/generic/pdfescape/pdfescape.sty
INPUT /usr/local/texlive/2022/texmf-dist/tex/generic/pdfescape/pdfescape.sty
INPUT /usr/local/texlive/2022/texmf-dist/tex/generic/pdfescape/pdfescape.sty
INPUT /usr/local/texlive/2022/texmf-dist/tex/generic/pdfescape/pdfescape.sty
INPUT /usr/local/texlive/2022/texmf-dist/tex/generic/pdfescape/pdfescape.sty
INPUT /usr/local/texlive/2022/texmf-dist/tex/generic/pdfescape/pdfescape.sty
INPUT /usr/local/texlive/2022/texmf-dist/tex/generic/pdfescape/pdfescape.sty
INPUT /usr/local/texlive/2022/texmf-dist/tex/generic/pdfescape/pdfescape.sty
INPUT /usr/local/texlive/2022/texmf-dist/tex/generic/pdfescape/pdfescape.sty
INPUT /usr/local/texlive/2022/texmf-dist/tex/generic/pdfescape/pdfescape.sty
INPUT /usr/local/texlive/2022/texmf-dist/tex/generic/ltxcmds/ltxcmds.sty
INPUT /usr/local/texlive/2022/texmf-dist/tex/generic/pdftexcmds/pdftexcmds.sty
INPUT /usr/local/texlive/2022/texmf-dist/tex/latex/hycolor/hycolor.sty
INPUT /usr/local/texlive/2022/texmf-dist/tex/latex/hycolor/hycolor.sty
INPUT /usr/local/texlive/2022/texmf-dist/tex/latex/hycolor/hycolor.sty
INPUT /usr/local/texlive/2022/texmf-dist/tex/latex/hycolor/hycolor.sty
INPUT /usr/local/texlive/2022/texmf-dist/tex/latex/hycolor/hycolor.sty
INPUT /usr/local/texlive/2022/texmf-dist/tex/latex/hycolor/hycolor.sty
INPUT /usr/local/texlive/2022/texmf-dist/tex/latex/hycolor/hycolor.sty
INPUT /usr/local/texlive/2022/texmf-dist/tex/latex/hycolor/hycolor.sty
INPUT /usr/local/texlive/2022/texmf-dist/tex/latex/hycolor/hycolor.sty
INPUT /usr/local/texlive/2022/texmf-dist/tex/latex/hycolor/hycolor.sty
INPUT /usr/local/texlive/2022/texmf-dist/tex/latex/hycolor/hycolor.sty
INPUT /usr/local/texlive/2022/texmf-dist/tex/latex/letltxmacro/letltxmacro.sty
INPUT /usr/local/texlive/2022/texmf-dist/tex/latex/letltxmacro/letltxmacro.sty
INPUT /usr/local/texlive/2022/texmf-dist/tex/latex/letltxmacro/letltxmacro.sty
INPUT /usr/local/texlive/2022/texmf-dist/tex/latex/letltxmacro/letltxmacro.sty
INPUT /usr/local/texlive/2022/texmf-dist/tex/latex/letltxmacro/letltxmacro.sty
INPUT /usr/local/texlive/2022/texmf-dist/tex/latex/letltxmacro/letltxmacro.sty
INPUT /usr/local/texlive/2022/texmf-dist/tex/latex/letltxmacro/letltxmacro.sty
INPUT /usr/local/texlive/2022/texmf-dist/tex/latex/letltxmacro/letltxmacro.sty
INPUT /usr/local/texlive/2022/texmf-dist/tex/latex/letltxmacro/letltxmacro.sty
INPUT /usr/local/texlive/2022/texmf-dist/tex/latex/letltxmacro/letltxmacro.sty
INPUT /usr/local/texlive/2022/texmf-dist/tex/latex/letltxmacro/letltxmacro.sty
INPUT /usr/local/texlive/2022/texmf-dist/tex/latex/auxhook/auxhook.sty
INPUT /usr/local/texlive/2022/texmf-dist/tex/latex/auxhook/auxhook.sty
INPUT /usr/local/texlive/2022/texmf-dist/tex/latex/auxhook/auxhook.sty
INPUT /usr/local/texlive/2022/texmf-dist/tex/latex/auxhook/auxhook.sty
INPUT /usr/local/texlive/2022/texmf-dist/tex/latex/auxhook/auxhook.sty
INPUT /usr/local/texlive/2022/texmf-dist/tex/latex/auxhook/auxhook.sty
INPUT /usr/local/texlive/2022/texmf-dist/tex/latex/auxhook/auxhook.sty
INPUT /usr/local/texlive/2022/texmf-dist/tex/latex/auxhook/auxhook.sty
INPUT /usr/local/texlive/2022/texmf-dist/tex/latex/auxhook/auxhook.sty
INPUT /usr/local/texlive/2022/texmf-dist/tex/latex/auxhook/auxhook.sty
INPUT /usr/local/texlive/2022/texmf-dist/tex/latex/auxhook/auxhook.sty
INPUT /usr/local/texlive/2022/texmf-dist/tex/latex/hyperref/nameref.sty
INPUT /usr/local/texlive/2022/texmf-dist/tex/latex/hyperref/nameref.sty
INPUT /usr/local/texlive/2022/texmf-dist/tex/latex/hyperref/nameref.sty
INPUT /usr/local/texlive/2022/texmf-dist/tex/latex/hyperref/nameref.sty
INPUT /usr/local/texlive/2022/texmf-dist/tex/latex/hyperref/nameref.sty
INPUT /usr/local/texlive/2022/texmf-dist/tex/latex/hyperref/nameref.sty
INPUT /usr/local/texlive/2022/texmf-dist/tex/latex/hyperref/nameref.sty
INPUT /usr/local/texlive/2022/texmf-dist/tex/latex/hyperref/nameref.sty
INPUT /usr/local/texlive/2022/texmf-dist/tex/latex/hyperref/nameref.sty
INPUT /usr/local/texlive/2022/texmf-dist/tex/latex/hyperref/nameref.sty
INPUT /usr/local/texlive/2022/texmf-dist/tex/latex/hyperref/nameref.sty
INPUT /usr/local/texlive/2022/texmf-dist/tex/latex/refcount/refcount.sty
INPUT /usr/local/texlive/2022/texmf-dist/tex/latex/refcount/refcount.sty
INPUT /usr/local/texlive/2022/texmf-dist/tex/latex/refcount/refcount.sty
INPUT /usr/local/texlive/2022/texmf-dist/tex/latex/refcount/refcount.sty
INPUT /usr/local/texlive/2022/texmf-dist/tex/latex/refcount/refcount.sty
INPUT /usr/local/texlive/2022/texmf-dist/tex/latex/refcount/refcount.sty
INPUT /usr/local/texlive/2022/texmf-dist/tex/latex/refcount/refcount.sty
INPUT /usr/local/texlive/2022/texmf-dist/tex/latex/refcount/refcount.sty
INPUT /usr/local/texlive/2022/texmf-dist/tex/latex/refcount/refcount.sty
INPUT /usr/local/texlive/2022/texmf-dist/tex/latex/refcount/refcount.sty
INPUT /usr/local/texlive/2022/texmf-dist/tex/latex/refcount/refcount.sty
INPUT /usr/local/texlive/2022/texmf-dist/tex/generic/ltxcmds/ltxcmds.sty
INPUT /usr/local/texlive/2022/texmf-dist/tex/generic/infwarerr/infwarerr.sty
INPUT /usr/local/texlive/2022/texmf-dist/tex/generic/gettitlestring/gettitlestring.sty
INPUT /usr/local/texlive/2022/texmf-dist/tex/generic/gettitlestring/gettitlestring.sty
INPUT /usr/local/texlive/2022/texmf-dist/tex/generic/gettitlestring/gettitlestring.sty
INPUT /usr/local/texlive/2022/texmf-dist/tex/generic/gettitlestring/gettitlestring.sty
INPUT /usr/local/texlive/2022/texmf-dist/tex/generic/gettitlestring/gettitlestring.sty
INPUT /usr/local/texlive/2022/texmf-dist/tex/generic/gettitlestring/gettitlestring.sty
INPUT /usr/local/texlive/2022/texmf-dist/tex/generic/gettitlestring/gettitlestring.sty
INPUT /usr/local/texlive/2022/texmf-dist/tex/generic/gettitlestring/gettitlestring.sty
INPUT /usr/local/texlive/2022/texmf-dist/tex/generic/gettitlestring/gettitlestring.sty
INPUT /usr/local/texlive/2022/texmf-dist/tex/generic/gettitlestring/gettitlestring.sty
INPUT /usr/local/texlive/2022/texmf-dist/tex/generic/gettitlestring/gettitlestring.sty
INPUT /usr/local/texlive/2022/texmf-dist/tex/latex/kvoptions/kvoptions.sty
INPUT /usr/local/texlive/2022/texmf-dist/tex/latex/kvoptions/kvoptions.sty
INPUT /usr/local/texlive/2022/texmf-dist/tex/latex/kvoptions/kvoptions.sty
INPUT /usr/local/texlive/2022/texmf-dist/tex/latex/kvoptions/kvoptions.sty
INPUT /usr/local/texlive/2022/texmf-dist/tex/latex/kvoptions/kvoptions.sty
INPUT /usr/local/texlive/2022/texmf-dist/tex/latex/kvoptions/kvoptions.sty
INPUT /usr/local/texlive/2022/texmf-dist/tex/latex/kvoptions/kvoptions.sty
INPUT /usr/local/texlive/2022/texmf-dist/tex/latex/kvoptions/kvoptions.sty
INPUT /usr/local/texlive/2022/texmf-dist/tex/latex/kvoptions/kvoptions.sty
INPUT /usr/local/texlive/2022/texmf-dist/tex/latex/kvoptions/kvoptions.sty
INPUT /usr/local/texlive/2022/texmf-dist/tex/latex/kvoptions/kvoptions.sty
INPUT /usr/local/texlive/2022/texmf-dist/tex/generic/ltxcmds/ltxcmds.sty
INPUT /usr/local/texlive/2022/texmf-dist/tex/latex/kvsetkeys/kvsetkeys.sty
INPUT /usr/local/texlive/2022/texmf-dist/tex/generic/ltxcmds/ltxcmds.sty
INPUT /usr/local/texlive/2022/texmf-dist/tex/latex/kvoptions/kvoptions.sty
INPUT /usr/local/texlive/2022/texmf-dist/tex/latex/hyperref/pd1enc.def
INPUT /usr/local/texlive/2022/texmf-dist/tex/latex/hyperref/pd1enc.def
INPUT /usr/local/texlive/2022/texmf-dist/tex/latex/hyperref/pd1enc.def
INPUT /usr/local/texlive/2022/texmf-dist/tex/latex/hyperref/pd1enc.def
INPUT /usr/local/texlive/2022/texmf-dist/tex/generic/intcalc/intcalc.sty
INPUT /usr/local/texlive/2022/texmf-dist/tex/generic/intcalc/intcalc.sty
INPUT /usr/local/texlive/2022/texmf-dist/tex/generic/intcalc/intcalc.sty
INPUT /usr/local/texlive/2022/texmf-dist/tex/generic/intcalc/intcalc.sty
INPUT /usr/local/texlive/2022/texmf-dist/tex/generic/intcalc/intcalc.sty
INPUT /usr/local/texlive/2022/texmf-dist/tex/generic/intcalc/intcalc.sty
INPUT /usr/local/texlive/2022/texmf-dist/tex/generic/intcalc/intcalc.sty
INPUT /usr/local/texlive/2022/texmf-dist/tex/generic/intcalc/intcalc.sty
INPUT /usr/local/texlive/2022/texmf-dist/tex/generic/intcalc/intcalc.sty
INPUT /usr/local/texlive/2022/texmf-dist/tex/generic/intcalc/intcalc.sty
INPUT /usr/local/texlive/2022/texmf-dist/tex/generic/intcalc/intcalc.sty
INPUT /usr/local/texlive/2022/texmf-dist/tex/generic/etexcmds/etexcmds.sty
INPUT /usr/local/texlive/2022/texmf-dist/tex/generic/etexcmds/etexcmds.sty
INPUT /usr/local/texlive/2022/texmf-dist/tex/generic/etexcmds/etexcmds.sty
INPUT /usr/local/texlive/2022/texmf-dist/tex/generic/etexcmds/etexcmds.sty
INPUT /usr/local/texlive/2022/texmf-dist/tex/generic/etexcmds/etexcmds.sty
INPUT /usr/local/texlive/2022/texmf-dist/tex/generic/etexcmds/etexcmds.sty
INPUT /usr/local/texlive/2022/texmf-dist/tex/generic/etexcmds/etexcmds.sty
INPUT /usr/local/texlive/2022/texmf-dist/tex/generic/etexcmds/etexcmds.sty
INPUT /usr/local/texlive/2022/texmf-dist/tex/generic/etexcmds/etexcmds.sty
INPUT /usr/local/texlive/2022/texmf-dist/tex/generic/etexcmds/etexcmds.sty
INPUT /usr/local/texlive/2022/texmf-dist/tex/generic/etexcmds/etexcmds.sty
INPUT /usr/local/texlive/2022/texmf-dist/tex/generic/infwarerr/infwarerr.sty
INPUT /usr/local/texlive/2022/texmf-dist/tex/generic/iftex/iftex.sty
INPUT /usr/local/texlive/2022/texmf-dist/tex/latex/hyperref/puenc.def
INPUT /usr/local/texlive/2022/texmf-dist/tex/latex/hyperref/puenc.def
INPUT /usr/local/texlive/2022/texmf-dist/tex/latex/hyperref/puenc.def
INPUT /usr/local/texlive/2022/texmf-dist/tex/latex/hyperref/puenc.def
INPUT /usr/local/texlive/2022/texmf-dist/tex/latex/url/url.sty
INPUT /usr/local/texlive/2022/texmf-dist/tex/latex/url/url.sty
INPUT /usr/local/texlive/2022/texmf-dist/tex/latex/url/url.sty
INPUT /usr/local/texlive/2022/texmf-dist/tex/latex/url/url.sty
INPUT /usr/local/texlive/2022/texmf-dist/tex/latex/url/url.sty
INPUT /usr/local/texlive/2022/texmf-dist/tex/latex/url/url.sty
INPUT /usr/local/texlive/2022/texmf-dist/tex/latex/url/url.sty
INPUT /usr/local/texlive/2022/texmf-dist/tex/latex/url/url.sty
INPUT /usr/local/texlive/2022/texmf-dist/tex/latex/url/url.sty
INPUT /usr/local/texlive/2022/texmf-dist/tex/latex/url/url.sty
INPUT /usr/local/texlive/2022/texmf-dist/tex/latex/url/url.sty
INPUT /usr/local/texlive/2022/texmf-dist/tex/generic/bitset/bitset.sty
INPUT /usr/local/texlive/2022/texmf-dist/tex/generic/bitset/bitset.sty
INPUT /usr/local/texlive/2022/texmf-dist/tex/generic/bitset/bitset.sty
INPUT /usr/local/texlive/2022/texmf-dist/tex/generic/bitset/bitset.sty
INPUT /usr/local/texlive/2022/texmf-dist/tex/generic/bitset/bitset.sty
INPUT /usr/local/texlive/2022/texmf-dist/tex/generic/bitset/bitset.sty
INPUT /usr/local/texlive/2022/texmf-dist/tex/generic/bitset/bitset.sty
INPUT /usr/local/texlive/2022/texmf-dist/tex/generic/bitset/bitset.sty
INPUT /usr/local/texlive/2022/texmf-dist/tex/generic/bitset/bitset.sty
INPUT /usr/local/texlive/2022/texmf-dist/tex/generic/bitset/bitset.sty
INPUT /usr/local/texlive/2022/texmf-dist/tex/generic/bitset/bitset.sty
INPUT /usr/local/texlive/2022/texmf-dist/tex/generic/infwarerr/infwarerr.sty
INPUT /usr/local/texlive/2022/texmf-dist/tex/generic/intcalc/intcalc.sty
INPUT /usr/local/texlive/2022/texmf-dist/tex/generic/bigintcalc/bigintcalc.sty
INPUT /usr/local/texlive/2022/texmf-dist/tex/generic/bigintcalc/bigintcalc.sty
INPUT /usr/local/texlive/2022/texmf-dist/tex/generic/bigintcalc/bigintcalc.sty
INPUT /usr/local/texlive/2022/texmf-dist/tex/generic/bigintcalc/bigintcalc.sty
INPUT /usr/local/texlive/2022/texmf-dist/tex/generic/bigintcalc/bigintcalc.sty
INPUT /usr/local/texlive/2022/texmf-dist/tex/generic/bigintcalc/bigintcalc.sty
INPUT /usr/local/texlive/2022/texmf-dist/tex/generic/bigintcalc/bigintcalc.sty
INPUT /usr/local/texlive/2022/texmf-dist/tex/generic/bigintcalc/bigintcalc.sty
INPUT /usr/local/texlive/2022/texmf-dist/tex/generic/bigintcalc/bigintcalc.sty
INPUT /usr/local/texlive/2022/texmf-dist/tex/generic/bigintcalc/bigintcalc.sty
INPUT /usr/local/texlive/2022/texmf-dist/tex/generic/bigintcalc/bigintcalc.sty
INPUT /usr/local/texlive/2022/texmf-dist/tex/generic/pdftexcmds/pdftexcmds.sty
INPUT /usr/local/texlive/2022/texmf-dist/tex/generic/atbegshi/atbegshi.sty
INPUT /usr/local/texlive/2022/texmf-dist/tex/generic/atbegshi/atbegshi.sty
INPUT /usr/local/texlive/2022/texmf-dist/tex/generic/atbegshi/atbegshi.sty
INPUT /usr/local/texlive/2022/texmf-dist/tex/latex/base/atbegshi-ltx.sty
INPUT /usr/local/texlive/2022/texmf-dist/tex/generic/atbegshi/atbegshi.sty
INPUT /usr/local/texlive/2022/texmf-dist/tex/generic/atbegshi/atbegshi.sty
INPUT /usr/local/texlive/2022/texmf-dist/tex/latex/base/atbegshi-ltx.sty
INPUT /usr/local/texlive/2022/texmf-dist/tex/generic/atbegshi/atbegshi.sty
INPUT /usr/local/texlive/2022/texmf-dist/tex/latex/base/atbegshi-ltx.sty
INPUT /usr/local/texlive/2022/texmf-dist/tex/latex/base/atbegshi-ltx.sty
INPUT /usr/local/texlive/2022/texmf-dist/tex/generic/atbegshi/atbegshi.sty
INPUT /usr/local/texlive/2022/texmf-dist/tex/generic/atbegshi/atbegshi.sty
INPUT /usr/local/texlive/2022/texmf-dist/tex/latex/base/atbegshi-ltx.sty
INPUT /usr/local/texlive/2022/texmf-dist/tex/latex/base/atbegshi-ltx.sty
INPUT /usr/local/texlive/2022/texmf-dist/tex/generic/atbegshi/atbegshi.sty
INPUT /usr/local/texlive/2022/texmf-dist/tex/latex/base/atbegshi-ltx.sty
INPUT /usr/local/texlive/2022/texmf-dist/tex/latex/hyperref/hpdftex.def
INPUT /usr/local/texlive/2022/texmf-dist/tex/latex/hyperref/hpdftex.def
INPUT /usr/local/texlive/2022/texmf-dist/tex/latex/hyperref/hpdftex.def
INPUT /usr/local/texlive/2022/texmf-dist/tex/latex/hyperref/hpdftex.def
INPUT /usr/local/texlive/2022/texmf-dist/tex/latex/atveryend/atveryend.sty
INPUT /usr/local/texlive/2022/texmf-dist/tex/latex/atveryend/atveryend.sty
INPUT /usr/local/texlive/2022/texmf-dist/tex/latex/atveryend/atveryend.sty
INPUT /usr/local/texlive/2022/texmf-dist/tex/latex/base/atveryend-ltx.sty
INPUT /usr/local/texlive/2022/texmf-dist/tex/latex/atveryend/atveryend.sty
INPUT /usr/local/texlive/2022/texmf-dist/tex/latex/atveryend/atveryend.sty
INPUT /usr/local/texlive/2022/texmf-dist/tex/latex/base/atveryend-ltx.sty
INPUT /usr/local/texlive/2022/texmf-dist/tex/latex/atveryend/atveryend.sty
INPUT /usr/local/texlive/2022/texmf-dist/tex/latex/base/atveryend-ltx.sty
INPUT /usr/local/texlive/2022/texmf-dist/tex/latex/base/atveryend-ltx.sty
INPUT /usr/local/texlive/2022/texmf-dist/tex/latex/atveryend/atveryend.sty
INPUT /usr/local/texlive/2022/texmf-dist/tex/latex/atveryend/atveryend.sty
INPUT /usr/local/texlive/2022/texmf-dist/tex/latex/base/atveryend-ltx.sty
INPUT /usr/local/texlive/2022/texmf-dist/tex/latex/base/atveryend-ltx.sty
INPUT /usr/local/texlive/2022/texmf-dist/tex/latex/atveryend/atveryend.sty
INPUT /usr/local/texlive/2022/texmf-dist/tex/latex/base/atveryend-ltx.sty
INPUT /usr/local/texlive/2022/texmf-dist/tex/latex/rerunfilecheck/rerunfilecheck.sty
INPUT /usr/local/texlive/2022/texmf-dist/tex/latex/rerunfilecheck/rerunfilecheck.sty
INPUT /usr/local/texlive/2022/texmf-dist/tex/latex/rerunfilecheck/rerunfilecheck.sty
INPUT /usr/local/texlive/2022/texmf-dist/tex/latex/rerunfilecheck/rerunfilecheck.sty
INPUT /usr/local/texlive/2022/texmf-dist/tex/latex/rerunfilecheck/rerunfilecheck.sty
INPUT /usr/local/texlive/2022/texmf-dist/tex/latex/rerunfilecheck/rerunfilecheck.sty
INPUT /usr/local/texlive/2022/texmf-dist/tex/latex/rerunfilecheck/rerunfilecheck.sty
INPUT /usr/local/texlive/2022/texmf-dist/tex/latex/rerunfilecheck/rerunfilecheck.sty
INPUT /usr/local/texlive/2022/texmf-dist/tex/latex/rerunfilecheck/rerunfilecheck.sty
INPUT /usr/local/texlive/2022/texmf-dist/tex/latex/rerunfilecheck/rerunfilecheck.sty
INPUT /usr/local/texlive/2022/texmf-dist/tex/latex/rerunfilecheck/rerunfilecheck.sty
INPUT /usr/local/texlive/2022/texmf-dist/tex/latex/kvoptions/kvoptions.sty
INPUT /usr/local/texlive/2022/texmf-dist/tex/generic/infwarerr/infwarerr.sty
INPUT /usr/local/texlive/2022/texmf-dist/tex/generic/pdftexcmds/pdftexcmds.sty
INPUT /usr/local/texlive/2022/texmf-dist/tex/latex/atveryend/atveryend.sty
INPUT /usr/local/texlive/2022/texmf-dist/tex/generic/uniquecounter/uniquecounter.sty
INPUT /usr/local/texlive/2022/texmf-dist/tex/generic/uniquecounter/uniquecounter.sty
INPUT /usr/local/texlive/2022/texmf-dist/tex/generic/uniquecounter/uniquecounter.sty
INPUT /usr/local/texlive/2022/texmf-dist/tex/generic/uniquecounter/uniquecounter.sty
INPUT /usr/local/texlive/2022/texmf-dist/tex/generic/uniquecounter/uniquecounter.sty
INPUT /usr/local/texlive/2022/texmf-dist/tex/generic/uniquecounter/uniquecounter.sty
INPUT /usr/local/texlive/2022/texmf-dist/tex/generic/uniquecounter/uniquecounter.sty
INPUT /usr/local/texlive/2022/texmf-dist/tex/generic/uniquecounter/uniquecounter.sty
INPUT /usr/local/texlive/2022/texmf-dist/tex/generic/uniquecounter/uniquecounter.sty
INPUT /usr/local/texlive/2022/texmf-dist/tex/generic/uniquecounter/uniquecounter.sty
INPUT /usr/local/texlive/2022/texmf-dist/tex/generic/uniquecounter/uniquecounter.sty
INPUT /usr/local/texlive/2022/texmf-dist/tex/generic/bigintcalc/bigintcalc.sty
INPUT /usr/local/texlive/2022/texmf-dist/tex/generic/infwarerr/infwarerr.sty
INPUT /usr/local/texlive/2022/texmf-dist/tex/latex/algorithms/algorithm.sty
INPUT /usr/local/texlive/2022/texmf-dist/tex/latex/algorithms/algorithm.sty
INPUT /usr/local/texlive/2022/texmf-dist/tex/latex/algorithms/algorithm.sty
INPUT /usr/local/texlive/2022/texmf-dist/tex/latex/algorithms/algorithm.sty
INPUT /usr/local/texlive/2022/texmf-dist/tex/latex/algorithms/algorithm.sty
INPUT /usr/local/texlive/2022/texmf-dist/tex/latex/algorithms/algorithm.sty
INPUT /usr/local/texlive/2022/texmf-dist/tex/latex/algorithms/algorithm.sty
INPUT /usr/local/texlive/2022/texmf-dist/tex/latex/algorithms/algorithm.sty
INPUT /usr/local/texlive/2022/texmf-dist/tex/latex/algorithms/algorithm.sty
INPUT /usr/local/texlive/2022/texmf-dist/tex/latex/algorithms/algorithm.sty
INPUT /usr/local/texlive/2022/texmf-dist/tex/latex/algorithms/algorithm.sty
INPUT /usr/local/texlive/2022/texmf-dist/tex/latex/float/float.sty
INPUT /usr/local/texlive/2022/texmf-dist/tex/latex/float/float.sty
INPUT /usr/local/texlive/2022/texmf-dist/tex/latex/float/float.sty
INPUT /usr/local/texlive/2022/texmf-dist/tex/latex/float/float.sty
INPUT /usr/local/texlive/2022/texmf-dist/tex/latex/float/float.sty
INPUT /usr/local/texlive/2022/texmf-dist/tex/latex/float/float.sty
INPUT /usr/local/texlive/2022/texmf-dist/tex/latex/float/float.sty
INPUT /usr/local/texlive/2022/texmf-dist/tex/latex/float/float.sty
INPUT /usr/local/texlive/2022/texmf-dist/tex/latex/float/float.sty
INPUT /usr/local/texlive/2022/texmf-dist/tex/latex/float/float.sty
INPUT /usr/local/texlive/2022/texmf-dist/tex/latex/float/float.sty
INPUT /usr/local/texlive/2022/texmf-dist/tex/latex/base/ifthen.sty
INPUT /usr/local/texlive/2022/texmf-dist/tex/latex/base/ifthen.sty
INPUT /usr/local/texlive/2022/texmf-dist/tex/latex/base/ifthen.sty
INPUT /usr/local/texlive/2022/texmf-dist/tex/latex/base/ifthen.sty
INPUT /usr/local/texlive/2022/texmf-dist/tex/latex/base/ifthen.sty
INPUT /usr/local/texlive/2022/texmf-dist/tex/latex/base/ifthen.sty
INPUT /usr/local/texlive/2022/texmf-dist/tex/latex/base/ifthen.sty
INPUT /usr/local/texlive/2022/texmf-dist/tex/latex/base/ifthen.sty
INPUT /usr/local/texlive/2022/texmf-dist/tex/latex/base/ifthen.sty
INPUT /usr/local/texlive/2022/texmf-dist/tex/latex/base/ifthen.sty
INPUT /usr/local/texlive/2022/texmf-dist/tex/latex/base/ifthen.sty
INPUT /usr/local/texlive/2022/texmf-dist/tex/latex/algorithmicx/algpseudocode.sty
INPUT /usr/local/texlive/2022/texmf-dist/tex/latex/algorithmicx/algpseudocode.sty
INPUT /usr/local/texlive/2022/texmf-dist/tex/latex/algorithmicx/algpseudocode.sty
INPUT /usr/local/texlive/2022/texmf-dist/tex/latex/algorithmicx/algpseudocode.sty
INPUT /usr/local/texlive/2022/texmf-dist/tex/latex/algorithmicx/algpseudocode.sty
INPUT /usr/local/texlive/2022/texmf-dist/tex/latex/algorithmicx/algpseudocode.sty
INPUT /usr/local/texlive/2022/texmf-dist/tex/latex/algorithmicx/algpseudocode.sty
INPUT /usr/local/texlive/2022/texmf-dist/tex/latex/algorithmicx/algpseudocode.sty
INPUT /usr/local/texlive/2022/texmf-dist/tex/latex/algorithmicx/algpseudocode.sty
INPUT /usr/local/texlive/2022/texmf-dist/tex/latex/algorithmicx/algpseudocode.sty
INPUT /usr/local/texlive/2022/texmf-dist/tex/latex/algorithmicx/algpseudocode.sty
INPUT /usr/local/texlive/2022/texmf-dist/tex/latex/base/ifthen.sty
INPUT /usr/local/texlive/2022/texmf-dist/tex/latex/algorithmicx/algorithmicx.sty
INPUT /usr/local/texlive/2022/texmf-dist/tex/latex/algorithmicx/algorithmicx.sty
INPUT /usr/local/texlive/2022/texmf-dist/tex/latex/algorithmicx/algorithmicx.sty
INPUT /usr/local/texlive/2022/texmf-dist/tex/latex/algorithmicx/algorithmicx.sty
INPUT /usr/local/texlive/2022/texmf-dist/tex/latex/algorithmicx/algorithmicx.sty
INPUT /usr/local/texlive/2022/texmf-dist/tex/latex/algorithmicx/algorithmicx.sty
INPUT /usr/local/texlive/2022/texmf-dist/tex/latex/algorithmicx/algorithmicx.sty
INPUT /usr/local/texlive/2022/texmf-dist/tex/latex/algorithmicx/algorithmicx.sty
INPUT /usr/local/texlive/2022/texmf-dist/tex/latex/algorithmicx/algorithmicx.sty
INPUT /usr/local/texlive/2022/texmf-dist/tex/latex/algorithmicx/algorithmicx.sty
INPUT /usr/local/texlive/2022/texmf-dist/tex/latex/algorithmicx/algorithmicx.sty
INPUT /usr/local/texlive/2022/texmf-dist/tex/latex/base/ifthen.sty
INPUT /usr/local/texlive/2022/texmf-dist/tex/latex/algorithmicx/algorithmicx.sty
INPUT /usr/local/texlive/2022/texmf-dist/tex/latex/placeins/placeins.sty
INPUT /usr/local/texlive/2022/texmf-dist/tex/latex/placeins/placeins.sty
INPUT /usr/local/texlive/2022/texmf-dist/tex/latex/placeins/placeins.sty
INPUT /usr/local/texlive/2022/texmf-dist/tex/latex/placeins/placeins.sty
INPUT /usr/local/texlive/2022/texmf-dist/tex/latex/placeins/placeins.sty
INPUT /usr/local/texlive/2022/texmf-dist/tex/latex/placeins/placeins.sty
INPUT /usr/local/texlive/2022/texmf-dist/tex/latex/placeins/placeins.sty
INPUT /usr/local/texlive/2022/texmf-dist/tex/latex/placeins/placeins.sty
INPUT /usr/local/texlive/2022/texmf-dist/tex/latex/placeins/placeins.sty
INPUT /usr/local/texlive/2022/texmf-dist/tex/latex/placeins/placeins.sty
INPUT /usr/local/texlive/2022/texmf-dist/tex/latex/placeins/placeins.sty
INPUT /usr/local/texlive/2022/texmf-dist/tex/latex/tools/multicol.sty
INPUT /usr/local/texlive/2022/texmf-dist/tex/latex/tools/multicol.sty
INPUT /usr/local/texlive/2022/texmf-dist/tex/latex/tools/multicol.sty
INPUT /usr/local/texlive/2022/texmf-dist/tex/latex/tools/multicol.sty
INPUT /usr/local/texlive/2022/texmf-dist/tex/latex/tools/multicol.sty
INPUT /usr/local/texlive/2022/texmf-dist/tex/latex/tools/multicol.sty
INPUT /usr/local/texlive/2022/texmf-dist/tex/latex/tools/multicol.sty
INPUT /usr/local/texlive/2022/texmf-dist/tex/latex/tools/multicol.sty
INPUT /usr/local/texlive/2022/texmf-dist/tex/latex/tools/multicol.sty
INPUT /usr/local/texlive/2022/texmf-dist/tex/latex/tools/multicol.sty
INPUT /usr/local/texlive/2022/texmf-dist/tex/latex/tools/multicol.sty
INPUT /usr/local/texlive/2022/texmf-dist/tex/latex/caption/subcaption.sty
INPUT /usr/local/texlive/2022/texmf-dist/tex/latex/caption/subcaption.sty
INPUT /usr/local/texlive/2022/texmf-dist/tex/latex/caption/subcaption.sty
INPUT /usr/local/texlive/2022/texmf-dist/tex/latex/caption/subcaption.sty
INPUT /usr/local/texlive/2022/texmf-dist/tex/latex/caption/subcaption.sty
INPUT /usr/local/texlive/2022/texmf-dist/tex/latex/caption/subcaption.sty
INPUT /usr/local/texlive/2022/texmf-dist/tex/latex/caption/subcaption.sty
INPUT /usr/local/texlive/2022/texmf-dist/tex/latex/caption/subcaption.sty
INPUT /usr/local/texlive/2022/texmf-dist/tex/latex/caption/subcaption.sty
INPUT /usr/local/texlive/2022/texmf-dist/tex/latex/caption/subcaption.sty
INPUT /usr/local/texlive/2022/texmf-dist/tex/latex/caption/subcaption.sty
INPUT /usr/local/texlive/2022/texmf-dist/tex/latex/caption/caption.sty
INPUT /usr/local/texlive/2022/texmf-dist/tex/latex/caption/caption.sty
INPUT /usr/local/texlive/2022/texmf-dist/tex/latex/caption/caption.sty
INPUT /usr/local/texlive/2022/texmf-dist/tex/latex/caption/caption.sty
INPUT /usr/local/texlive/2022/texmf-dist/tex/latex/caption/caption.sty
INPUT /usr/local/texlive/2022/texmf-dist/tex/latex/caption/caption.sty
INPUT /usr/local/texlive/2022/texmf-dist/tex/latex/caption/caption.sty
INPUT /usr/local/texlive/2022/texmf-dist/tex/latex/caption/caption.sty
INPUT /usr/local/texlive/2022/texmf-dist/tex/latex/caption/caption.sty
INPUT /usr/local/texlive/2022/texmf-dist/tex/latex/caption/caption.sty
INPUT /usr/local/texlive/2022/texmf-dist/tex/latex/caption/caption.sty
INPUT /usr/local/texlive/2022/texmf-dist/tex/latex/caption/caption3.sty
INPUT /usr/local/texlive/2022/texmf-dist/tex/latex/caption/caption3.sty
INPUT /usr/local/texlive/2022/texmf-dist/tex/latex/caption/caption3.sty
INPUT /usr/local/texlive/2022/texmf-dist/tex/latex/caption/caption3.sty
INPUT /usr/local/texlive/2022/texmf-dist/tex/latex/caption/caption3.sty
INPUT /usr/local/texlive/2022/texmf-dist/tex/latex/caption/caption3.sty
INPUT /usr/local/texlive/2022/texmf-dist/tex/latex/caption/caption3.sty
INPUT /usr/local/texlive/2022/texmf-dist/tex/latex/caption/caption3.sty
INPUT /usr/local/texlive/2022/texmf-dist/tex/latex/caption/caption3.sty
INPUT /usr/local/texlive/2022/texmf-dist/tex/latex/caption/caption3.sty
INPUT /usr/local/texlive/2022/texmf-dist/tex/latex/caption/caption3.sty
INPUT /usr/local/texlive/2022/texmf-dist/tex/latex/graphics/keyval.sty
INPUT /usr/local/texlive/2022/texmf-dist/tex/latex/float/float.sty
INPUT /usr/local/texlive/2022/texmf-dist/tex/latex/l3backend/l3backend-pdftex.def
INPUT /usr/local/texlive/2022/texmf-dist/tex/latex/l3backend/l3backend-pdftex.def
INPUT /usr/local/texlive/2022/texmf-dist/tex/latex/l3backend/l3backend-pdftex.def
INPUT /usr/local/texlive/2022/texmf-dist/tex/latex/l3backend/l3backend-pdftex.def
INPUT /usr/local/texlive/2022/texmf-dist/tex/latex/l3backend/l3backend-pdftex.def
INPUT /usr/local/texlive/2022/texmf-dist/tex/latex/l3backend/l3backend-pdftex.def
INPUT /usr/local/texlive/2022/texmf-dist/tex/latex/l3backend/l3backend-pdftex.def
INPUT /usr/local/texlive/2022/texmf-dist/tex/latex/l3backend/l3backend-pdftex.def
INPUT /usr/local/texlive/2022/texmf-dist/tex/latex/l3backend/l3backend-pdftex.def
INPUT /usr/local/texlive/2022/texmf-dist/tex/latex/l3backend/l3backend-pdftex.def
INPUT /usr/local/texlive/2022/texmf-dist/tex/latex/l3backend/l3backend-pdftex.def
INPUT ./main.aux
INPUT main.aux
INPUT main.aux
OUTPUT main.aux
INPUT /usr/local/texlive/2022/texmf-dist/tex/context/base/mkii/supp-pdf.mkii
INPUT /usr/local/texlive/2022/texmf-dist/tex/context/base/mkii/supp-pdf.mkii
INPUT /usr/local/texlive/2022/texmf-dist/tex/context/base/mkii/supp-pdf.mkii
INPUT /usr/local/texlive/2022/texmf-dist/tex/context/base/mkii/supp-pdf.mkii
INPUT /usr/local/texlive/2022/texmf-dist/tex/latex/epstopdf-pkg/epstopdf-base.sty
INPUT /usr/local/texlive/2022/texmf-dist/tex/latex/epstopdf-pkg/epstopdf-base.sty
INPUT /usr/local/texlive/2022/texmf-dist/tex/latex/epstopdf-pkg/epstopdf-base.sty
INPUT /usr/local/texlive/2022/texmf-dist/tex/latex/epstopdf-pkg/epstopdf-base.sty
INPUT /usr/local/texlive/2022/texmf-dist/tex/latex/epstopdf-pkg/epstopdf-base.sty
INPUT /usr/local/texlive/2022/texmf-dist/tex/latex/epstopdf-pkg/epstopdf-base.sty
INPUT /usr/local/texlive/2022/texmf-dist/tex/latex/epstopdf-pkg/epstopdf-base.sty
INPUT /usr/local/texlive/2022/texmf-dist/tex/latex/epstopdf-pkg/epstopdf-base.sty
INPUT /usr/local/texlive/2022/texmf-dist/tex/latex/epstopdf-pkg/epstopdf-base.sty
INPUT /usr/local/texlive/2022/texmf-dist/tex/latex/epstopdf-pkg/epstopdf-base.sty
INPUT /usr/local/texlive/2022/texmf-dist/tex/latex/epstopdf-pkg/epstopdf-base.sty
INPUT /usr/local/texlive/2022/texmf-dist/tex/latex/latexconfig/epstopdf-sys.cfg
INPUT /usr/local/texlive/2022/texmf-dist/tex/latex/latexconfig/epstopdf-sys.cfg
INPUT /usr/local/texlive/2022/texmf-dist/tex/latex/latexconfig/epstopdf-sys.cfg
INPUT /usr/local/texlive/2022/texmf-dist/tex/latex/latexconfig/epstopdf-sys.cfg
INPUT /usr/local/texlive/2022/texmf-dist/tex/latex/graphics/graphicx.sty
INPUT ./main.out
INPUT main.out
INPUT ./main.out
INPUT main.out
INPUT ./main.out
INPUT main.out
INPUT ./main.out
INPUT main.out
OUTPUT main.pdf
INPUT ./main.out
INPUT ./main.out
OUTPUT main.out
INPUT /usr/local/texlive/2022/texmf-dist/fonts/tfm/public/cm/cmr17.tfm
INPUT /usr/local/texlive/2022/texmf-dist/fonts/tfm/public/cm/cmr12.tfm
INPUT /usr/local/texlive/2022/texmf-dist/fonts/tfm/public/cm/cmr8.tfm
INPUT /usr/local/texlive/2022/texmf-dist/fonts/tfm/public/cm/cmr6.tfm
INPUT /usr/local/texlive/2022/texmf-dist/fonts/tfm/public/cm/cmmi12.tfm
INPUT /usr/local/texlive/2022/texmf-dist/fonts/tfm/public/cm/cmmi8.tfm
INPUT /usr/local/texlive/2022/texmf-dist/fonts/tfm/public/cm/cmmi6.tfm
INPUT /usr/local/texlive/2022/texmf-dist/fonts/tfm/public/cm/cmsy10.tfm
INPUT /usr/local/texlive/2022/texmf-dist/fonts/tfm/public/cm/cmsy8.tfm
INPUT /usr/local/texlive/2022/texmf-dist/fonts/tfm/public/cm/cmsy6.tfm
INPUT /usr/local/texlive/2022/texmf-dist/fonts/tfm/public/cm/cmex10.tfm
INPUT /usr/local/texlive/2022/texmf-dist/fonts/tfm/public/amsfonts/cmextra/cmex8.tfm
INPUT /usr/local/texlive/2022/texmf-dist/fonts/tfm/public/amsfonts/cmextra/cmex7.tfm
INPUT /usr/local/texlive/2022/texmf-dist/tex/latex/amsfonts/umsa.fd
INPUT /usr/local/texlive/2022/texmf-dist/tex/latex/amsfonts/umsa.fd
INPUT /usr/local/texlive/2022/texmf-dist/tex/latex/amsfonts/umsa.fd
INPUT /usr/local/texlive/2022/texmf-dist/tex/latex/amsfonts/umsa.fd
INPUT /usr/local/texlive/2022/texmf-dist/fonts/tfm/public/amsfonts/symbols/msam10.tfm
INPUT /usr/local/texlive/2022/texmf-dist/fonts/tfm/public/amsfonts/symbols/msam10.tfm
INPUT /usr/local/texlive/2022/texmf-dist/fonts/tfm/public/amsfonts/symbols/msam7.tfm
INPUT /usr/local/texlive/2022/texmf-dist/tex/latex/amsfonts/umsb.fd
INPUT /usr/local/texlive/2022/texmf-dist/tex/latex/amsfonts/umsb.fd
INPUT /usr/local/texlive/2022/texmf-dist/tex/latex/amsfonts/umsb.fd
INPUT /usr/local/texlive/2022/texmf-dist/tex/latex/amsfonts/umsb.fd
INPUT /usr/local/texlive/2022/texmf-dist/fonts/tfm/public/amsfonts/symbols/msbm10.tfm
INPUT /usr/local/texlive/2022/texmf-dist/fonts/tfm/public/amsfonts/symbols/msbm10.tfm
INPUT /usr/local/texlive/2022/texmf-dist/fonts/tfm/public/amsfonts/symbols/msbm7.tfm
INPUT /usr/local/texlive/2022/texmf-var/fonts/map/pdftex/updmap/pdftex.map
INPUT /usr/local/texlive/2022/texmf-dist/fonts/tfm/public/cm/cmr12.tfm
INPUT /usr/local/texlive/2022/texmf-dist/fonts/tfm/public/cm/cmbx12.tfm
INPUT ./main.toc
INPUT main.toc
INPUT main.toc
INPUT /usr/local/texlive/2022/texmf-dist/fonts/tfm/public/cm/cmbx10.tfm
INPUT /usr/local/texlive/2022/texmf-dist/fonts/tfm/public/cm/cmmi10.tfm
INPUT /usr/local/texlive/2022/texmf-dist/fonts/tfm/public/cm/cmsy10.tfm
INPUT /usr/local/texlive/2022/texmf-dist/fonts/tfm/public/cm/cmex10.tfm
INPUT /usr/local/texlive/2022/texmf-dist/fonts/tfm/public/amsfonts/symbols/msam10.tfm
INPUT /usr/local/texlive/2022/texmf-dist/fonts/tfm/public/amsfonts/symbols/msbm10.tfm
OUTPUT main.toc
INPUT ./Introduction.tex
INPUT ./Introduction.tex
INPUT ./Introduction.tex
INPUT Introduction.tex
INPUT ./Introduction.tex
INPUT ./Introduction.tex
INPUT Introduction.tex
INPUT ./background.tex
INPUT background.tex
INPUT ./background.tex
INPUT background.tex
INPUT /usr/local/texlive/2022/texmf-dist/fonts/tfm/public/cm/cmti10.tfm
INPUT ./problem_formulation.tex
INPUT ./problem_formulation.tex
INPUT ./problem_formulation.tex
INPUT problem_formulation.tex
INPUT ./problem_formulation.tex
INPUT ./problem_formulation.tex
INPUT problem_formulation.tex
INPUT ./model.tex
INPUT ./model.tex
INPUT ./model.tex
INPUT model.tex
INPUT ./model.tex
INPUT ./model.tex
INPUT model.tex
INPUT /usr/local/texlive/2022/texmf-dist/fonts/tfm/public/cm/cmcsc10.tfm
INPUT /usr/local/texlive/2022/texmf-dist/fonts/tfm/public/cm/cmcsc10.tfm
INPUT /usr/local/texlive/2022/texmf-dist/fonts/tfm/public/cm/cmcsc10.tfm
INPUT /usr/local/texlive/2022/texmf-dist/fonts/tfm/public/cm/cmbx12.tfm
INPUT ./trees.tex
INPUT ./trees.tex
INPUT ./trees.tex
INPUT trees.tex
INPUT ./trees.tex
INPUT ./trees.tex
INPUT trees.tex
INPUT ./tikz/tree_example.tex
INPUT tikz/tree_example.tex
INPUT ./tikz/tree_example.tex
INPUT tikz/tree_example.tex
INPUT /usr/local/texlive/2022/texmf-dist/fonts/tfm/public/cm/cmr9.tfm
INPUT /usr/local/texlive/2022/texmf-dist/fonts/tfm/public/cm/cmmi9.tfm
INPUT /usr/local/texlive/2022/texmf-dist/fonts/tfm/public/cm/cmsy9.tfm
INPUT /usr/local/texlive/2022/texmf-dist/fonts/tfm/public/amsfonts/cmextra/cmex9.tfm
INPUT /usr/local/texlive/2022/texmf-dist/fonts/tfm/public/amsfonts/cmextra/cmex7.tfm
INPUT /usr/local/texlive/2022/texmf-dist/fonts/tfm/public/amsfonts/symbols/msam10.tfm
INPUT /usr/local/texlive/2022/texmf-dist/fonts/tfm/public/amsfonts/symbols/msam5.tfm
INPUT /usr/local/texlive/2022/texmf-dist/fonts/tfm/public/amsfonts/symbols/msbm10.tfm
INPUT /usr/local/texlive/2022/texmf-dist/fonts/tfm/public/amsfonts/symbols/msbm5.tfm
INPUT ./complexity.tex
INPUT ./complexity.tex
INPUT ./complexity.tex
INPUT complexity.tex
INPUT ./complexity.tex
INPUT ./complexity.tex
INPUT complexity.tex
INPUT ./tikz/tikz_reduction.tex
INPUT ./tikz/tikz_reduction.tex
INPUT ./tikz/tikz_reduction.tex
INPUT tikz/tikz_reduction.tex
INPUT ./tikz/tikz_reduction.tex
INPUT ./tikz/tikz_reduction.tex
INPUT tikz/tikz_reduction.tex
INPUT ./ip.tex
INPUT ./ip.tex
INPUT ./ip.tex
INPUT ip.tex
INPUT ./ip.tex
INPUT ./ip.tex
INPUT ip.tex
INPUT ./instance_optimization.tex
INPUT ./instance_optimization.tex
INPUT ./instance_optimization.tex
INPUT instance_optimization.tex
INPUT ./instance_optimization.tex
INPUT ./instance_optimization.tex
INPUT instance_optimization.tex
INPUT ./tikz/tikz_location_opt.tex
INPUT tikz/tikz_location_opt.tex
INPUT ./tikz/tikz_location_opt.tex
INPUT tikz/tikz_location_opt.tex
INPUT ./algorithms.tex
INPUT ./algorithms.tex
INPUT ./algorithms.tex
INPUT algorithms.tex
INPUT ./algorithms.tex
INPUT ./algorithms.tex
INPUT algorithms.tex
INPUT ./evaluation.tex
INPUT ./evaluation.tex
INPUT ./evaluation.tex
INPUT evaluation.tex
INPUT ./evaluation.tex
INPUT ./evaluation.tex
INPUT evaluation.tex
INPUT ./img/eval/static_reduction_final_time_all.png
INPUT ./img/eval/static_reduction_final_time_all.png
INPUT img/eval/static_reduction_final_time_all.png
INPUT ./img/eval/static_reduction_final_time_all.png
INPUT ./img/eval/static_reduction_final_time_all.png
INPUT ./img/eval/static_reduction_final_time_two.png
INPUT ./img/eval/static_reduction_final_time_two.png
INPUT img/eval/static_reduction_final_time_two.png
INPUT ./img/eval/static_reduction_final_time_two.png
INPUT ./img/eval/static_reduction_final_time_two.png
INPUT ./img/eval/static_reduction_quality.png
INPUT ./img/eval/static_reduction_quality.png
INPUT img/eval/static_reduction_quality.png
INPUT ./img/eval/static_reduction_quality.png
INPUT ./img/eval/static_reduction_quality.png
INPUT ./img/eval/static_reduction_time.png
INPUT ./img/eval/static_reduction_time.png
INPUT img/eval/static_reduction_time.png
INPUT ./img/eval/static_reduction_time.png
INPUT ./img/eval/static_reduction_time.png
INPUT ./img/eval/instance_opt_facilities_time.png
INPUT ./img/eval/instance_opt_facilities_time.png
INPUT img/eval/instance_opt_facilities_time.png
INPUT ./img/eval/instance_opt_facilities_time.png
INPUT ./img/eval/instance_opt_facilities_time.png
INPUT ./img/eval/instance_opt_facilities_quality.png
INPUT ./img/eval/instance_opt_facilities_quality.png
INPUT img/eval/instance_opt_facilities_quality.png
INPUT ./img/eval/instance_opt_facilities_quality.png
INPUT ./img/eval/instance_opt_facilities_quality.png
INPUT ./img/eval/instance_opt_locations_quality.png
INPUT ./img/eval/instance_opt_locations_quality.png
INPUT img/eval/instance_opt_locations_quality.png
INPUT ./img/eval/instance_opt_locations_quality.png
INPUT ./img/eval/instance_opt_locations_quality.png
INPUT ./img/eval/instance_opt_locations_time.png
INPUT ./img/eval/instance_opt_locations_time.png
INPUT img/eval/instance_opt_locations_time.png
INPUT ./img/eval/instance_opt_locations_time.png
INPUT ./img/eval/instance_opt_locations_time.png
INPUT ./img/eval/essential_facilities_quality.png
INPUT ./img/eval/essential_facilities_quality.png
INPUT img/eval/essential_facilities_quality.png
INPUT ./img/eval/essential_facilities_quality.png
INPUT ./img/eval/essential_facilities_quality.png
INPUT ./img/eval/essential_facilities_time.png
INPUT ./img/eval/essential_facilities_time.png
INPUT img/eval/essential_facilities_time.png
INPUT ./img/eval/essential_facilities_time.png
INPUT ./img/eval/essential_facilities_time.png
INPUT ./img/eval/solution_heuristics_quality_plot.png
INPUT ./img/eval/solution_heuristics_quality_plot.png
INPUT img/eval/solution_heuristics_quality_plot.png
INPUT ./img/eval/solution_heuristics_quality_plot.png
INPUT ./img/eval/solution_heuristics_quality_plot.png
INPUT ./img/eval/solution_heuristics_time_complete.png
INPUT ./img/eval/solution_heuristics_time_complete.png
INPUT img/eval/solution_heuristics_time_complete.png
INPUT ./img/eval/solution_heuristics_time_complete.png
INPUT ./img/eval/solution_heuristics_time_complete.png
INPUT ./img/example/instance.png
INPUT ./img/example/instance.png
INPUT img/example/instance.png
INPUT ./img/example/instance.png
INPUT ./img/example/instance.png
INPUT ./img/example/instance_sampled.png
INPUT ./img/example/instance_sampled.png
INPUT img/example/instance_sampled.png
INPUT ./img/example/instance_sampled.png
INPUT ./img/example/instance_sampled.png
INPUT ./img/example/reduced_opt.png
INPUT ./img/example/reduced_opt.png
INPUT img/example/reduced_opt.png
INPUT ./img/example/reduced_opt.png
INPUT ./img/example/reduced_opt.png
INPUT ./img/example/solution_dynamic.png
INPUT ./img/example/solution_dynamic.png
INPUT img/example/solution_dynamic.png
INPUT ./img/example/solution_dynamic.png
INPUT ./img/example/solution_dynamic.png
INPUT ./img/example/full_opt.png
INPUT ./img/example/full_opt.png
INPUT img/example/full_opt.png
INPUT ./img/example/full_opt.png
INPUT ./img/example/full_opt.png
INPUT ./img/example/solution_static.png
INPUT ./img/example/solution_static.png
INPUT img/example/solution_static.png
INPUT ./img/example/solution_static.png
INPUT ./img/example/solution_static.png
INPUT ./conclusion.tex
INPUT ./conclusion.tex
INPUT ./conclusion.tex
INPUT conclusion.tex
INPUT ./conclusion.tex
INPUT ./conclusion.tex
INPUT conclusion.tex
INPUT ./instance.tex
INPUT ./instance.tex
INPUT ./instance.tex
INPUT instance.tex
INPUT ./instance.tex
INPUT ./instance.tex
INPUT instance.tex
INPUT ./img/comparison.png
INPUT ./img/comparison.png
INPUT img/comparison.png
INPUT ./img/comparison.png
INPUT ./img/comparison.png
INPUT /usr/local/texlive/2022/texmf-dist/fonts/tfm/public/cm/cmtt10.tfm
INPUT ./img/locations_hospitals_germany+nrw.png
INPUT ./img/locations_hospitals_germany+nrw.png
INPUT img/locations_hospitals_germany+nrw.png
INPUT ./img/locations_hospitals_germany+nrw.png
INPUT ./img/locations_hospitals_germany+nrw.png
INPUT ./main.bbl
INPUT main.bbl
INPUT ./main.bbl
INPUT main.bbl
INPUT main.aux
INPUT ./main.out
INPUT ./main.out
INPUT /usr/local/texlive/2022/texmf-dist/fonts/type1/public/amsfonts/cm/cmbx10.pfb
INPUT /usr/local/texlive/2022/texmf-dist/fonts/type1/public/amsfonts/cm/cmbx12.pfb
INPUT /usr/local/texlive/2022/texmf-dist/fonts/type1/public/amsfonts/cm/cmcsc10.pfb
INPUT /usr/local/texlive/2022/texmf-dist/fonts/type1/public/amsfonts/cm/cmex10.pfb
INPUT /usr/local/texlive/2022/texmf-dist/fonts/type1/public/amsfonts/cm/cmmi10.pfb
INPUT /usr/local/texlive/2022/texmf-dist/fonts/type1/public/amsfonts/cm/cmmi6.pfb
INPUT /usr/local/texlive/2022/texmf-dist/fonts/type1/public/amsfonts/cm/cmmi8.pfb
INPUT /usr/local/texlive/2022/texmf-dist/fonts/type1/public/amsfonts/cm/cmmi9.pfb
INPUT /usr/local/texlive/2022/texmf-dist/fonts/type1/public/amsfonts/cm/cmr10.pfb
INPUT /usr/local/texlive/2022/texmf-dist/fonts/type1/public/amsfonts/cm/cmr12.pfb
INPUT /usr/local/texlive/2022/texmf-dist/fonts/type1/public/amsfonts/cm/cmr17.pfb
INPUT /usr/local/texlive/2022/texmf-dist/fonts/type1/public/amsfonts/cm/cmr6.pfb
INPUT /usr/local/texlive/2022/texmf-dist/fonts/type1/public/amsfonts/cm/cmr8.pfb
INPUT /usr/local/texlive/2022/texmf-dist/fonts/type1/public/amsfonts/cm/cmr9.pfb
INPUT /usr/local/texlive/2022/texmf-dist/fonts/type1/public/amsfonts/cm/cmsy10.pfb
INPUT /usr/local/texlive/2022/texmf-dist/fonts/type1/public/amsfonts/cm/cmsy6.pfb
INPUT /usr/local/texlive/2022/texmf-dist/fonts/type1/public/amsfonts/cm/cmsy8.pfb
INPUT /usr/local/texlive/2022/texmf-dist/fonts/type1/public/amsfonts/cm/cmsy9.pfb
INPUT /usr/local/texlive/2022/texmf-dist/fonts/type1/public/amsfonts/cm/cmti10.pfb
INPUT /usr/local/texlive/2022/texmf-dist/fonts/type1/public/amsfonts/cm/cmtt10.pfb
INPUT /usr/local/texlive/2022/texmf-dist/fonts/type1/public/amsfonts/symbols/msbm10.pfb
