# Fdb version 3
["pdflatex"] 1653933118 "c:/Users/Lennart Holzenkamp/Documents/dev/uni/spp/oc-dfg-clustering/documentation/02-algorithm-specification/algorithm-specifications.tex" "c:/Users/Lennart Holzenkamp/Documents/dev/uni/spp/oc-dfg-clustering/documentation/02-algorithm-specification/algorithm-specifications.pdf" "algorithm-specifications" 1653933119
  "C:/Users/Lennart Holzenkamp/AppData/Local/MiKTeX/2.9/fonts/pk/ljfour/jknappen/ec/dpi600/ecbx1200.pk" 1652277644 31952 f407b0bc46d7538c535b17a0f18bbb42 ""
  "C:/Users/Lennart Holzenkamp/AppData/Local/MiKTeX/2.9/fonts/pk/ljfour/jknappen/ec/dpi600/ecbx1440.pk" 1652277646 40136 da216d664a5e8a2475e67429301c149b ""
  "C:/Users/Lennart Holzenkamp/AppData/Local/MiKTeX/2.9/fonts/pk/ljfour/jknappen/ec/dpi600/ecbx1728.pk" 1652277651 49100 1e271b1d5b610684ebbd139db8da87d2 ""
  "C:/Users/Lennart Holzenkamp/AppData/Local/MiKTeX/2.9/fonts/pk/ljfour/jknappen/ec/dpi600/ecrm1200.pk" 1652277649 28440 bc978c7138bec126cc4bbd31f6046489 ""
  "C:/Users/Lennart Holzenkamp/AppData/Local/MiKTeX/2.9/fonts/pk/ljfour/jknappen/ec/dpi600/ecrm1440.pk" 1652277654 34320 1c24eea0f4edfa2597c5631c17e6cecd ""
  "C:/Users/Lennart Holzenkamp/AppData/Local/MiKTeX/2.9/fonts/pk/ljfour/jknappen/ec/dpi600/ecrm2074.pk" 1652277656 53736 e9ae2b7168d3214b633d9a9af4666070 ""
  "C:/Users/Lennart Holzenkamp/AppData/Local/MiKTeX/2.9/fonts/pk/ljfour/jknappen/ec/dpi600/ecti1200.pk" 1652277642 39120 cb5475d9b5917fbb676afb0ab9155357 ""
  "C:/Users/Lennart Holzenkamp/AppData/Local/MiKTeX/2.9/fonts/pk/ljfour/jknappen/ec/dpi600/tcrm1200.pk" 1588689678 14064 1f520a2ef0c6f455f7e0c927f7d9989b ""
  "C:/Users/Lennart Holzenkamp/AppData/Local/MiKTeX/2.9/miktex/data/le/pdftex/pdflatex.fmt" 1619087673 9532724 1173099e823409a0322db2257db91acc ""
  "C:/Users/Lennart Holzenkamp/AppData/Local/MiKTeX/2.9/pdftex/config/pdftex.map" 1652215551 80199 fc1d9fbcd6f65783fd5e2c4596209ef6 ""
  "C:/Users/Lennart Holzenkamp/AppData/Local/Programs/MiKTeX 2.9/fonts/tfm/jknappen/ec/ecbx1200.tfm" 993061958 3200 b8d69bc738e5ef3e08cefeef3109ff56 ""
  "C:/Users/Lennart Holzenkamp/AppData/Local/Programs/MiKTeX 2.9/fonts/tfm/jknappen/ec/ecbx1440.tfm" 993061960 3196 0b37fa3083e15c57cfa8c4ff52f2807a ""
  "C:/Users/Lennart Holzenkamp/AppData/Local/Programs/MiKTeX 2.9/fonts/tfm/jknappen/ec/ecbx1728.tfm" 993061962 3204 d35cb76836b6cb4ed404dd64a550530d ""
  "C:/Users/Lennart Holzenkamp/AppData/Local/Programs/MiKTeX 2.9/fonts/tfm/jknappen/ec/ecrm1200.tfm" 993062126 3152 4850ff0163852b7fab34bd55e1197f28 ""
  "C:/Users/Lennart Holzenkamp/AppData/Local/Programs/MiKTeX 2.9/fonts/tfm/jknappen/ec/ecrm1440.tfm" 993062128 3168 3bd7b08ba4330af81521911744311212 ""
  "C:/Users/Lennart Holzenkamp/AppData/Local/Programs/MiKTeX 2.9/fonts/tfm/jknappen/ec/ecrm1728.tfm" 993062128 3168 11457c8185ce67fb79662ba8b03d6db1 ""
  "C:/Users/Lennart Holzenkamp/AppData/Local/Programs/MiKTeX 2.9/fonts/tfm/jknappen/ec/ecrm2074.tfm" 993062130 3184 b2541675eba9fa86d240ec0ecc913558 ""
  "C:/Users/Lennart Holzenkamp/AppData/Local/Programs/MiKTeX 2.9/fonts/tfm/jknappen/ec/ecti1200.tfm" 993062324 2832 28bbd97ca29f46e76c87a158a9915203 ""
  "C:/Users/Lennart Holzenkamp/AppData/Local/Programs/MiKTeX 2.9/fonts/tfm/jknappen/ec/tcrm1200.tfm" 993062508 1444 95ffe0f19b974d50849790c8225c7ef7 ""
  "C:/Users/Lennart Holzenkamp/AppData/Local/Programs/MiKTeX 2.9/fonts/tfm/public/cm/cmmi12.tfm" 1136768653 1524 4414a8315f39513458b80dfc63bff03a ""
  "C:/Users/Lennart Holzenkamp/AppData/Local/Programs/MiKTeX 2.9/fonts/tfm/public/cm/cmmi6.tfm" 1136768653 1512 f21f83efb36853c0b70002322c1ab3ad ""
  "C:/Users/Lennart Holzenkamp/AppData/Local/Programs/MiKTeX 2.9/fonts/tfm/public/cm/cmmi8.tfm" 1136768653 1520 eccf95517727cb11801f4f1aee3a21b4 ""
  "C:/Users/Lennart Holzenkamp/AppData/Local/Programs/MiKTeX 2.9/fonts/tfm/public/cm/cmr12.tfm" 1136768653 1288 655e228510b4c2a1abe905c368440826 ""
  "C:/Users/Lennart Holzenkamp/AppData/Local/Programs/MiKTeX 2.9/fonts/tfm/public/cm/cmr6.tfm" 1136768653 1300 b62933e007d01cfd073f79b963c01526 ""
  "C:/Users/Lennart Holzenkamp/AppData/Local/Programs/MiKTeX 2.9/fonts/tfm/public/cm/cmr8.tfm" 1136768653 1292 21c1c5bfeaebccffdb478fd231a0997d ""
  "C:/Users/Lennart Holzenkamp/AppData/Local/Programs/MiKTeX 2.9/fonts/tfm/public/cm/cmsy10.tfm" 1136768653 1124 6c73e740cf17375f03eec0ee63599741 ""
  "C:/Users/Lennart Holzenkamp/AppData/Local/Programs/MiKTeX 2.9/fonts/tfm/public/cm/cmsy6.tfm" 1136768653 1116 933a60c408fc0a863a92debe84b2d294 ""
  "C:/Users/Lennart Holzenkamp/AppData/Local/Programs/MiKTeX 2.9/fonts/tfm/public/cm/cmsy8.tfm" 1136768653 1120 8b7d695260f3cff42e636090a8002094 ""
  "C:/Users/Lennart Holzenkamp/AppData/Local/Programs/MiKTeX 2.9/fonts/type1/public/amsfonts/cm/cmsy10.pfb" 1247596667 32569 5e5ddc8df908dea60932f3c484a54c0d ""
  "C:/Users/Lennart Holzenkamp/AppData/Local/Programs/MiKTeX 2.9/tex/generic/babel/babel.def" 1617811115 118828 e7cf64b6a1b226a3cd49b4c1172c4b13 ""
  "C:/Users/Lennart Holzenkamp/AppData/Local/Programs/MiKTeX 2.9/tex/generic/babel/babel.sty" 1617811115 37894 d84f4ab817fadc5ae6285aa425a379d2 ""
  "C:/Users/Lennart Holzenkamp/AppData/Local/Programs/MiKTeX 2.9/tex/generic/babel/txtbabel.def" 1617811115 5230 84624d139fa443f96294434bccf82f8c ""
  "C:/Users/Lennart Holzenkamp/AppData/Local/Programs/MiKTeX 2.9/tex/latex/arabi/bblopts.cfg" 1139965200 902 c30e5c373bc58bde21f8f63a3091626f ""
  "C:/Users/Lennart Holzenkamp/AppData/Local/Programs/MiKTeX 2.9/tex/latex/babel-english/english.ldf" 1496846498 7219 9ff5fdcc865b01beca2b0fe4a46231d4 ""
  "C:/Users/Lennart Holzenkamp/AppData/Local/Programs/MiKTeX 2.9/tex/latex/base/article.cls" 1610124346 20145 aad8c3dd3bc36e260347b84002182bc2 ""
  "C:/Users/Lennart Holzenkamp/AppData/Local/Programs/MiKTeX 2.9/tex/latex/base/fontenc.sty" 1610124346 4947 8cb7717f0cc771eca0fda15160c7fee9 ""
  "C:/Users/Lennart Holzenkamp/AppData/Local/Programs/MiKTeX 2.9/tex/latex/base/inputenc.sty" 1610124346 5050 0d3b77275060ca09a40635b830c3c904 ""
  "C:/Users/Lennart Holzenkamp/AppData/Local/Programs/MiKTeX 2.9/tex/latex/base/size12.clo" 1610124346 8450 6fd3588c0e9d06f6f56c6cf4f7246466 ""
  "C:/Users/Lennart Holzenkamp/AppData/Local/Programs/MiKTeX 2.9/tex/latex/l3backend/l3backend-pdftex.def" 1616090134 27164 3d5f7887a89df4eb2f6e86ba26ef3254 ""
  "C:/Users/Lennart Holzenkamp/AppData/Local/Programs/MiKTeX 2.9/tex/latex/latex-tools/array.sty" 1602847617 13051 9a7bbb9e485cd81cdcc1d56212b088ff ""
  "C:/Users/Lennart Holzenkamp/AppData/Local/Programs/MiKTeX 2.9/tex/latex/latex-tools/tabularx.sty" 1602847617 7377 4ba718200276533b3a293c311a9349e0 ""
  "algorithm-specifications.aux" 1653933119 2242 e8f42e9e498e409a755ff2f17f0d013d "pdflatex"
  "algorithm-specifications.tex" 1653933115 9366 897cd9374ab591f0f56dde3f7cd93668 ""
  "c:/Users/Lennart Holzenkamp/Documents/dev/uni/spp/oc-dfg-clustering/documentation/02-algorithm-specification/algorithm-specifications.aux" 1653933119 2242 e8f42e9e498e409a755ff2f17f0d013d ""
  "c:/Users/Lennart Holzenkamp/Documents/dev/uni/spp/oc-dfg-clustering/documentation/02-algorithm-specification/algorithm-specifications.tex" 1653933115 9366 897cd9374ab591f0f56dde3f7cd93668 ""
  (generated)
  "c:/Users/Lennart Holzenkamp/Documents/dev/uni/spp/oc-dfg-clustering/documentation/02-algorithm-specification/algorithm-specifications.log"
  "c:/Users/Lennart Holzenkamp/Documents/dev/uni/spp/oc-dfg-clustering/documentation/02-algorithm-specification/algorithm-specifications.pdf"
  "algorithm-specifications.pdf"
  "algorithm-specifications.aux"
  "algorithm-specifications.log"
