\relax 
\providecommand\babel@aux[2]{}
\@nameuse{bbl@beforestart}
\babel@aux{english}{}
\@writefile{toc}{\contentsline {subsection}{\numberline {0.1}Input}{1}{}\protected@file@percent }
\@writefile{toc}{\contentsline {subsubsection}{\numberline {0.1.1}OCEL-data}{1}{}\protected@file@percent }
\@writefile{toc}{\contentsline {subsubsection}{\numberline {0.1.2}Selection of the event assignment mode}{1}{}\protected@file@percent }
\@writefile{toc}{\contentsline {subsubsection}{\numberline {0.1.3}Selection of the object-type to use for clustering}{2}{}\protected@file@percent }
\@writefile{toc}{\contentsline {subsubsection}{\numberline {0.1.4}Definition of attribute weights for clustering (optional)}{2}{}\protected@file@percent }
\@writefile{toc}{\contentsline {subsubsection}{\numberline {0.1.5}Selection of clustering techniques (optional)}{2}{}\protected@file@percent }
\@writefile{toc}{\contentsline {subsubsection}{\numberline {0.1.6}OCEL-Output file type (optional)}{3}{}\protected@file@percent }
\@writefile{toc}{\contentsline {subsubsection}{\numberline {0.1.7}Graph-Output file type (optional)}{3}{}\protected@file@percent }
\@writefile{toc}{\contentsline {subsubsection}{\numberline {0.1.8}Definition of minimum number of edges and nodes (optional)}{3}{}\protected@file@percent }
\@writefile{toc}{\contentsline {subsection}{\numberline {0.2}Algorithm}{3}{}\protected@file@percent }
\@writefile{toc}{\contentsline {subsubsection}{\numberline {0.2.1}Reading and validating inputs}{3}{}\protected@file@percent }
\@writefile{toc}{\contentsline {subsubsection}{\numberline {0.2.2}Retrieving OCEL-information}{3}{}\protected@file@percent }
\@writefile{toc}{\contentsline {subsubsection}{\numberline {0.2.3}Creating object table}{4}{}\protected@file@percent }
\@writefile{toc}{\contentsline {subsubsection}{\numberline {0.2.4}Calculate distances}{4}{}\protected@file@percent }
\@writefile{toc}{\contentsline {subsubsection}{\numberline {0.2.5}Object-Clustering}{4}{}\protected@file@percent }
\@writefile{toc}{\contentsline {subsubsection}{\numberline {0.2.6}Event assignment}{5}{}\protected@file@percent }
\@writefile{toc}{\contentsline {subsubsection}{\numberline {0.2.7}Exporting}{5}{}\protected@file@percent }
\gdef \@abspage@last{5}
