<?xml version="1.0" encoding="UTF-8" standalone="no"?>
<!DOCTYPE svg PUBLIC "-//W3C//DTD SVG 1.1//EN"
 "http://www.w3.org/Graphics/SVG/1.1/DTD/svg11.dtd">
<!-- Generated by graphviz version 2.43.0 (0)
 -->
<!-- Title: media_framework_automatic_tests.cpp Pages: 1 -->
<svg width="2531pt" height="643pt"
 viewBox="0.00 0.00 2531.00 643.00" xmlns="http://www.w3.org/2000/svg" xmlns:xlink="http://www.w3.org/1999/xlink">
<g id="graph0" class="graph" transform="scale(1 1) rotate(0) translate(4 639)">
<title>media_framework_automatic_tests.cpp</title>
<polygon fill="white" stroke="transparent" points="-4,4 -4,-639 2527,-639 2527,4 -4,4"/>
<!-- Node1 -->
<g id="node1" class="node">
<title>Node1</title>
<g id="a_node1"><a xlink:title="MediaServer Media framework automatic tests.">
<polygon fill="#bfbfbf" stroke="black" points="2088.5,-604.5 2088.5,-634.5 2249.5,-634.5 2249.5,-604.5 2088.5,-604.5"/>
<text text-anchor="start" x="2096.5" y="-622.5" font-family="Helvetica,sans-Serif" font-size="10.00">media_framework_automatic</text>
<text text-anchor="middle" x="2169" y="-611.5" font-family="Helvetica,sans-Serif" font-size="10.00">_tests.cpp</text>
</a>
</g>
</g>
<!-- Node2 -->
<g id="node2" class="node">
<title>Node2</title>
<g id="a_node2"><a xlink:href="media__framework_8hpp.html" target="_top" xlink:title=" ">
<polygon fill="white" stroke="black" points="1907.5,-548.5 1907.5,-567.5 2034.5,-567.5 2034.5,-548.5 1907.5,-548.5"/>
<text text-anchor="middle" x="1971" y="-555.5" font-family="Helvetica,sans-Serif" font-size="10.00">media_framework.hpp</text>
</a>
</g>
</g>
<!-- Node1&#45;&gt;Node2 -->
<g id="edge1" class="edge">
<title>Node1&#45;&gt;Node2</title>
<path fill="none" stroke="midnightblue" d="M2122.33,-604.47C2087.87,-594.12 2041.54,-580.2 2009.26,-570.5"/>
<polygon fill="midnightblue" stroke="midnightblue" points="2009.89,-567.03 1999.31,-567.51 2007.88,-573.74 2009.89,-567.03"/>
</g>
<!-- Node3 -->
<g id="node3" class="node">
<title>Node3</title>
<g id="a_node3"><a xlink:href="Prelude_8hpp.html" target="_top" xlink:title="Includes call C++ Wrappers for Gstreamer.">
<polygon fill="white" stroke="black" points="1842,-492.5 1842,-511.5 1916,-511.5 1916,-492.5 1842,-492.5"/>
<text text-anchor="middle" x="1879" y="-499.5" font-family="Helvetica,sans-Serif" font-size="10.00">Prelude.hpp</text>
</a>
</g>
</g>
<!-- Node1&#45;&gt;Node3 -->
<g id="edge32" class="edge">
<title>Node1&#45;&gt;Node3</title>
<path fill="none" stroke="midnightblue" d="M2088.25,-612.71C2018.75,-606.1 1925.46,-592.84 1898,-568 1885.08,-556.31 1880.75,-536.37 1879.4,-521.65"/>
<polygon fill="midnightblue" stroke="midnightblue" points="1882.89,-521.43 1878.85,-511.63 1875.9,-521.81 1882.89,-521.43"/>
</g>
<!-- Node28 -->
<g id="node18" class="node">
<title>Node28</title>
<g id="a_node18"><a xlink:title=" ">
<polygon fill="white" stroke="#bfbfbf" points="2016,-0.5 2016,-19.5 2076,-19.5 2076,-0.5 2016,-0.5"/>
<text text-anchor="middle" x="2046" y="-7.5" font-family="Helvetica,sans-Serif" font-size="10.00">iostream</text>
</a>
</g>
</g>
<!-- Node1&#45;&gt;Node28 -->
<g id="edge31" class="edge">
<title>Node1&#45;&gt;Node28</title>
<path fill="none" stroke="midnightblue" d="M2153.91,-604.4C2133.88,-584.08 2101,-544.42 2101,-503 2101,-503 2101,-503 2101,-137.5 2101,-95.22 2074.84,-51.09 2058.6,-27.77"/>
<polygon fill="midnightblue" stroke="midnightblue" points="2061.43,-25.7 2052.74,-19.64 2055.75,-29.8 2061.43,-25.7"/>
</g>
<!-- Node29 -->
<g id="node19" class="node">
<title>Node29</title>
<g id="a_node19"><a xlink:title=" ">
<polygon fill="white" stroke="#bfbfbf" points="2104,-0.5 2104,-19.5 2154,-19.5 2154,-0.5 2104,-0.5"/>
<text text-anchor="middle" x="2129" y="-7.5" font-family="Helvetica,sans-Serif" font-size="10.00">stdio.h</text>
</a>
</g>
</g>
<!-- Node1&#45;&gt;Node29 -->
<g id="edge33" class="edge">
<title>Node1&#45;&gt;Node29</title>
<path fill="none" stroke="midnightblue" d="M2162.78,-604.22C2154,-582.71 2139,-540.5 2139,-503 2139,-503 2139,-503 2139,-137.5 2139,-99.08 2134.36,-54.31 2131.4,-29.66"/>
<polygon fill="midnightblue" stroke="midnightblue" points="2134.85,-29.06 2130.15,-19.57 2127.91,-29.93 2134.85,-29.06"/>
</g>
<!-- Node30 -->
<g id="node20" class="node">
<title>Node30</title>
<g id="a_node20"><a xlink:title=" ">
<polygon fill="white" stroke="#bfbfbf" points="2167.5,-548.5 2167.5,-567.5 2232.5,-567.5 2232.5,-548.5 2167.5,-548.5"/>
<text text-anchor="middle" x="2200" y="-555.5" font-family="Helvetica,sans-Serif" font-size="10.00">stdexcept</text>
</a>
</g>
</g>
<!-- Node1&#45;&gt;Node30 -->
<g id="edge34" class="edge">
<title>Node1&#45;&gt;Node30</title>
<path fill="none" stroke="midnightblue" d="M2176.35,-604.4C2180.67,-596.11 2186.17,-585.55 2190.77,-576.71"/>
<polygon fill="midnightblue" stroke="midnightblue" points="2193.97,-578.14 2195.49,-567.66 2187.76,-574.91 2193.97,-578.14"/>
</g>
<!-- Node31 -->
<g id="node21" class="node">
<title>Node31</title>
<g id="a_node21"><a xlink:title=" ">
<polygon fill="white" stroke="#bfbfbf" points="2250.5,-548.5 2250.5,-567.5 2315.5,-567.5 2315.5,-548.5 2250.5,-548.5"/>
<text text-anchor="middle" x="2283" y="-555.5" font-family="Helvetica,sans-Serif" font-size="10.00">exception</text>
</a>
</g>
</g>
<!-- Node1&#45;&gt;Node31 -->
<g id="edge35" class="edge">
<title>Node1&#45;&gt;Node31</title>
<path fill="none" stroke="midnightblue" d="M2196.02,-604.4C2214.63,-594.68 2239.21,-581.86 2257.49,-572.31"/>
<polygon fill="midnightblue" stroke="midnightblue" points="2259.17,-575.39 2266.41,-567.66 2255.93,-569.18 2259.17,-575.39"/>
</g>
<!-- Node32 -->
<g id="node22" class="node">
<title>Node32</title>
<g id="a_node22"><a xlink:title=" ">
<polygon fill="white" stroke="#bfbfbf" points="2333.5,-548.5 2333.5,-567.5 2388.5,-567.5 2388.5,-548.5 2333.5,-548.5"/>
<text text-anchor="middle" x="2361" y="-555.5" font-family="Helvetica,sans-Serif" font-size="10.00">fstream</text>
</a>
</g>
</g>
<!-- Node1&#45;&gt;Node32 -->
<g id="edge36" class="edge">
<title>Node1&#45;&gt;Node32</title>
<path fill="none" stroke="midnightblue" d="M2214.5,-604.4C2247.82,-594.07 2292.49,-580.23 2323.71,-570.56"/>
<polygon fill="midnightblue" stroke="midnightblue" points="2324.83,-573.87 2333.34,-567.57 2322.75,-567.19 2324.83,-573.87"/>
</g>
<!-- Node33 -->
<g id="node23" class="node">
<title>Node33</title>
<g id="a_node23"><a xlink:href="gtest_8h_source.html" target="_top" xlink:title=" ">
<polygon fill="white" stroke="black" points="1276,-436.5 1276,-455.5 1354,-455.5 1354,-436.5 1276,-436.5"/>
<text text-anchor="middle" x="1315" y="-443.5" font-family="Helvetica,sans-Serif" font-size="10.00">gtest/gtest.h</text>
</a>
</g>
</g>
<!-- Node1&#45;&gt;Node33 -->
<g id="edge37" class="edge">
<title>Node1&#45;&gt;Node33</title>
<path fill="none" stroke="midnightblue" d="M2144.92,-604.28C2092.88,-573.84 1970.9,-504.13 1925,-492 1819.4,-464.09 1489.61,-451.98 1364.13,-448.3"/>
<polygon fill="midnightblue" stroke="midnightblue" points="1364.14,-444.8 1354.05,-448.01 1363.94,-451.79 1364.14,-444.8"/>
</g>
<!-- Node82 -->
<g id="node49" class="node">
<title>Node82</title>
<g id="a_node49"><a xlink:title=" ">
<polygon fill="white" stroke="#bfbfbf" points="2407,-548.5 2407,-567.5 2457,-567.5 2457,-548.5 2407,-548.5"/>
<text text-anchor="middle" x="2432" y="-555.5" font-family="Helvetica,sans-Serif" font-size="10.00">chrono</text>
</a>
</g>
</g>
<!-- Node1&#45;&gt;Node82 -->
<g id="edge110" class="edge">
<title>Node1&#45;&gt;Node82</title>
<path fill="none" stroke="midnightblue" d="M2236.31,-604.43C2279.61,-595.2 2337.32,-582.56 2396.83,-568.21"/>
<polygon fill="midnightblue" stroke="midnightblue" points="2397.88,-571.56 2406.78,-565.8 2396.24,-564.76 2397.88,-571.56"/>
</g>
<!-- Node83 -->
<g id="node50" class="node">
<title>Node83</title>
<g id="a_node50"><a xlink:title=" ">
<polygon fill="white" stroke="#bfbfbf" points="2475,-548.5 2475,-567.5 2523,-567.5 2523,-548.5 2475,-548.5"/>
<text text-anchor="middle" x="2499" y="-555.5" font-family="Helvetica,sans-Serif" font-size="10.00">thread</text>
</a>
</g>
</g>
<!-- Node1&#45;&gt;Node83 -->
<g id="edge111" class="edge">
<title>Node1&#45;&gt;Node83</title>
<path fill="none" stroke="midnightblue" d="M2249.77,-606.95C2307.28,-598.22 2386.53,-585.17 2464.87,-568.08"/>
<polygon fill="midnightblue" stroke="midnightblue" points="2465.91,-571.43 2474.92,-565.86 2464.4,-564.6 2465.91,-571.43"/>
</g>
<!-- Node2&#45;&gt;Node3 -->
<g id="edge2" class="edge">
<title>Node2&#45;&gt;Node3</title>
<path fill="none" stroke="midnightblue" d="M1956.22,-548.32C1941.73,-539.82 1919.43,-526.73 1902.51,-516.8"/>
<polygon fill="midnightblue" stroke="midnightblue" points="1904.14,-513.7 1893.74,-511.65 1900.6,-519.74 1904.14,-513.7"/>
</g>
<!-- Node4 -->
<g id="node4" class="node">
<title>Node4</title>
<g id="a_node4"><a xlink:href="core_8hpp_source.html" target="_top" xlink:title=" ">
<polygon fill="white" stroke="black" points="267.5,-436.5 267.5,-455.5 326.5,-455.5 326.5,-436.5 267.5,-436.5"/>
<text text-anchor="middle" x="297" y="-443.5" font-family="Helvetica,sans-Serif" font-size="10.00">core.hpp</text>
</a>
</g>
</g>
<!-- Node3&#45;&gt;Node4 -->
<g id="edge3" class="edge">
<title>Node3&#45;&gt;Node4</title>
<path fill="none" stroke="midnightblue" d="M1841.84,-499.73C1628.11,-492.44 557.23,-455.88 336.74,-448.36"/>
<polygon fill="midnightblue" stroke="midnightblue" points="336.71,-444.85 326.6,-448.01 336.47,-451.85 336.71,-444.85"/>
</g>
<!-- Node5 -->
<g id="node5" class="node">
<title>Node5</title>
<g id="a_node5"><a xlink:href="Bin_8hpp_source.html" target="_top" xlink:title=" ">
<polygon fill="white" stroke="red" points="249.5,-324.5 249.5,-343.5 326.5,-343.5 326.5,-324.5 249.5,-324.5"/>
<text text-anchor="middle" x="288" y="-331.5" font-family="Helvetica,sans-Serif" font-size="10.00">core/Bin.hpp</text>
</a>
</g>
</g>
<!-- Node4&#45;&gt;Node5 -->
<g id="edge4" class="edge">
<title>Node4&#45;&gt;Node5</title>
<path fill="none" stroke="midnightblue" d="M291.62,-436.44C286.44,-427.68 278.99,-413.47 276,-400 272.54,-384.42 276.38,-366.59 280.61,-353.55"/>
<polygon fill="midnightblue" stroke="midnightblue" points="284,-354.47 284.1,-343.87 277.42,-352.09 284,-354.47"/>
</g>
<!-- Node6 -->
<g id="node6" class="node">
<title>Node6</title>
<g id="a_node6"><a xlink:href="Element_8hpp_source.html" target="_top" xlink:title=" ">
<polygon fill="white" stroke="red" points="237,-263 237,-282 339,-282 339,-263 237,-263"/>
<text text-anchor="middle" x="288" y="-270" font-family="Helvetica,sans-Serif" font-size="10.00">core/Element.hpp</text>
</a>
</g>
</g>
<!-- Node4&#45;&gt;Node6 -->
<g id="edge21" class="edge">
<title>Node4&#45;&gt;Node6</title>
<path fill="none" stroke="midnightblue" d="M290.11,-436.5C277.18,-419.92 249.72,-381.62 240,-344 237.78,-335.39 236.7,-332.25 240,-324 245.59,-310 257.12,-297.65 267.48,-288.68"/>
<polygon fill="midnightblue" stroke="midnightblue" points="269.85,-291.26 275.4,-282.23 265.43,-285.83 269.85,-291.26"/>
</g>
<!-- Node7 -->
<g id="node7" class="node">
<title>Node7</title>
<g id="a_node7"><a xlink:href="Bus_8hpp_source.html" target="_top" xlink:title=" ">
<polygon fill="white" stroke="red" points="269,-196 269,-215 349,-215 349,-196 269,-196"/>
<text text-anchor="middle" x="309" y="-203" font-family="Helvetica,sans-Serif" font-size="10.00">core/Bus.hpp</text>
</a>
</g>
</g>
<!-- Node4&#45;&gt;Node7 -->
<g id="edge18" class="edge">
<title>Node4&#45;&gt;Node7</title>
<path fill="none" stroke="midnightblue" d="M326.91,-443.22C380.55,-438.15 491.11,-418.69 530,-344 568.7,-269.68 435.39,-230.89 358.95,-215.14"/>
<polygon fill="midnightblue" stroke="midnightblue" points="359.51,-211.69 349.02,-213.16 358.14,-218.55 359.51,-211.69"/>
</g>
<!-- Node8 -->
<g id="node8" class="node">
<title>Node8</title>
<g id="a_node8"><a xlink:href="Clock_8hpp_source.html" target="_top" xlink:title=" ">
<polygon fill="white" stroke="black" points="507.5,-129 507.5,-148 596.5,-148 596.5,-129 507.5,-129"/>
<text text-anchor="middle" x="552" y="-136" font-family="Helvetica,sans-Serif" font-size="10.00">core/Clock.hpp</text>
</a>
</g>
</g>
<!-- Node4&#45;&gt;Node8 -->
<g id="edge20" class="edge">
<title>Node4&#45;&gt;Node8</title>
<path fill="none" stroke="midnightblue" d="M326.62,-442.66C367.86,-438.49 444.12,-427.49 503,-400 545.77,-380.03 587,-382.21 587,-335 587,-335 587,-335 587,-271.5 587,-229.6 570.32,-182.63 559.99,-157.57"/>
<polygon fill="midnightblue" stroke="midnightblue" points="563.15,-156.08 556.01,-148.25 556.71,-158.82 563.15,-156.08"/>
</g>
<!-- Node10 -->
<g id="node10" class="node">
<title>Node10</title>
<g id="a_node10"><a xlink:href="Message_8hpp_source.html" target="_top" xlink:title=" ">
<polygon fill="white" stroke="red" points="162.5,-129 162.5,-148 267.5,-148 267.5,-129 162.5,-129"/>
<text text-anchor="middle" x="215" y="-136" font-family="Helvetica,sans-Serif" font-size="10.00">core/Message.hpp</text>
</a>
</g>
</g>
<!-- Node4&#45;&gt;Node10 -->
<g id="edge25" class="edge">
<title>Node4&#45;&gt;Node10</title>
<path fill="none" stroke="midnightblue" d="M267.31,-438.14C222.56,-425.83 143,-395.46 143,-335 143,-335 143,-335 143,-271.5 143,-234.31 143.54,-222.29 162,-190 170.04,-175.93 183.22,-163.35 194.42,-154.26"/>
<polygon fill="midnightblue" stroke="midnightblue" points="196.72,-156.92 202.49,-148.03 192.44,-151.38 196.72,-156.92"/>
</g>
<!-- Node12 -->
<g id="node11" class="node">
<title>Node12</title>
<g id="a_node11"><a xlink:href="Object_8hpp_source.html" target="_top" xlink:title=" ">
<polygon fill="white" stroke="red" points="312.5,-129 312.5,-148 405.5,-148 405.5,-129 312.5,-129"/>
<text text-anchor="middle" x="359" y="-136" font-family="Helvetica,sans-Serif" font-size="10.00">core/Object.hpp</text>
</a>
</g>
</g>
<!-- Node4&#45;&gt;Node12 -->
<g id="edge26" class="edge">
<title>Node4&#45;&gt;Node12</title>
<path fill="none" stroke="midnightblue" d="M326.62,-440.18C349.63,-434.72 380.04,-423.33 395,-400 409.19,-377.88 383.37,-369.23 376,-344 365.91,-309.47 361.16,-202.15 359.6,-158.38"/>
<polygon fill="midnightblue" stroke="midnightblue" points="363.1,-158.14 359.26,-148.26 356.1,-158.38 363.1,-158.14"/>
</g>
<!-- Node16 -->
<g id="node13" class="node">
<title>Node16</title>
<g id="a_node13"><a xlink:href="Pad_8hpp_source.html" target="_top" xlink:title=" ">
<polygon fill="white" stroke="red" points="171.5,-196 171.5,-215 250.5,-215 250.5,-196 171.5,-196"/>
<text text-anchor="middle" x="211" y="-203" font-family="Helvetica,sans-Serif" font-size="10.00">core/Pad.hpp</text>
</a>
</g>
</g>
<!-- Node4&#45;&gt;Node16 -->
<g id="edge27" class="edge">
<title>Node4&#45;&gt;Node16</title>
<path fill="none" stroke="midnightblue" d="M285.16,-436.27C274.76,-428 259.93,-414.71 251,-400 216.63,-343.37 211.35,-262.08 210.83,-225.55"/>
<polygon fill="midnightblue" stroke="midnightblue" points="214.33,-225.34 210.8,-215.35 207.33,-225.36 214.33,-225.34"/>
</g>
<!-- Node17 -->
<g id="node14" class="node">
<title>Node17</title>
<g id="a_node14"><a xlink:href="Caps_8hpp_source.html" target="_top" xlink:title=" ">
<polygon fill="white" stroke="red" points="0,-129 0,-148 86,-148 86,-129 0,-129"/>
<text text-anchor="middle" x="43" y="-136" font-family="Helvetica,sans-Serif" font-size="10.00">core/Caps.hpp</text>
</a>
</g>
</g>
<!-- Node4&#45;&gt;Node17 -->
<g id="edge19" class="edge">
<title>Node4&#45;&gt;Node17</title>
<path fill="none" stroke="midnightblue" d="M267.33,-444.96C201.9,-443.15 51,-428.8 51,-335 51,-335 51,-335 51,-271.5 51,-231.08 47.22,-183.83 44.85,-158.26"/>
<polygon fill="midnightblue" stroke="midnightblue" points="48.32,-157.76 43.89,-148.14 41.35,-158.43 48.32,-157.76"/>
</g>
<!-- Node18 -->
<g id="node15" class="node">
<title>Node18</title>
<g id="a_node15"><a xlink:href="Structure_8hpp_source.html" target="_top" xlink:title=" ">
<polygon fill="white" stroke="red" points="71,-62 71,-81 177,-81 177,-62 71,-62"/>
<text text-anchor="middle" x="124" y="-69" font-family="Helvetica,sans-Serif" font-size="10.00">core/Structure.hpp</text>
</a>
</g>
</g>
<!-- Node4&#45;&gt;Node18 -->
<g id="edge30" class="edge">
<title>Node4&#45;&gt;Node18</title>
<path fill="none" stroke="midnightblue" d="M267.42,-441.7C213.56,-433.88 105,-408.95 105,-335 105,-335 105,-335 105,-271.5 105,-205.08 115.62,-126.76 120.98,-91.45"/>
<polygon fill="midnightblue" stroke="midnightblue" points="124.49,-91.62 122.57,-81.2 117.58,-90.54 124.49,-91.62"/>
</g>
<!-- Node25 -->
<g id="node16" class="node">
<title>Node25</title>
<g id="a_node16"><a xlink:href="ElementFactory_8hpp_source.html" target="_top" xlink:title=" ">
<polygon fill="white" stroke="black" points="385,-324.5 385,-343.5 521,-343.5 521,-324.5 385,-324.5"/>
<text text-anchor="middle" x="453" y="-331.5" font-family="Helvetica,sans-Serif" font-size="10.00">core/ElementFactory.hpp</text>
</a>
</g>
</g>
<!-- Node4&#45;&gt;Node25 -->
<g id="edge22" class="edge">
<title>Node4&#45;&gt;Node25</title>
<path fill="none" stroke="midnightblue" d="M326.51,-442.25C356.08,-438 401.09,-427.21 429,-400 441.5,-387.81 447.54,-368.54 450.43,-354.14"/>
<polygon fill="midnightblue" stroke="midnightblue" points="453.95,-354.3 452.13,-343.87 447.05,-353.16 453.95,-354.3"/>
</g>
<!-- Node26 -->
<g id="node17" class="node">
<title>Node26</title>
<g id="a_node17"><a xlink:href="Pipeline_8hpp_source.html" target="_top" xlink:title=" ">
<polygon fill="white" stroke="red" points="285.5,-380.5 285.5,-399.5 386.5,-399.5 386.5,-380.5 285.5,-380.5"/>
<text text-anchor="middle" x="336" y="-387.5" font-family="Helvetica,sans-Serif" font-size="10.00">core/Pipeline.hpp</text>
</a>
</g>
</g>
<!-- Node4&#45;&gt;Node26 -->
<g id="edge28" class="edge">
<title>Node4&#45;&gt;Node26</title>
<path fill="none" stroke="midnightblue" d="M303.44,-436.08C308.95,-428.46 317.03,-417.26 323.76,-407.94"/>
<polygon fill="midnightblue" stroke="midnightblue" points="326.66,-409.91 329.68,-399.75 320.99,-405.81 326.66,-409.91"/>
</g>
<!-- Node5&#45;&gt;Node6 -->
<g id="edge5" class="edge">
<title>Node5&#45;&gt;Node6</title>
<path fill="none" stroke="midnightblue" d="M288,-324.48C288,-316.08 288,-302.98 288,-292.16"/>
<polygon fill="midnightblue" stroke="midnightblue" points="291.5,-292.01 288,-282.01 284.5,-292.01 291.5,-292.01"/>
</g>
<!-- Node6&#45;&gt;Node7 -->
<g id="edge6" class="edge">
<title>Node6&#45;&gt;Node7</title>
<path fill="none" stroke="midnightblue" d="M290.83,-262.73C293.95,-253.09 299.05,-237.3 303.05,-224.91"/>
<polygon fill="midnightblue" stroke="midnightblue" points="306.47,-225.72 306.21,-215.13 299.81,-223.57 306.47,-225.72"/>
</g>
<!-- Node6&#45;&gt;Node16 -->
<g id="edge12" class="edge">
<title>Node6&#45;&gt;Node16</title>
<path fill="none" stroke="midnightblue" d="M277.62,-262.73C265.15,-252.21 244.03,-234.38 228.91,-221.62"/>
<polygon fill="midnightblue" stroke="midnightblue" points="231.12,-218.9 221.22,-215.13 226.6,-224.25 231.12,-218.9"/>
</g>
<!-- Node7&#45;&gt;Node8 -->
<g id="edge7" class="edge">
<title>Node7&#45;&gt;Node8</title>
<path fill="none" stroke="midnightblue" d="M341.02,-195.94C384.45,-184.32 462.12,-163.54 510.14,-150.7"/>
<polygon fill="midnightblue" stroke="midnightblue" points="511.16,-154.05 519.91,-148.08 509.35,-147.29 511.16,-154.05"/>
</g>
<!-- Node7&#45;&gt;Node10 -->
<g id="edge9" class="edge">
<title>Node7&#45;&gt;Node10</title>
<path fill="none" stroke="midnightblue" d="M296.32,-195.73C280.82,-185.01 254.36,-166.72 235.84,-153.91"/>
<polygon fill="midnightblue" stroke="midnightblue" points="237.69,-150.94 227.48,-148.13 233.71,-156.69 237.69,-150.94"/>
</g>
<!-- Node7&#45;&gt;Node12 -->
<g id="edge10" class="edge">
<title>Node7&#45;&gt;Node12</title>
<path fill="none" stroke="midnightblue" d="M315.74,-195.73C323.54,-185.6 336.55,-168.69 346.26,-156.06"/>
<polygon fill="midnightblue" stroke="midnightblue" points="349.04,-158.19 352.36,-148.13 343.49,-153.92 349.04,-158.19"/>
</g>
<!-- Node9 -->
<g id="node9" class="node">
<title>Node9</title>
<g id="a_node9"><a xlink:title=" ">
<polygon fill="white" stroke="#bfbfbf" points="1098,-0.5 1098,-19.5 1148,-19.5 1148,-0.5 1098,-0.5"/>
<text text-anchor="middle" x="1123" y="-7.5" font-family="Helvetica,sans-Serif" font-size="10.00">cstdint</text>
</a>
</g>
</g>
<!-- Node8&#45;&gt;Node9 -->
<g id="edge8" class="edge">
<title>Node8&#45;&gt;Node9</title>
<path fill="none" stroke="midnightblue" d="M592.26,-128.96C681.37,-109.98 901.97,-62.62 1086,-20 1086.72,-19.83 1087.46,-19.66 1088.19,-19.49"/>
<polygon fill="midnightblue" stroke="midnightblue" points="1089.02,-22.89 1097.94,-17.17 1087.4,-16.08 1089.02,-22.89"/>
</g>
<!-- Node14 -->
<g id="node12" class="node">
<title>Node14</title>
<g id="a_node12"><a xlink:title=" ">
<polygon fill="white" stroke="#bfbfbf" points="603,-0.5 603,-19.5 647,-19.5 647,-0.5 603,-0.5"/>
<text text-anchor="middle" x="625" y="-7.5" font-family="Helvetica,sans-Serif" font-size="10.00">string</text>
</a>
</g>
</g>
<!-- Node12&#45;&gt;Node14 -->
<g id="edge11" class="edge">
<title>Node12&#45;&gt;Node14</title>
<path fill="none" stroke="midnightblue" d="M366.25,-128.9C380.76,-112.25 415.19,-75.49 452,-56 497.56,-31.87 556.83,-20.11 592.84,-14.83"/>
<polygon fill="midnightblue" stroke="midnightblue" points="593.36,-18.29 602.78,-13.44 592.4,-11.35 593.36,-18.29"/>
</g>
<!-- Node16&#45;&gt;Node12 -->
<g id="edge17" class="edge">
<title>Node16&#45;&gt;Node12</title>
<path fill="none" stroke="midnightblue" d="M230.65,-195.87C256.09,-184.7 300.6,-165.15 329.95,-152.26"/>
<polygon fill="midnightblue" stroke="midnightblue" points="331.52,-155.39 339.27,-148.17 328.7,-148.98 331.52,-155.39"/>
</g>
<!-- Node16&#45;&gt;Node17 -->
<g id="edge13" class="edge">
<title>Node16&#45;&gt;Node17</title>
<path fill="none" stroke="midnightblue" d="M188.69,-195.87C159.49,-184.57 108.12,-164.7 74.84,-151.82"/>
<polygon fill="midnightblue" stroke="midnightblue" points="75.72,-148.41 65.13,-148.06 73.2,-154.94 75.72,-148.41"/>
</g>
<!-- Node17&#45;&gt;Node14 -->
<g id="edge16" class="edge">
<title>Node17&#45;&gt;Node14</title>
<path fill="none" stroke="midnightblue" d="M42.06,-128.97C40.74,-112.1 40.53,-74.48 62,-56 102.31,-21.3 478.81,-13.09 592.59,-11.4"/>
<polygon fill="midnightblue" stroke="midnightblue" points="592.81,-14.9 602.76,-11.25 592.71,-7.9 592.81,-14.9"/>
</g>
<!-- Node17&#45;&gt;Node18 -->
<g id="edge14" class="edge">
<title>Node17&#45;&gt;Node18</title>
<path fill="none" stroke="midnightblue" d="M53.92,-128.73C67.04,-118.21 89.26,-100.38 105.16,-87.62"/>
<polygon fill="midnightblue" stroke="midnightblue" points="107.64,-90.12 113.25,-81.13 103.26,-84.66 107.64,-90.12"/>
</g>
<!-- Node18&#45;&gt;Node14 -->
<g id="edge15" class="edge">
<title>Node18&#45;&gt;Node14</title>
<path fill="none" stroke="midnightblue" d="M177.14,-64.19C281.11,-51.84 508.6,-24.82 592.81,-14.82"/>
<polygon fill="midnightblue" stroke="midnightblue" points="593.29,-18.29 602.81,-13.64 592.47,-11.34 593.29,-18.29"/>
</g>
<!-- Node25&#45;&gt;Node6 -->
<g id="edge23" class="edge">
<title>Node25&#45;&gt;Node6</title>
<path fill="none" stroke="midnightblue" d="M429.36,-324.48C401.06,-314.27 353.47,-297.11 321.41,-285.55"/>
<polygon fill="midnightblue" stroke="midnightblue" points="322.19,-282.11 311.6,-282.01 319.82,-288.69 322.19,-282.11"/>
</g>
<!-- Node25&#45;&gt;Node14 -->
<g id="edge24" class="edge">
<title>Node25&#45;&gt;Node14</title>
<path fill="none" stroke="midnightblue" d="M454.49,-324.44C457.91,-304.08 466,-251.1 466,-206.5 466,-206.5 466,-206.5 466,-137.5 466,-73.09 546.9,-36.2 593.28,-20.35"/>
<polygon fill="midnightblue" stroke="midnightblue" points="594.48,-23.64 602.89,-17.2 592.3,-16.99 594.48,-23.64"/>
</g>
<!-- Node26&#45;&gt;Node5 -->
<g id="edge29" class="edge">
<title>Node26&#45;&gt;Node5</title>
<path fill="none" stroke="midnightblue" d="M328.07,-380.08C321.15,-372.3 310.93,-360.8 302.55,-351.37"/>
<polygon fill="midnightblue" stroke="midnightblue" points="305.04,-348.9 295.78,-343.75 299.81,-353.55 305.04,-348.9"/>
</g>
<!-- Node34 -->
<g id="node24" class="node">
<title>Node34</title>
<g id="a_node24"><a xlink:title=" ">
<polygon fill="white" stroke="#bfbfbf" points="1981.5,-380.5 1981.5,-399.5 2034.5,-399.5 2034.5,-380.5 1981.5,-380.5"/>
<text text-anchor="middle" x="2008" y="-387.5" font-family="Helvetica,sans-Serif" font-size="10.00">cstddef</text>
</a>
</g>
</g>
<!-- Node33&#45;&gt;Node34 -->
<g id="edge38" class="edge">
<title>Node33&#45;&gt;Node34</title>
<path fill="none" stroke="midnightblue" d="M1354.16,-444.3C1455.8,-442.06 1736.2,-433.11 1967,-400 1968.3,-399.81 1969.62,-399.61 1970.95,-399.39"/>
<polygon fill="midnightblue" stroke="midnightblue" points="1972.01,-402.75 1981.2,-397.48 1970.72,-395.87 1972.01,-402.75"/>
</g>
<!-- Node35 -->
<g id="node25" class="node">
<title>Node35</title>
<g id="a_node25"><a xlink:title=" ">
<polygon fill="white" stroke="#bfbfbf" points="1714,-0.5 1714,-19.5 1758,-19.5 1758,-0.5 1714,-0.5"/>
<text text-anchor="middle" x="1736" y="-7.5" font-family="Helvetica,sans-Serif" font-size="10.00">limits</text>
</a>
</g>
</g>
<!-- Node33&#45;&gt;Node35 -->
<g id="edge39" class="edge">
<title>Node33&#45;&gt;Node35</title>
<path fill="none" stroke="midnightblue" d="M1354.2,-443.77C1457.05,-440.19 1732.67,-428.18 1819,-400 1907.85,-371 1987,-366.97 1987,-273.5 1987,-273.5 1987,-273.5 1987,-204.5 1987,-95.12 1835.64,-38.93 1768,-19.28"/>
<polygon fill="midnightblue" stroke="midnightblue" points="1768.85,-15.89 1758.27,-16.54 1766.95,-22.62 1768.85,-15.89"/>
</g>
<!-- Node36 -->
<g id="node26" class="node">
<title>Node36</title>
<g id="a_node26"><a xlink:title=" ">
<polygon fill="white" stroke="#bfbfbf" points="1920,-0.5 1920,-19.5 1978,-19.5 1978,-0.5 1920,-0.5"/>
<text text-anchor="middle" x="1949" y="-7.5" font-family="Helvetica,sans-Serif" font-size="10.00">memory</text>
</a>
</g>
</g>
<!-- Node33&#45;&gt;Node36 -->
<g id="edge40" class="edge">
<title>Node33&#45;&gt;Node36</title>
<path fill="none" stroke="midnightblue" d="M1354.28,-445.14C1497.86,-445.31 1988.72,-442.74 2043,-400 2066.75,-381.3 2063,-365.23 2063,-335 2063,-335 2063,-335 2063,-137.5 2063,-85.07 2008.3,-44.58 1974.68,-24.64"/>
<polygon fill="midnightblue" stroke="midnightblue" points="1976.24,-21.5 1965.82,-19.57 1972.76,-27.58 1976.24,-21.5"/>
</g>
<!-- Node37 -->
<g id="node27" class="node">
<title>Node37</title>
<g id="a_node27"><a xlink:title=" ">
<polygon fill="white" stroke="#bfbfbf" points="1276.5,-263 1276.5,-282 1333.5,-282 1333.5,-263 1276.5,-263"/>
<text text-anchor="middle" x="1305" y="-270" font-family="Helvetica,sans-Serif" font-size="10.00">ostream</text>
</a>
</g>
</g>
<!-- Node33&#45;&gt;Node37 -->
<g id="edge41" class="edge">
<title>Node33&#45;&gt;Node37</title>
<path fill="none" stroke="midnightblue" d="M1314.49,-436.26C1312.94,-409.65 1308.25,-329.21 1306.1,-292.34"/>
<polygon fill="midnightblue" stroke="midnightblue" points="1309.57,-291.8 1305.5,-282.02 1302.58,-292.21 1309.57,-291.8"/>
</g>
<!-- Node38 -->
<g id="node28" class="node">
<title>Node38</title>
<g id="a_node28"><a xlink:title=" ">
<polygon fill="white" stroke="#bfbfbf" points="1008.5,-0.5 1008.5,-19.5 1077.5,-19.5 1077.5,-0.5 1008.5,-0.5"/>
<text text-anchor="middle" x="1043" y="-7.5" font-family="Helvetica,sans-Serif" font-size="10.00">type_traits</text>
</a>
</g>
</g>
<!-- Node33&#45;&gt;Node38 -->
<g id="edge42" class="edge">
<title>Node33&#45;&gt;Node38</title>
<path fill="none" stroke="midnightblue" d="M1275.79,-444.39C1158.45,-442.19 815.83,-432.98 779,-400 645.53,-280.49 935.03,-79.93 1020.29,-25.18"/>
<polygon fill="midnightblue" stroke="midnightblue" points="1022.21,-28.11 1028.77,-19.78 1018.45,-22.2 1022.21,-28.11"/>
</g>
<!-- Node39 -->
<g id="node29" class="node">
<title>Node39</title>
<g id="a_node29"><a xlink:title=" ">
<polygon fill="white" stroke="#bfbfbf" points="791.5,-0.5 791.5,-19.5 838.5,-19.5 838.5,-0.5 791.5,-0.5"/>
<text text-anchor="middle" x="815" y="-7.5" font-family="Helvetica,sans-Serif" font-size="10.00">vector</text>
</a>
</g>
</g>
<!-- Node33&#45;&gt;Node39 -->
<g id="edge43" class="edge">
<title>Node33&#45;&gt;Node39</title>
<path fill="none" stroke="midnightblue" d="M1275.61,-443.68C1165.72,-439.7 857.5,-426.44 760,-400 695.73,-382.57 625,-401.59 625,-335 625,-335 625,-335 625,-204.5 625,-113.86 732.45,-50.12 785.74,-24.07"/>
<polygon fill="midnightblue" stroke="midnightblue" points="787.5,-27.11 795.03,-19.65 784.49,-20.79 787.5,-27.11"/>
</g>
<!-- Node40 -->
<g id="node30" class="node">
<title>Node40</title>
<g id="a_node30"><a xlink:href="gtest-internal_8h_source.html" target="_top" xlink:title=" ">
<polygon fill="white" stroke="red" points="1390,-257.5 1390,-287.5 1500,-287.5 1500,-257.5 1390,-257.5"/>
<text text-anchor="start" x="1398" y="-275.5" font-family="Helvetica,sans-Serif" font-size="10.00">gtest/internal/gtest</text>
<text text-anchor="middle" x="1445" y="-264.5" font-family="Helvetica,sans-Serif" font-size="10.00">&#45;internal.h</text>
</a>
</g>
</g>
<!-- Node33&#45;&gt;Node40 -->
<g id="edge44" class="edge">
<title>Node33&#45;&gt;Node40</title>
<path fill="none" stroke="midnightblue" d="M1354.33,-439.79C1398.14,-433.09 1464.82,-419.88 1480,-400 1503.61,-369.09 1480.17,-323.15 1461.93,-295.98"/>
<polygon fill="midnightblue" stroke="midnightblue" points="1464.62,-293.72 1456.02,-287.53 1458.88,-297.73 1464.62,-293.72"/>
</g>
<!-- Node61 -->
<g id="node38" class="node">
<title>Node61</title>
<g id="a_node38"><a xlink:href="gtest-message_8h_source.html" target="_top" xlink:title=" ">
<polygon fill="white" stroke="red" points="1795,-129 1795,-148 1921,-148 1921,-129 1795,-129"/>
<text text-anchor="middle" x="1858" y="-136" font-family="Helvetica,sans-Serif" font-size="10.00">gtest/gtest&#45;message.h</text>
</a>
</g>
</g>
<!-- Node33&#45;&gt;Node61 -->
<g id="edge95" class="edge">
<title>Node33&#45;&gt;Node61</title>
<path fill="none" stroke="midnightblue" d="M1354.19,-444.44C1472.68,-441.82 1823.3,-427.07 1892,-344 1937.69,-288.75 1891.69,-195.66 1869.03,-157.08"/>
<polygon fill="midnightblue" stroke="midnightblue" points="1871.77,-154.84 1863.59,-148.1 1865.78,-158.47 1871.77,-154.84"/>
</g>
<!-- Node64 -->
<g id="node40" class="node">
<title>Node64</title>
<g id="a_node40"><a xlink:href="gtest-string_8h_source.html" target="_top" xlink:title=" ">
<polygon fill="white" stroke="black" points="1147,-123.5 1147,-153.5 1257,-153.5 1257,-123.5 1147,-123.5"/>
<text text-anchor="start" x="1155" y="-141.5" font-family="Helvetica,sans-Serif" font-size="10.00">gtest/internal/gtest</text>
<text text-anchor="middle" x="1202" y="-130.5" font-family="Helvetica,sans-Serif" font-size="10.00">&#45;string.h</text>
</a>
</g>
</g>
<!-- Node33&#45;&gt;Node64 -->
<g id="edge78" class="edge">
<title>Node33&#45;&gt;Node64</title>
<path fill="none" stroke="midnightblue" d="M1275.93,-444.58C1160.7,-442.95 828.28,-435.2 796,-400 682.55,-276.28 995.65,-186.6 1136.9,-153.5"/>
<polygon fill="midnightblue" stroke="midnightblue" points="1137.81,-156.88 1146.76,-151.22 1136.23,-150.06 1137.81,-156.88"/>
</g>
<!-- Node66 -->
<g id="node41" class="node">
<title>Node66</title>
<g id="a_node41"><a xlink:href="gtest-death-test_8h_source.html" target="_top" xlink:title=" ">
<polygon fill="white" stroke="red" points="805,-380.5 805,-399.5 937,-399.5 937,-380.5 805,-380.5"/>
<text text-anchor="middle" x="871" y="-387.5" font-family="Helvetica,sans-Serif" font-size="10.00">gtest/gtest&#45;death&#45;test.h</text>
</a>
</g>
</g>
<!-- Node33&#45;&gt;Node66 -->
<g id="edge79" class="edge">
<title>Node33&#45;&gt;Node66</title>
<path fill="none" stroke="midnightblue" d="M1275.99,-440.26C1202.59,-431.33 1042.77,-411.89 947.31,-400.28"/>
<polygon fill="midnightblue" stroke="midnightblue" points="947.49,-396.78 937.14,-399.04 946.64,-403.73 947.49,-396.78"/>
</g>
<!-- Node68 -->
<g id="node42" class="node">
<title>Node68</title>
<g id="a_node42"><a xlink:href="gtest-matchers_8h_source.html" target="_top" xlink:title=" ">
<polygon fill="white" stroke="red" points="1343,-380.5 1343,-399.5 1471,-399.5 1471,-380.5 1343,-380.5"/>
<text text-anchor="middle" x="1407" y="-387.5" font-family="Helvetica,sans-Serif" font-size="10.00">gtest/gtest&#45;matchers.h</text>
</a>
</g>
</g>
<!-- Node33&#45;&gt;Node68 -->
<g id="edge80" class="edge">
<title>Node33&#45;&gt;Node68</title>
<path fill="none" stroke="midnightblue" d="M1329.78,-436.32C1344.27,-427.82 1366.57,-414.73 1383.49,-404.8"/>
<polygon fill="midnightblue" stroke="midnightblue" points="1385.4,-407.74 1392.26,-399.65 1381.86,-401.7 1385.4,-407.74"/>
</g>
<!-- Node70 -->
<g id="node43" class="node">
<title>Node70</title>
<g id="a_node43"><a xlink:href="gtest-printers_8h_source.html" target="_top" xlink:title=" ">
<polygon fill="white" stroke="red" points="1167.5,-324.5 1167.5,-343.5 1286.5,-343.5 1286.5,-324.5 1167.5,-324.5"/>
<text text-anchor="middle" x="1227" y="-331.5" font-family="Helvetica,sans-Serif" font-size="10.00">gtest/gtest&#45;printers.h</text>
</a>
</g>
</g>
<!-- Node33&#45;&gt;Node70 -->
<g id="edge99" class="edge">
<title>Node33&#45;&gt;Node70</title>
<path fill="none" stroke="midnightblue" d="M1308.09,-436.37C1293.51,-418.14 1259.34,-375.43 1240.34,-351.68"/>
<polygon fill="midnightblue" stroke="midnightblue" points="1242.85,-349.21 1233.87,-343.59 1237.39,-353.59 1242.85,-349.21"/>
</g>
<!-- Node73 -->
<g id="node44" class="node">
<title>Node73</title>
<g id="a_node44"><a xlink:href="gtest-param-test_8h_source.html" target="_top" xlink:title=" ">
<polygon fill="white" stroke="red" points="1747,-324.5 1747,-343.5 1883,-343.5 1883,-324.5 1747,-324.5"/>
<text text-anchor="middle" x="1815" y="-331.5" font-family="Helvetica,sans-Serif" font-size="10.00">gtest/gtest&#45;param&#45;test.h</text>
</a>
</g>
</g>
<!-- Node33&#45;&gt;Node73 -->
<g id="edge96" class="edge">
<title>Node33&#45;&gt;Node73</title>
<path fill="none" stroke="midnightblue" d="M1354.23,-437.75C1399.74,-429.22 1476.97,-414.4 1543,-400 1623.89,-382.36 1717.69,-359.38 1771.32,-346"/>
<polygon fill="midnightblue" stroke="midnightblue" points="1772.32,-349.36 1781.18,-343.54 1770.63,-342.57 1772.32,-349.36"/>
</g>
<!-- Node79 -->
<g id="node45" class="node">
<title>Node79</title>
<g id="a_node45"><a xlink:href="gtest__prod_8h_source.html" target="_top" xlink:title=" ">
<polygon fill="white" stroke="black" points="955.5,-380.5 955.5,-399.5 1060.5,-399.5 1060.5,-380.5 955.5,-380.5"/>
<text text-anchor="middle" x="1008" y="-387.5" font-family="Helvetica,sans-Serif" font-size="10.00">gtest/gtest_prod.h</text>
</a>
</g>
</g>
<!-- Node33&#45;&gt;Node79 -->
<g id="edge100" class="edge">
<title>Node33&#45;&gt;Node79</title>
<path fill="none" stroke="midnightblue" d="M1275.81,-438.11C1222.83,-428.79 1127.93,-412.1 1066.5,-401.29"/>
<polygon fill="midnightblue" stroke="midnightblue" points="1067.02,-397.83 1056.56,-399.54 1065.8,-404.72 1067.02,-397.83"/>
</g>
<!-- Node77 -->
<g id="node46" class="node">
<title>Node77</title>
<g id="a_node46"><a xlink:href="gtest-test-part_8h_source.html" target="_top" xlink:title=" ">
<polygon fill="white" stroke="red" points="984,-324.5 984,-343.5 1108,-343.5 1108,-324.5 984,-324.5"/>
<text text-anchor="middle" x="1046" y="-331.5" font-family="Helvetica,sans-Serif" font-size="10.00">gtest/gtest&#45;test&#45;part.h</text>
</a>
</g>
</g>
<!-- Node33&#45;&gt;Node77 -->
<g id="edge101" class="edge">
<title>Node33&#45;&gt;Node77</title>
<path fill="none" stroke="midnightblue" d="M1304.9,-436.3C1288.28,-422.43 1253.66,-395.3 1220,-380 1184.32,-363.79 1141.77,-352.65 1107.67,-345.51"/>
<polygon fill="midnightblue" stroke="midnightblue" points="1108.34,-342.07 1097.84,-343.51 1106.94,-348.93 1108.34,-342.07"/>
</g>
<!-- Node80 -->
<g id="node47" class="node">
<title>Node80</title>
<g id="a_node47"><a xlink:href="gtest-typed-test_8h_source.html" target="_top" xlink:title=" ">
<polygon fill="white" stroke="red" points="1527,-324.5 1527,-343.5 1659,-343.5 1659,-324.5 1527,-324.5"/>
<text text-anchor="middle" x="1593" y="-331.5" font-family="Helvetica,sans-Serif" font-size="10.00">gtest/gtest&#45;typed&#45;test.h</text>
</a>
</g>
</g>
<!-- Node33&#45;&gt;Node80 -->
<g id="edge105" class="edge">
<title>Node33&#45;&gt;Node80</title>
<path fill="none" stroke="midnightblue" d="M1354.33,-441.41C1395.59,-436.44 1461.49,-425.07 1513,-400 1538.25,-387.71 1562.61,-366.06 1577.68,-351.15"/>
<polygon fill="midnightblue" stroke="midnightblue" points="1580.53,-353.24 1585.04,-343.66 1575.53,-348.33 1580.53,-353.24"/>
</g>
<!-- Node81 -->
<g id="node48" class="node">
<title>Node81</title>
<g id="a_node48"><a xlink:href="gtest__pred__impl_8h_source.html" target="_top" xlink:title=" ">
<polygon fill="white" stroke="black" points="1079,-380.5 1079,-399.5 1211,-399.5 1211,-380.5 1079,-380.5"/>
<text text-anchor="middle" x="1145" y="-387.5" font-family="Helvetica,sans-Serif" font-size="10.00">gtest/gtest_pred_impl.h</text>
</a>
</g>
</g>
<!-- Node33&#45;&gt;Node81 -->
<g id="edge108" class="edge">
<title>Node33&#45;&gt;Node81</title>
<path fill="none" stroke="midnightblue" d="M1282.97,-436.44C1252.38,-427.36 1206.79,-412.94 1176.41,-402.78"/>
<polygon fill="midnightblue" stroke="midnightblue" points="1177.33,-399.4 1166.73,-399.52 1175.09,-406.03 1177.33,-399.4"/>
</g>
<!-- Node40&#45;&gt;Node9 -->
<g id="edge59" class="edge">
<title>Node40&#45;&gt;Node9</title>
<path fill="none" stroke="midnightblue" d="M1389.67,-259.68C1385.05,-258.75 1380.45,-257.85 1376,-257 1282.98,-239.26 1240.08,-279.98 1166,-221 1107.59,-174.5 1114.32,-71.92 1119.96,-29.71"/>
<polygon fill="midnightblue" stroke="midnightblue" points="1123.44,-30.11 1121.44,-19.71 1116.52,-29.09 1123.44,-30.11"/>
</g>
<!-- Node40&#45;&gt;Node14 -->
<g id="edge64" class="edge">
<title>Node40&#45;&gt;Node14</title>
<path fill="none" stroke="midnightblue" d="M1389.95,-263.66C1374.45,-261.48 1357.57,-259.12 1342,-257 1220.74,-240.47 1186.4,-255.58 1069,-221 898.61,-170.81 711.54,-63.26 647.75,-24.92"/>
<polygon fill="midnightblue" stroke="midnightblue" points="649.29,-21.76 638.92,-19.59 645.66,-27.75 649.29,-21.76"/>
</g>
<!-- Node40&#45;&gt;Node35 -->
<g id="edge61" class="edge">
<title>Node40&#45;&gt;Node35</title>
<path fill="none" stroke="midnightblue" d="M1500.12,-266.59C1562.32,-259.93 1658.23,-245.9 1684,-221 1737.71,-169.11 1739.36,-71.14 1737.41,-29.97"/>
<polygon fill="midnightblue" stroke="midnightblue" points="1740.89,-29.52 1736.8,-19.75 1733.91,-29.94 1740.89,-29.52"/>
</g>
<!-- Node40&#45;&gt;Node38 -->
<g id="edge65" class="edge">
<title>Node40&#45;&gt;Node38</title>
<path fill="none" stroke="midnightblue" d="M1430.13,-257.13C1400.56,-229.04 1331.57,-165.86 1266,-123 1200.77,-80.35 1117.09,-42.34 1073.11,-23.5"/>
<polygon fill="midnightblue" stroke="midnightblue" points="1074.41,-20.25 1063.84,-19.57 1071.67,-26.7 1074.41,-20.25"/>
</g>
<!-- Node40&#45;&gt;Node39 -->
<g id="edge66" class="edge">
<title>Node40&#45;&gt;Node39</title>
<path fill="none" stroke="midnightblue" d="M1389.94,-263.77C1307.52,-252 1159.21,-230.02 1136,-221 1008.29,-171.37 878.52,-65.88 832.49,-26.37"/>
<polygon fill="midnightblue" stroke="midnightblue" points="834.51,-23.48 824.66,-19.58 829.93,-28.77 834.51,-23.48"/>
</g>
<!-- Node41 -->
<g id="node31" class="node">
<title>Node41</title>
<g id="a_node31"><a xlink:href="gtest-port_8h_source.html" target="_top" xlink:title=" ">
<polygon fill="white" stroke="red" points="1553,-56.5 1553,-86.5 1663,-86.5 1663,-56.5 1553,-56.5"/>
<text text-anchor="start" x="1561" y="-74.5" font-family="Helvetica,sans-Serif" font-size="10.00">gtest/internal/gtest</text>
<text text-anchor="middle" x="1608" y="-63.5" font-family="Helvetica,sans-Serif" font-size="10.00">&#45;port.h</text>
</a>
</g>
</g>
<!-- Node40&#45;&gt;Node41 -->
<g id="edge45" class="edge">
<title>Node40&#45;&gt;Node41</title>
<path fill="none" stroke="midnightblue" d="M1433.52,-257.28C1421.43,-240.47 1405.74,-212 1418,-190 1446.38,-139.08 1506.93,-107.45 1552.1,-90.01"/>
<polygon fill="midnightblue" stroke="midnightblue" points="1553.34,-93.28 1561.48,-86.5 1550.89,-86.72 1553.34,-93.28"/>
</g>
<!-- Node42 -->
<g id="node32" class="node">
<title>Node42</title>
<g id="a_node32"><a xlink:title=" ">
<polygon fill="white" stroke="#bfbfbf" points="1540.5,-0.5 1540.5,-19.5 1593.5,-19.5 1593.5,-0.5 1540.5,-0.5"/>
<text text-anchor="middle" x="1567" y="-7.5" font-family="Helvetica,sans-Serif" font-size="10.00">ctype.h</text>
</a>
</g>
</g>
<!-- Node40&#45;&gt;Node42 -->
<g id="edge56" class="edge">
<title>Node40&#45;&gt;Node42</title>
<path fill="none" stroke="midnightblue" d="M1500.22,-266.5C1558.26,-259.97 1643.9,-246.27 1664,-221 1709.34,-164.02 1604.84,-219.4 1544,-87 1535.13,-67.71 1545.26,-44.12 1554.74,-28.38"/>
<polygon fill="midnightblue" stroke="midnightblue" points="1557.86,-30 1560.38,-19.71 1551.99,-26.19 1557.86,-30"/>
</g>
<!-- Node45 -->
<g id="node33" class="node">
<title>Node45</title>
<g id="a_node33"><a xlink:title=" ">
<polygon fill="white" stroke="#bfbfbf" points="1334.5,-0.5 1334.5,-19.5 1387.5,-19.5 1387.5,-0.5 1334.5,-0.5"/>
<text text-anchor="middle" x="1361" y="-7.5" font-family="Helvetica,sans-Serif" font-size="10.00">string.h</text>
</a>
</g>
</g>
<!-- Node40&#45;&gt;Node45 -->
<g id="edge58" class="edge">
<title>Node40&#45;&gt;Node45</title>
<path fill="none" stroke="midnightblue" d="M1433.02,-257.36C1425.39,-247.68 1415.88,-234.26 1410,-221 1380.41,-154.32 1367.48,-67.49 1362.99,-29.81"/>
<polygon fill="midnightblue" stroke="midnightblue" points="1366.45,-29.32 1361.86,-19.77 1359.5,-30.1 1366.45,-29.32"/>
</g>
<!-- Node57 -->
<g id="node34" class="node">
<title>Node57</title>
<g id="a_node34"><a xlink:title=" ">
<polygon fill="white" stroke="#bfbfbf" points="1427.5,-196 1427.5,-215 1474.5,-215 1474.5,-196 1427.5,-196"/>
<text text-anchor="middle" x="1451" y="-203" font-family="Helvetica,sans-Serif" font-size="10.00">float.h</text>
</a>
</g>
</g>
<!-- Node40&#45;&gt;Node57 -->
<g id="edge57" class="edge">
<title>Node40&#45;&gt;Node57</title>
<path fill="none" stroke="midnightblue" d="M1446.3,-257.4C1447.17,-247.96 1448.33,-235.45 1449.27,-225.19"/>
<polygon fill="midnightblue" stroke="midnightblue" points="1452.76,-225.47 1450.2,-215.19 1445.79,-224.83 1452.76,-225.47"/>
</g>
<!-- Node58 -->
<g id="node35" class="node">
<title>Node58</title>
<g id="a_node35"><a xlink:title=" ">
<polygon fill="white" stroke="#bfbfbf" points="1493,-196 1493,-215 1549,-215 1549,-196 1493,-196"/>
<text text-anchor="middle" x="1521" y="-203" font-family="Helvetica,sans-Serif" font-size="10.00">iomanip</text>
</a>
</g>
</g>
<!-- Node40&#45;&gt;Node58 -->
<g id="edge60" class="edge">
<title>Node40&#45;&gt;Node58</title>
<path fill="none" stroke="midnightblue" d="M1461.49,-257.4C1473.69,-246.96 1490.31,-232.75 1502.88,-222"/>
<polygon fill="midnightblue" stroke="midnightblue" points="1505.51,-224.35 1510.83,-215.19 1500.96,-219.03 1505.51,-224.35"/>
</g>
<!-- Node59 -->
<g id="node36" class="node">
<title>Node59</title>
<g id="a_node36"><a xlink:title=" ">
<polygon fill="white" stroke="#bfbfbf" points="1567,-196 1567,-215 1605,-215 1605,-196 1567,-196"/>
<text text-anchor="middle" x="1586" y="-203" font-family="Helvetica,sans-Serif" font-size="10.00">map</text>
</a>
</g>
</g>
<!-- Node40&#45;&gt;Node59 -->
<g id="edge62" class="edge">
<title>Node40&#45;&gt;Node59</title>
<path fill="none" stroke="midnightblue" d="M1477.87,-257.41C1500.54,-247.54 1531.29,-233.87 1558,-221 1558.84,-220.59 1559.7,-220.18 1560.56,-219.76"/>
<polygon fill="midnightblue" stroke="midnightblue" points="1562.44,-222.72 1569.79,-215.09 1559.29,-216.47 1562.44,-222.72"/>
</g>
<!-- Node60 -->
<g id="node37" class="node">
<title>Node60</title>
<g id="a_node37"><a xlink:title=" ">
<polygon fill="white" stroke="#bfbfbf" points="1623,-196 1623,-215 1655,-215 1655,-196 1623,-196"/>
<text text-anchor="middle" x="1639" y="-203" font-family="Helvetica,sans-Serif" font-size="10.00">set</text>
</a>
</g>
</g>
<!-- Node40&#45;&gt;Node60 -->
<g id="edge63" class="edge">
<title>Node40&#45;&gt;Node60</title>
<path fill="none" stroke="midnightblue" d="M1500.19,-258.52C1533.79,-249.77 1577.18,-236.92 1614,-221 1614.85,-220.63 1615.7,-220.25 1616.56,-219.84"/>
<polygon fill="midnightblue" stroke="midnightblue" points="1618.35,-222.85 1625.55,-215.08 1615.07,-216.67 1618.35,-222.85"/>
</g>
<!-- Node40&#45;&gt;Node61 -->
<g id="edge67" class="edge">
<title>Node40&#45;&gt;Node61</title>
<path fill="none" stroke="midnightblue" d="M1500.27,-268.63C1560.01,-264 1657.13,-251.99 1735,-221 1776.15,-204.62 1817.83,-173.19 1840.54,-154.51"/>
<polygon fill="midnightblue" stroke="midnightblue" points="1842.86,-157.13 1848.28,-148.03 1838.37,-151.77 1842.86,-157.13"/>
</g>
<!-- Node63 -->
<g id="node39" class="node">
<title>Node63</title>
<g id="a_node39"><a xlink:href="gtest-filepath_8h_source.html" target="_top" xlink:title=" ">
<polygon fill="white" stroke="black" points="1185,-190.5 1185,-220.5 1295,-220.5 1295,-190.5 1185,-190.5"/>
<text text-anchor="start" x="1193" y="-208.5" font-family="Helvetica,sans-Serif" font-size="10.00">gtest/internal/gtest</text>
<text text-anchor="middle" x="1240" y="-197.5" font-family="Helvetica,sans-Serif" font-size="10.00">&#45;filepath.h</text>
</a>
</g>
</g>
<!-- Node40&#45;&gt;Node63 -->
<g id="edge71" class="edge">
<title>Node40&#45;&gt;Node63</title>
<path fill="none" stroke="midnightblue" d="M1400.77,-257.48C1369.49,-247.56 1327.36,-234.2 1294.08,-223.65"/>
<polygon fill="midnightblue" stroke="midnightblue" points="1295.09,-220.3 1284.5,-220.61 1292.98,-226.97 1295.09,-220.3"/>
</g>
<!-- Node40&#45;&gt;Node64 -->
<g id="edge77" class="edge">
<title>Node40&#45;&gt;Node64</title>
<path fill="none" stroke="midnightblue" d="M1389.67,-259.72C1385.05,-258.79 1380.45,-257.87 1376,-257 1331.68,-248.36 1204.97,-255.65 1176,-221 1162.05,-204.31 1172.57,-180.04 1184.13,-162.33"/>
<polygon fill="midnightblue" stroke="midnightblue" points="1187.28,-163.93 1190.15,-153.74 1181.54,-159.92 1187.28,-163.93"/>
</g>
<!-- Node41&#45;&gt;Node9 -->
<g id="edge49" class="edge">
<title>Node41&#45;&gt;Node9</title>
<path fill="none" stroke="midnightblue" d="M1552.84,-63.73C1452.24,-51.39 1241.68,-25.56 1158.19,-15.32"/>
<polygon fill="midnightblue" stroke="midnightblue" points="1158.55,-11.83 1148.2,-14.09 1157.69,-18.78 1158.55,-11.83"/>
</g>
<!-- Node41&#45;&gt;Node14 -->
<g id="edge54" class="edge">
<title>Node41&#45;&gt;Node14</title>
<path fill="none" stroke="midnightblue" d="M1552.69,-67.15C1371.6,-56.19 799.96,-21.59 657.44,-12.96"/>
<polygon fill="midnightblue" stroke="midnightblue" points="657.38,-9.45 647.18,-12.34 656.95,-16.44 657.38,-9.45"/>
</g>
<!-- Node41&#45;&gt;Node28 -->
<g id="edge52" class="edge">
<title>Node41&#45;&gt;Node28</title>
<path fill="none" stroke="midnightblue" d="M1663.28,-63.47C1737.12,-54 1872,-36.43 1987,-20 1992.98,-19.15 1999.3,-18.21 2005.48,-17.28"/>
<polygon fill="midnightblue" stroke="midnightblue" points="2006.34,-20.69 2015.7,-15.73 2005.29,-13.77 2006.34,-20.69"/>
</g>
<!-- Node41&#45;&gt;Node29 -->
<g id="edge47" class="edge">
<title>Node41&#45;&gt;Node29</title>
<path fill="none" stroke="midnightblue" d="M1663.31,-66.38C1752.43,-59.36 1933.17,-43.51 2085,-20 2087.89,-19.55 2090.88,-19.04 2093.87,-18.5"/>
<polygon fill="midnightblue" stroke="midnightblue" points="2094.79,-21.89 2103.95,-16.56 2093.46,-15.01 2094.79,-21.89"/>
</g>
<!-- Node41&#45;&gt;Node35 -->
<g id="edge50" class="edge">
<title>Node41&#45;&gt;Node35</title>
<path fill="none" stroke="midnightblue" d="M1638.33,-56.4C1659.52,-46.55 1687.59,-33.5 1708.2,-23.92"/>
<polygon fill="midnightblue" stroke="midnightblue" points="1709.78,-27.05 1717.37,-19.66 1706.83,-20.7 1709.78,-27.05"/>
</g>
<!-- Node41&#45;&gt;Node36 -->
<g id="edge53" class="edge">
<title>Node41&#45;&gt;Node36</title>
<path fill="none" stroke="midnightblue" d="M1663.17,-60.87C1732.3,-48.81 1849.07,-28.44 1909.75,-17.85"/>
<polygon fill="midnightblue" stroke="midnightblue" points="1910.44,-21.28 1919.69,-16.11 1909.24,-14.38 1910.44,-21.28"/>
</g>
<!-- Node41&#45;&gt;Node38 -->
<g id="edge51" class="edge">
<title>Node41&#45;&gt;Node38</title>
<path fill="none" stroke="midnightblue" d="M1552.86,-66.89C1457.83,-60.27 1257.18,-44.58 1089,-20 1088.54,-19.93 1088.07,-19.86 1087.6,-19.79"/>
<polygon fill="midnightblue" stroke="midnightblue" points="1088.04,-16.32 1077.6,-18.14 1086.9,-23.22 1088.04,-16.32"/>
</g>
<!-- Node41&#45;&gt;Node39 -->
<g id="edge55" class="edge">
<title>Node41&#45;&gt;Node39</title>
<path fill="none" stroke="midnightblue" d="M1552.87,-66.36C1399.63,-54.87 971.78,-22.76 848.58,-13.52"/>
<polygon fill="midnightblue" stroke="midnightblue" points="848.84,-10.03 838.6,-12.77 848.31,-17.01 848.84,-10.03"/>
</g>
<!-- Node41&#45;&gt;Node42 -->
<g id="edge46" class="edge">
<title>Node41&#45;&gt;Node42</title>
<path fill="none" stroke="midnightblue" d="M1598.28,-56.4C1592.45,-47.93 1584.98,-37.1 1578.81,-28.14"/>
<polygon fill="midnightblue" stroke="midnightblue" points="1581.52,-25.91 1572.97,-19.66 1575.76,-29.88 1581.52,-25.91"/>
</g>
<!-- Node41&#45;&gt;Node45 -->
<g id="edge48" class="edge">
<title>Node41&#45;&gt;Node45</title>
<path fill="none" stroke="midnightblue" d="M1552.88,-57.22C1505.43,-45.79 1438.32,-29.62 1397.33,-19.75"/>
<polygon fill="midnightblue" stroke="midnightblue" points="1398.05,-16.32 1387.5,-17.38 1396.41,-23.13 1398.05,-16.32"/>
</g>
<!-- Node61&#45;&gt;Node35 -->
<g id="edge68" class="edge">
<title>Node61&#45;&gt;Node35</title>
<path fill="none" stroke="midnightblue" d="M1849.61,-128.81C1829.42,-107.86 1777.81,-54.35 1751.67,-27.25"/>
<polygon fill="midnightblue" stroke="midnightblue" points="1753.91,-24.52 1744.44,-19.76 1748.87,-29.38 1753.91,-24.52"/>
</g>
<!-- Node61&#45;&gt;Node36 -->
<g id="edge69" class="edge">
<title>Node61&#45;&gt;Node36</title>
<path fill="none" stroke="midnightblue" d="M1864.25,-128.81C1879.19,-108.04 1917.15,-55.27 1936.8,-27.96"/>
<polygon fill="midnightblue" stroke="midnightblue" points="1939.7,-29.92 1942.7,-19.76 1934.02,-25.83 1939.7,-29.92"/>
</g>
<!-- Node61&#45;&gt;Node41 -->
<g id="edge70" class="edge">
<title>Node61&#45;&gt;Node41</title>
<path fill="none" stroke="midnightblue" d="M1825.06,-128.94C1786.23,-118.84 1720.82,-101.83 1671.93,-89.12"/>
<polygon fill="midnightblue" stroke="midnightblue" points="1672.63,-85.69 1662.07,-86.56 1670.87,-92.46 1672.63,-85.69"/>
</g>
<!-- Node63&#45;&gt;Node64 -->
<g id="edge72" class="edge">
<title>Node63&#45;&gt;Node64</title>
<path fill="none" stroke="midnightblue" d="M1231.75,-190.4C1226.97,-182.22 1220.84,-171.73 1215.38,-162.39"/>
<polygon fill="midnightblue" stroke="midnightblue" points="1218.3,-160.44 1210.23,-153.58 1212.25,-163.98 1218.3,-160.44"/>
</g>
<!-- Node64&#45;&gt;Node9 -->
<g id="edge74" class="edge">
<title>Node64&#45;&gt;Node9</title>
<path fill="none" stroke="midnightblue" d="M1193.24,-123.48C1178.71,-100.21 1149.64,-53.66 1133.84,-28.36"/>
<polygon fill="midnightblue" stroke="midnightblue" points="1136.75,-26.42 1128.49,-19.79 1130.82,-30.12 1136.75,-26.42"/>
</g>
<!-- Node64&#45;&gt;Node14 -->
<g id="edge75" class="edge">
<title>Node64&#45;&gt;Node14</title>
<path fill="none" stroke="midnightblue" d="M1146.94,-125.43C1028.15,-99.39 750.98,-38.62 656.9,-17.99"/>
<polygon fill="midnightblue" stroke="midnightblue" points="657.63,-14.57 647.11,-15.85 656.13,-21.41 657.63,-14.57"/>
</g>
<!-- Node64&#45;&gt;Node41 -->
<g id="edge76" class="edge">
<title>Node64&#45;&gt;Node41</title>
<path fill="none" stroke="midnightblue" d="M1257.18,-128.67C1331.46,-116.77 1463.42,-95.65 1542.61,-82.97"/>
<polygon fill="midnightblue" stroke="midnightblue" points="1543.62,-86.35 1552.94,-81.31 1542.52,-79.44 1543.62,-86.35"/>
</g>
<!-- Node64&#45;&gt;Node45 -->
<g id="edge73" class="edge">
<title>Node64&#45;&gt;Node45</title>
<path fill="none" stroke="midnightblue" d="M1219.62,-123.48C1249.78,-99.49 1311.01,-50.77 1342.05,-26.08"/>
<polygon fill="midnightblue" stroke="midnightblue" points="1344.31,-28.75 1349.95,-19.79 1339.95,-23.28 1344.31,-28.75"/>
</g>
<!-- Node68&#45;&gt;Node14 -->
<g id="edge83" class="edge">
<title>Node68&#45;&gt;Node14</title>
<path fill="none" stroke="midnightblue" d="M1342.88,-385.57C1205.4,-377.08 887.89,-351.01 803,-288 707.63,-217.2 649.81,-78.85 631.41,-29.24"/>
<polygon fill="midnightblue" stroke="midnightblue" points="634.61,-27.79 627.92,-19.58 628.03,-30.17 634.61,-27.79"/>
</g>
<!-- Node68&#45;&gt;Node36 -->
<g id="edge81" class="edge">
<title>Node68&#45;&gt;Node36</title>
<path fill="none" stroke="midnightblue" d="M1471.29,-388.52C1585.66,-386.77 1819.28,-378.88 1892,-344 1968.66,-307.23 2025,-291.52 2025,-206.5 2025,-206.5 2025,-206.5 2025,-137.5 2025,-92.12 1988.62,-48.98 1966.2,-26.7"/>
<polygon fill="midnightblue" stroke="midnightblue" points="1968.57,-24.13 1958.94,-19.73 1963.72,-29.18 1968.57,-24.13"/>
</g>
<!-- Node68&#45;&gt;Node37 -->
<g id="edge82" class="edge">
<title>Node68&#45;&gt;Node37</title>
<path fill="none" stroke="midnightblue" d="M1399.33,-380.32C1382.35,-361.09 1341.33,-314.64 1319.4,-289.81"/>
<polygon fill="midnightblue" stroke="midnightblue" points="1322,-287.46 1312.76,-282.28 1316.75,-292.09 1322,-287.46"/>
</g>
<!-- Node68&#45;&gt;Node38 -->
<g id="edge84" class="edge">
<title>Node68&#45;&gt;Node38</title>
<path fill="none" stroke="midnightblue" d="M1405.49,-380.18C1400.85,-356.09 1384.52,-288.86 1342,-257 1267.62,-201.26 1209.23,-278.24 1136,-221 1073.11,-171.84 1051.71,-71.16 1045.37,-29.59"/>
<polygon fill="midnightblue" stroke="midnightblue" points="1048.81,-28.94 1043.96,-19.52 1041.88,-29.91 1048.81,-28.94"/>
</g>
<!-- Node68&#45;&gt;Node40 -->
<g id="edge93" class="edge">
<title>Node68&#45;&gt;Node40</title>
<path fill="none" stroke="midnightblue" d="M1409.86,-380.32C1415.59,-362.89 1428.68,-323.1 1437.17,-297.31"/>
<polygon fill="midnightblue" stroke="midnightblue" points="1440.58,-298.14 1440.38,-287.55 1433.93,-295.95 1440.58,-298.14"/>
</g>
<!-- Node68&#45;&gt;Node41 -->
<g id="edge94" class="edge">
<title>Node68&#45;&gt;Node41</title>
<path fill="none" stroke="midnightblue" d="M1471.11,-385.18C1538.5,-379.93 1638.74,-368.24 1668,-344 1723.01,-298.43 1725.28,-260.54 1714,-190 1709.05,-159.05 1711.55,-147.5 1692,-123 1681.45,-109.78 1666.44,-99.22 1652.01,-91.24"/>
<polygon fill="midnightblue" stroke="midnightblue" points="1653.63,-88.13 1643.15,-86.6 1650.39,-94.34 1653.63,-88.13"/>
</g>
<!-- Node68&#45;&gt;Node70 -->
<g id="edge85" class="edge">
<title>Node68&#45;&gt;Node70</title>
<path fill="none" stroke="midnightblue" d="M1378.48,-380.44C1347.93,-371.28 1299.29,-356.69 1265.4,-346.52"/>
<polygon fill="midnightblue" stroke="midnightblue" points="1265.97,-343.04 1255.39,-343.52 1263.96,-349.74 1265.97,-343.04"/>
</g>
<!-- Node70&#45;&gt;Node14 -->
<g id="edge88" class="edge">
<title>Node70&#45;&gt;Node14</title>
<path fill="none" stroke="midnightblue" d="M1167.33,-326.95C1122.04,-320.91 1058.92,-309.34 1007,-288 855.81,-225.86 825.23,-190.85 699,-87 676.44,-68.44 653.43,-43.7 639.18,-27.57"/>
<polygon fill="midnightblue" stroke="midnightblue" points="641.44,-24.83 632.23,-19.58 636.16,-29.42 641.44,-24.83"/>
</g>
<!-- Node70&#45;&gt;Node36 -->
<g id="edge86" class="edge">
<title>Node70&#45;&gt;Node36</title>
<path fill="none" stroke="midnightblue" d="M1286.65,-327.21C1441.9,-310.75 1851.89,-258.06 1930,-154 1957.61,-117.22 1955.38,-59.63 1951.92,-30.01"/>
<polygon fill="midnightblue" stroke="midnightblue" points="1955.35,-29.24 1950.54,-19.8 1948.41,-30.18 1955.35,-29.24"/>
</g>
<!-- Node70&#45;&gt;Node37 -->
<g id="edge87" class="edge">
<title>Node70&#45;&gt;Node37</title>
<path fill="none" stroke="midnightblue" d="M1238.18,-324.48C1250.57,-315.02 1270.79,-299.6 1285.75,-288.19"/>
<polygon fill="midnightblue" stroke="midnightblue" points="1288.02,-290.86 1293.85,-282.01 1283.77,-285.29 1288.02,-290.86"/>
</g>
<!-- Node70&#45;&gt;Node38 -->
<g id="edge89" class="edge">
<title>Node70&#45;&gt;Node38</title>
<path fill="none" stroke="midnightblue" d="M1190.53,-324.39C1143.56,-311.12 1063.82,-280.7 1029,-221 992.65,-158.68 1020.7,-67.58 1035.43,-29.16"/>
<polygon fill="midnightblue" stroke="midnightblue" points="1038.72,-30.37 1039.17,-19.79 1032.21,-27.78 1038.72,-30.37"/>
</g>
<!-- Node70&#45;&gt;Node39 -->
<g id="edge90" class="edge">
<title>Node70&#45;&gt;Node39</title>
<path fill="none" stroke="midnightblue" d="M1167.28,-325.78C1132.64,-319.6 1089.23,-308.34 1055,-288 940.61,-220.05 852.97,-78.31 824.7,-28.65"/>
<polygon fill="midnightblue" stroke="midnightblue" points="827.65,-26.76 819.71,-19.75 821.55,-30.18 827.65,-26.76"/>
</g>
<!-- Node70&#45;&gt;Node40 -->
<g id="edge91" class="edge">
<title>Node70&#45;&gt;Node40</title>
<path fill="none" stroke="midnightblue" d="M1258.23,-324.48C1290.86,-315.57 1342.89,-301.37 1383.76,-290.22"/>
<polygon fill="midnightblue" stroke="midnightblue" points="1384.9,-293.53 1393.62,-287.52 1383.05,-286.78 1384.9,-293.53"/>
</g>
<!-- Node70&#45;&gt;Node41 -->
<g id="edge92" class="edge">
<title>Node70&#45;&gt;Node41</title>
<path fill="none" stroke="midnightblue" d="M1218.78,-324.4C1197.18,-300.74 1142.71,-233.56 1176,-190 1187.34,-175.17 1425.03,-116.4 1542.9,-88.01"/>
<polygon fill="midnightblue" stroke="midnightblue" points="1543.99,-91.35 1552.89,-85.61 1542.35,-84.55 1543.99,-91.35"/>
</g>
<!-- Node73&#45;&gt;Node40 -->
<g id="edge97" class="edge">
<title>Node73&#45;&gt;Node40</title>
<path fill="none" stroke="midnightblue" d="M1761.99,-324.48C1695.61,-313.8 1581.95,-295.52 1510.28,-284"/>
<polygon fill="midnightblue" stroke="midnightblue" points="1510.45,-280.48 1500.03,-282.35 1509.34,-287.39 1510.45,-280.48"/>
</g>
<!-- Node73&#45;&gt;Node41 -->
<g id="edge98" class="edge">
<title>Node73&#45;&gt;Node41</title>
<path fill="none" stroke="midnightblue" d="M1816.87,-324.47C1821.47,-301.54 1831.51,-237.14 1811,-190 1802.54,-170.55 1760.88,-134.41 1743,-123 1720.84,-108.86 1694.14,-97.82 1670.36,-89.72"/>
<polygon fill="midnightblue" stroke="midnightblue" points="1671.31,-86.35 1660.71,-86.54 1669.11,-93 1671.31,-86.35"/>
</g>
<!-- Node77&#45;&gt;Node39 -->
<g id="edge102" class="edge">
<title>Node77&#45;&gt;Node39</title>
<path fill="none" stroke="midnightblue" d="M983.97,-332.56C939.73,-329.34 880.91,-318.85 839,-288 754.85,-226.07 785.3,-159.3 801,-56 802.37,-47 805.19,-37.33 807.95,-29.26"/>
<polygon fill="midnightblue" stroke="midnightblue" points="811.27,-30.37 811.4,-19.78 804.69,-27.98 811.27,-30.37"/>
</g>
<!-- Node77&#45;&gt;Node40 -->
<g id="edge103" class="edge">
<title>Node77&#45;&gt;Node40</title>
<path fill="none" stroke="midnightblue" d="M1103.17,-324.48C1176.38,-313.56 1302.94,-294.68 1379.82,-283.22"/>
<polygon fill="midnightblue" stroke="midnightblue" points="1380.49,-286.66 1389.86,-281.72 1379.46,-279.74 1380.49,-286.66"/>
</g>
<!-- Node77&#45;&gt;Node64 -->
<g id="edge104" class="edge">
<title>Node77&#45;&gt;Node64</title>
<path fill="none" stroke="midnightblue" d="M1044.53,-324.44C1040.9,-300.29 1034.05,-230.8 1067,-190 1084.21,-168.69 1111.39,-156.37 1136.86,-149.25"/>
<polygon fill="midnightblue" stroke="midnightblue" points="1138.07,-152.55 1146.89,-146.68 1136.33,-145.77 1138.07,-152.55"/>
</g>
<!-- Node80&#45;&gt;Node40 -->
<g id="edge106" class="edge">
<title>Node80&#45;&gt;Node40</title>
<path fill="none" stroke="midnightblue" d="M1571.8,-324.48C1550.35,-315.85 1516.55,-302.26 1489.24,-291.29"/>
<polygon fill="midnightblue" stroke="midnightblue" points="1490.46,-288.01 1479.88,-287.52 1487.85,-294.5 1490.46,-288.01"/>
</g>
<!-- Node80&#45;&gt;Node41 -->
<g id="edge107" class="edge">
<title>Node80&#45;&gt;Node41</title>
<path fill="none" stroke="midnightblue" d="M1605.76,-324.39C1629.19,-307.71 1678.38,-268.42 1697,-221 1716.19,-172.13 1667.75,-120.8 1635.04,-93.13"/>
<polygon fill="midnightblue" stroke="midnightblue" points="1637.06,-90.27 1627.11,-86.62 1632.62,-95.67 1637.06,-90.27"/>
</g>
<!-- Node81&#45;&gt;Node33 -->
<g id="edge109" class="edge">
<title>Node81&#45;&gt;Node33</title>
<path fill="none" stroke="midnightblue" d="M1176.89,-399.52C1207.44,-408.59 1253.04,-423 1283.46,-433.17"/>
<polygon fill="midnightblue" stroke="midnightblue" points="1282.56,-436.56 1293.15,-436.44 1284.8,-429.93 1282.56,-436.56"/>
</g>
</g>
</svg>
