<?xml version="1.0" encoding="UTF-8" standalone="no"?>
<!DOCTYPE svg PUBLIC "-//W3C//DTD SVG 1.1//EN"
 "http://www.w3.org/Graphics/SVG/1.1/DTD/svg11.dtd">
<!-- Generated by graphviz version 2.43.0 (0)
 -->
<!-- Title: src Pages: 1 -->
<svg width="121pt" height="167pt"
 viewBox="0.00 0.00 121.00 167.00" xmlns="http://www.w3.org/2000/svg" xmlns:xlink="http://www.w3.org/1999/xlink">
<g id="graph0" class="graph" transform="scale(1 1) rotate(0) translate(4 163)">
<title>src</title>
<polygon fill="white" stroke="transparent" points="-4,4 -4,-163 117,-163 117,4 -4,4"/>
<g id="clust1" class="cluster">
<title>clusterdir_fda4a0efc48fcf730384a6acb81f3b5f</title>
<g id="a_clust1"><a xlink:href="dir_fda4a0efc48fcf730384a6acb81f3b5f.html" target="_top" xlink:title="dmx_framework">
<polygon fill="#ddddee" stroke="black" points="8,-8 8,-151 105,-151 105,-8 8,-8"/>
<text text-anchor="middle" x="56.5" y="-139" font-family="Helvetica,sans-Serif" font-size="10.00">dmx_framework</text>
</a>
</g>
</g>
<!-- dir_08cf37bc7b05d6b7e7d7699963bcf6ea -->
<g id="node1" class="node">
<title>dir_08cf37bc7b05d6b7e7d7699963bcf6ea</title>
<g id="a_node1"><a xlink:href="dir_08cf37bc7b05d6b7e7d7699963bcf6ea.html" target="_top" xlink:title="include">
<polygon fill="none" stroke="black" points="83,-52 29,-52 29,-16 83,-16 83,-52"/>
<text text-anchor="middle" x="56" y="-31.5" font-family="Helvetica,sans-Serif" font-size="10.00">include</text>
</a>
</g>
</g>
<!-- dir_497f4d9191bf04b7515934e792e8ea39 -->
<g id="node2" class="node">
<title>dir_497f4d9191bf04b7515934e792e8ea39</title>
<g id="a_node2"><a xlink:href="dir_497f4d9191bf04b7515934e792e8ea39.html" target="_top" xlink:title="src">
<polygon fill="#eeeeff" stroke="black" points="83,-124 29,-124 29,-88 83,-88 83,-124"/>
<text text-anchor="middle" x="56" y="-103.5" font-family="Helvetica,sans-Serif" font-size="10.00">src</text>
</a>
</g>
</g>
<!-- dir_497f4d9191bf04b7515934e792e8ea39&#45;&gt;dir_08cf37bc7b05d6b7e7d7699963bcf6ea -->
<g id="edge1" class="edge">
<title>dir_497f4d9191bf04b7515934e792e8ea39&#45;&gt;dir_08cf37bc7b05d6b7e7d7699963bcf6ea</title>
<path fill="none" stroke="black" d="M56,-87.7C56,-79.98 56,-70.71 56,-62.11"/>
<polygon fill="black" stroke="black" points="59.5,-62.1 56,-52.1 52.5,-62.1 59.5,-62.1"/>
<g id="a_edge1&#45;headlabel"><a xlink:href="dir_000025_000026.html" target="_top" xlink:title="1">
<text text-anchor="middle" x="62.34" y="-63.2" font-family="Helvetica,sans-Serif" font-size="10.00">1</text>
</a>
</g>
</g>
</g>
</svg>
