<?xml version="1.0" encoding="UTF-8" standalone="no"?>
<!DOCTYPE svg PUBLIC "-//W3C//DTD SVG 1.1//EN"
 "http://www.w3.org/Graphics/SVG/1.1/DTD/svg11.dtd">
<!-- Generated by graphviz version 2.43.0 (0)
 -->
<!-- Title: cpp.ast.Node Pages: 1 -->
<svg width="676pt" height="370pt"
 viewBox="0.00 0.00 676.00 370.00" xmlns="http://www.w3.org/2000/svg" xmlns:xlink="http://www.w3.org/1999/xlink">
<g id="graph0" class="graph" transform="scale(1 1) rotate(0) translate(4 366)">
<title>cpp.ast.Node</title>
<polygon fill="white" stroke="transparent" points="-4,4 -4,-366 672,-366 672,4 -4,4"/>
<!-- Node1 -->
<g id="node1" class="node">
<title>Node1</title>
<g id="a_node1"><a xlink:title=" ">
<polygon fill="#bfbfbf" stroke="black" points="83,-228.5 83,-247.5 163,-247.5 163,-228.5 83,-228.5"/>
<text text-anchor="middle" x="123" y="-235.5" font-family="Helvetica,sans-Serif" font-size="10.00">cpp.ast.Node</text>
</a>
</g>
</g>
<!-- Node3 -->
<g id="node3" class="node">
<title>Node3</title>
<g id="a_node3"><a xlink:href="classcpp_1_1ast_1_1Define.html" target="_top" xlink:title=" ">
<polygon fill="white" stroke="black" points="233,-342.5 233,-361.5 319,-361.5 319,-342.5 233,-342.5"/>
<text text-anchor="middle" x="276" y="-349.5" font-family="Helvetica,sans-Serif" font-size="10.00">cpp.ast.Define</text>
</a>
</g>
</g>
<!-- Node1&#45;&gt;Node3 -->
<g id="edge2" class="edge">
<title>Node1&#45;&gt;Node3</title>
<path fill="none" stroke="midnightblue" d="M133.55,-256.41C145.78,-278.09 169,-313.61 199,-333 209.05,-339.5 221.17,-343.77 232.75,-346.58"/>
<polygon fill="midnightblue" stroke="midnightblue" points="136.58,-254.64 128.73,-247.53 130.43,-257.98 136.58,-254.64"/>
</g>
<!-- Node4 -->
<g id="node4" class="node">
<title>Node4</title>
<g id="a_node4"><a xlink:href="classcpp_1_1ast_1_1Expr.html" target="_top" xlink:title=" ">
<polygon fill="white" stroke="black" points="237.5,-304.5 237.5,-323.5 314.5,-323.5 314.5,-304.5 237.5,-304.5"/>
<text text-anchor="middle" x="276" y="-311.5" font-family="Helvetica,sans-Serif" font-size="10.00">cpp.ast.Expr</text>
</a>
</g>
</g>
<!-- Node1&#45;&gt;Node4 -->
<g id="edge3" class="edge">
<title>Node1&#45;&gt;Node4</title>
<path fill="none" stroke="midnightblue" d="M141.39,-254.51C155.78,-267.32 177.31,-284.59 199,-295 210.89,-300.71 224.69,-304.82 237.23,-307.72"/>
<polygon fill="midnightblue" stroke="midnightblue" points="143.54,-251.73 133.79,-247.57 138.81,-256.9 143.54,-251.73"/>
</g>
<!-- Node8 -->
<g id="node8" class="node">
<title>Node8</title>
<g id="a_node8"><a xlink:href="classcpp_1_1ast_1_1Goto.html" target="_top" xlink:title=" ">
<polygon fill="white" stroke="black" points="237,-266.5 237,-285.5 315,-285.5 315,-266.5 237,-266.5"/>
<text text-anchor="middle" x="276" y="-273.5" font-family="Helvetica,sans-Serif" font-size="10.00">cpp.ast.Goto</text>
</a>
</g>
</g>
<!-- Node1&#45;&gt;Node8 -->
<g id="edge7" class="edge">
<title>Node1&#45;&gt;Node8</title>
<path fill="none" stroke="midnightblue" d="M171.49,-250.05C180.62,-252.36 190.1,-254.76 199,-257 211.27,-260.09 224.65,-263.44 236.72,-266.46"/>
<polygon fill="midnightblue" stroke="midnightblue" points="172.32,-246.65 161.76,-247.59 170.6,-253.44 172.32,-246.65"/>
</g>
<!-- Node9 -->
<g id="node9" class="node">
<title>Node9</title>
<g id="a_node9"><a xlink:href="classcpp_1_1ast_1_1Include.html" target="_top" xlink:title=" ">
<polygon fill="white" stroke="black" points="231,-228.5 231,-247.5 321,-247.5 321,-228.5 231,-228.5"/>
<text text-anchor="middle" x="276" y="-235.5" font-family="Helvetica,sans-Serif" font-size="10.00">cpp.ast.Include</text>
</a>
</g>
</g>
<!-- Node1&#45;&gt;Node9 -->
<g id="edge8" class="edge">
<title>Node1&#45;&gt;Node9</title>
<path fill="none" stroke="midnightblue" d="M173.3,-238C191.85,-238 212.81,-238 230.86,-238"/>
<polygon fill="midnightblue" stroke="midnightblue" points="173.28,-234.5 163.28,-238 173.28,-241.5 173.28,-234.5"/>
</g>
<!-- Node10 -->
<g id="node10" class="node">
<title>Node10</title>
<g id="a_node10"><a xlink:href="classcpp_1_1ast_1_1Parameter.html" target="_top" xlink:title=" ">
<polygon fill="white" stroke="black" points="223.5,-190.5 223.5,-209.5 328.5,-209.5 328.5,-190.5 223.5,-190.5"/>
<text text-anchor="middle" x="276" y="-197.5" font-family="Helvetica,sans-Serif" font-size="10.00">cpp.ast.Parameter</text>
</a>
</g>
</g>
<!-- Node1&#45;&gt;Node10 -->
<g id="edge9" class="edge">
<title>Node1&#45;&gt;Node10</title>
<path fill="none" stroke="midnightblue" d="M171.49,-225.95C180.62,-223.64 190.1,-221.24 199,-219 211.27,-215.91 224.65,-212.56 236.72,-209.54"/>
<polygon fill="midnightblue" stroke="midnightblue" points="170.6,-222.56 161.76,-228.41 172.32,-229.35 170.6,-222.56"/>
</g>
<!-- Node11 -->
<g id="node11" class="node">
<title>Node11</title>
<g id="a_node11"><a xlink:href="classcpp_1_1ast_1_1Using.html" target="_top" xlink:title=" ">
<polygon fill="white" stroke="black" points="234.5,-152.5 234.5,-171.5 317.5,-171.5 317.5,-152.5 234.5,-152.5"/>
<text text-anchor="middle" x="276" y="-159.5" font-family="Helvetica,sans-Serif" font-size="10.00">cpp.ast.Using</text>
</a>
</g>
</g>
<!-- Node1&#45;&gt;Node11 -->
<g id="edge10" class="edge">
<title>Node1&#45;&gt;Node11</title>
<path fill="none" stroke="midnightblue" d="M141.39,-221.49C155.78,-208.68 177.31,-191.41 199,-181 210.04,-175.7 222.71,-171.78 234.5,-168.93"/>
<polygon fill="midnightblue" stroke="midnightblue" points="138.81,-219.1 133.79,-228.43 143.54,-224.27 138.81,-219.1"/>
</g>
<!-- Node12 -->
<g id="node12" class="node">
<title>Node12</title>
<g id="a_node12"><a xlink:href="classcpp_1_1ast_1_1__GenericDeclaration.html" target="_top" xlink:title=" ">
<polygon fill="white" stroke="black" points="199,-114.5 199,-133.5 353,-133.5 353,-114.5 199,-114.5"/>
<text text-anchor="middle" x="276" y="-121.5" font-family="Helvetica,sans-Serif" font-size="10.00">cpp.ast._GenericDeclaration</text>
</a>
</g>
</g>
<!-- Node1&#45;&gt;Node12 -->
<g id="edge11" class="edge">
<title>Node1&#45;&gt;Node12</title>
<path fill="none" stroke="midnightblue" d="M133.55,-219.59C145.78,-197.91 169,-162.39 199,-143 205.05,-139.09 211.86,-135.98 218.84,-133.51"/>
<polygon fill="midnightblue" stroke="midnightblue" points="130.43,-218.02 128.73,-228.47 136.58,-221.36 130.43,-218.02"/>
</g>
<!-- Node2 -->
<g id="node2" class="node">
<title>Node2</title>
<g id="a_node2"><a xlink:title=" ">
<polygon fill="white" stroke="#bfbfbf" points="0,-228.5 0,-247.5 47,-247.5 47,-228.5 0,-228.5"/>
<text text-anchor="middle" x="23.5" y="-235.5" font-family="Helvetica,sans-Serif" font-size="10.00">object</text>
</a>
</g>
</g>
<!-- Node2&#45;&gt;Node1 -->
<g id="edge1" class="edge">
<title>Node2&#45;&gt;Node1</title>
<path fill="none" stroke="midnightblue" d="M57.34,-238C65.48,-238 74.28,-238 82.69,-238"/>
<polygon fill="midnightblue" stroke="midnightblue" points="57.11,-234.5 47.11,-238 57.11,-241.5 57.11,-234.5"/>
</g>
<!-- Node5 -->
<g id="node5" class="node">
<title>Node5</title>
<g id="a_node5"><a xlink:href="classcpp_1_1ast_1_1Delete.html" target="_top" xlink:title=" ">
<polygon fill="white" stroke="black" points="421,-342.5 421,-361.5 508,-361.5 508,-342.5 421,-342.5"/>
<text text-anchor="middle" x="464.5" y="-349.5" font-family="Helvetica,sans-Serif" font-size="10.00">cpp.ast.Delete</text>
</a>
</g>
</g>
<!-- Node4&#45;&gt;Node5 -->
<g id="edge4" class="edge">
<title>Node4&#45;&gt;Node5</title>
<path fill="none" stroke="midnightblue" d="M324.87,-323.75C354.54,-329.8 392.31,-337.49 420.93,-343.33"/>
<polygon fill="midnightblue" stroke="midnightblue" points="325.24,-320.26 314.74,-321.69 323.84,-327.12 325.24,-320.26"/>
</g>
<!-- Node6 -->
<g id="node6" class="node">
<title>Node6</title>
<g id="a_node6"><a xlink:href="classcpp_1_1ast_1_1Friend.html" target="_top" xlink:title=" ">
<polygon fill="white" stroke="black" points="422,-304.5 422,-323.5 507,-323.5 507,-304.5 422,-304.5"/>
<text text-anchor="middle" x="464.5" y="-311.5" font-family="Helvetica,sans-Serif" font-size="10.00">cpp.ast.Friend</text>
</a>
</g>
</g>
<!-- Node4&#45;&gt;Node6 -->
<g id="edge5" class="edge">
<title>Node4&#45;&gt;Node6</title>
<path fill="none" stroke="midnightblue" d="M324.98,-314C354.97,-314 393.22,-314 421.92,-314"/>
<polygon fill="midnightblue" stroke="midnightblue" points="324.74,-310.5 314.74,-314 324.74,-317.5 324.74,-310.5"/>
</g>
<!-- Node7 -->
<g id="node7" class="node">
<title>Node7</title>
<g id="a_node7"><a xlink:href="classcpp_1_1ast_1_1Return.html" target="_top" xlink:title=" ">
<polygon fill="white" stroke="black" points="421,-266.5 421,-285.5 508,-285.5 508,-266.5 421,-266.5"/>
<text text-anchor="middle" x="464.5" y="-273.5" font-family="Helvetica,sans-Serif" font-size="10.00">cpp.ast.Return</text>
</a>
</g>
</g>
<!-- Node4&#45;&gt;Node7 -->
<g id="edge6" class="edge">
<title>Node4&#45;&gt;Node7</title>
<path fill="none" stroke="midnightblue" d="M324.87,-304.25C354.54,-298.2 392.31,-290.51 420.93,-284.67"/>
<polygon fill="midnightblue" stroke="midnightblue" points="323.84,-300.88 314.74,-306.31 325.24,-307.74 323.84,-300.88"/>
</g>
<!-- Node13 -->
<g id="node13" class="node">
<title>Node13</title>
<g id="a_node13"><a xlink:href="classcpp_1_1ast_1_1Class.html" target="_top" xlink:title=" ">
<polygon fill="white" stroke="black" points="424,-209.5 424,-228.5 505,-228.5 505,-209.5 424,-209.5"/>
<text text-anchor="middle" x="464.5" y="-216.5" font-family="Helvetica,sans-Serif" font-size="10.00">cpp.ast.Class</text>
</a>
</g>
</g>
<!-- Node12&#45;&gt;Node13 -->
<g id="edge12" class="edge">
<title>Node12&#45;&gt;Node13</title>
<path fill="none" stroke="midnightblue" d="M344.42,-137.72C347.42,-139.29 350.3,-141.05 353,-143 377.28,-160.56 364.76,-182.38 389,-200 399.15,-207.38 411.89,-211.9 423.95,-214.67"/>
<polygon fill="midnightblue" stroke="midnightblue" points="345.68,-134.45 335.12,-133.52 342.79,-140.82 345.68,-134.45"/>
</g>
<!-- Node15 -->
<g id="node15" class="node">
<title>Node15</title>
<g id="a_node15"><a xlink:href="classcpp_1_1ast_1_1Function.html" target="_top" xlink:title=" ">
<polygon fill="white" stroke="black" points="416.5,-171.5 416.5,-190.5 512.5,-190.5 512.5,-171.5 416.5,-171.5"/>
<text text-anchor="middle" x="464.5" y="-178.5" font-family="Helvetica,sans-Serif" font-size="10.00">cpp.ast.Function</text>
</a>
</g>
</g>
<!-- Node12&#45;&gt;Node15 -->
<g id="edge14" class="edge">
<title>Node12&#45;&gt;Node15</title>
<path fill="none" stroke="midnightblue" d="M332.94,-136.34C339.77,-138.33 346.6,-140.55 353,-143 369.9,-149.46 372.12,-155.5 389,-162 398.47,-165.65 408.88,-168.8 418.84,-171.44"/>
<polygon fill="midnightblue" stroke="midnightblue" points="333.54,-132.88 322.96,-133.6 331.68,-139.63 333.54,-132.88"/>
</g>
<!-- Node17 -->
<g id="node17" class="node">
<title>Node17</title>
<g id="a_node17"><a xlink:href="classcpp_1_1ast_1_1Type.html" target="_top" xlink:title=" ">
<polygon fill="white" stroke="black" points="426,-133.5 426,-152.5 503,-152.5 503,-133.5 426,-133.5"/>
<text text-anchor="middle" x="464.5" y="-140.5" font-family="Helvetica,sans-Serif" font-size="10.00">cpp.ast.Type</text>
</a>
</g>
</g>
<!-- Node12&#45;&gt;Node17 -->
<g id="edge16" class="edge">
<title>Node12&#45;&gt;Node17</title>
<path fill="none" stroke="midnightblue" d="M363.19,-132.78C385.22,-135.02 407.77,-137.32 425.9,-139.17"/>
<polygon fill="midnightblue" stroke="midnightblue" points="363.43,-129.29 353.13,-131.76 362.72,-136.25 363.43,-129.29"/>
</g>
<!-- Node18 -->
<g id="node18" class="node">
<title>Node18</title>
<g id="a_node18"><a xlink:href="classcpp_1_1ast_1_1Typedef.html" target="_top" xlink:title=" ">
<polygon fill="white" stroke="black" points="418,-95.5 418,-114.5 511,-114.5 511,-95.5 418,-95.5"/>
<text text-anchor="middle" x="464.5" y="-102.5" font-family="Helvetica,sans-Serif" font-size="10.00">cpp.ast.Typedef</text>
</a>
</g>
</g>
<!-- Node12&#45;&gt;Node18 -->
<g id="edge17" class="edge">
<title>Node12&#45;&gt;Node18</title>
<path fill="none" stroke="midnightblue" d="M363.23,-115.21C382.08,-113.29 401.32,-111.33 417.84,-109.65"/>
<polygon fill="midnightblue" stroke="midnightblue" points="362.72,-111.75 353.13,-116.24 363.43,-118.71 362.72,-111.75"/>
</g>
<!-- Node19 -->
<g id="node19" class="node">
<title>Node19</title>
<g id="a_node19"><a xlink:href="classcpp_1_1ast_1_1VariableDeclaration.html" target="_top" xlink:title=" ">
<polygon fill="white" stroke="black" points="389,-57.5 389,-76.5 540,-76.5 540,-57.5 389,-57.5"/>
<text text-anchor="middle" x="464.5" y="-64.5" font-family="Helvetica,sans-Serif" font-size="10.00">cpp.ast.VariableDeclaration</text>
</a>
</g>
</g>
<!-- Node12&#45;&gt;Node19 -->
<g id="edge18" class="edge">
<title>Node12&#45;&gt;Node19</title>
<path fill="none" stroke="midnightblue" d="M313.05,-110.98C334.89,-103.28 363.39,-93.6 389,-86 400.13,-82.7 412.3,-79.44 423.52,-76.59"/>
<polygon fill="midnightblue" stroke="midnightblue" points="311.77,-107.72 303.52,-114.36 314.11,-114.31 311.77,-107.72"/>
</g>
<!-- Node20 -->
<g id="node20" class="node">
<title>Node20</title>
<g id="a_node20"><a xlink:href="classcpp_1_1ast_1_1__NestedType.html" target="_top" xlink:title=" ">
<polygon fill="white" stroke="black" points="406,-19.5 406,-38.5 523,-38.5 523,-19.5 406,-19.5"/>
<text text-anchor="middle" x="464.5" y="-26.5" font-family="Helvetica,sans-Serif" font-size="10.00">cpp.ast._NestedType</text>
</a>
</g>
</g>
<!-- Node12&#45;&gt;Node20 -->
<g id="edge19" class="edge">
<title>Node12&#45;&gt;Node20</title>
<path fill="none" stroke="midnightblue" d="M296.24,-107.85C317.62,-90.68 353.78,-63.85 389,-48 397.4,-44.22 406.68,-41.1 415.76,-38.55"/>
<polygon fill="midnightblue" stroke="midnightblue" points="293.82,-105.31 288.29,-114.34 298.25,-110.73 293.82,-105.31"/>
</g>
<!-- Node14 -->
<g id="node14" class="node">
<title>Node14</title>
<g id="a_node14"><a xlink:href="classcpp_1_1ast_1_1Struct.html" target="_top" xlink:title=" ">
<polygon fill="white" stroke="black" points="580.5,-209.5 580.5,-228.5 663.5,-228.5 663.5,-209.5 580.5,-209.5"/>
<text text-anchor="middle" x="622" y="-216.5" font-family="Helvetica,sans-Serif" font-size="10.00">cpp.ast.Struct</text>
</a>
</g>
</g>
<!-- Node13&#45;&gt;Node14 -->
<g id="edge13" class="edge">
<title>Node13&#45;&gt;Node14</title>
<path fill="none" stroke="midnightblue" d="M515.18,-219C536.21,-219 560.4,-219 580.35,-219"/>
<polygon fill="midnightblue" stroke="midnightblue" points="515.14,-215.5 505.14,-219 515.14,-222.5 515.14,-215.5"/>
</g>
<!-- Node16 -->
<g id="node16" class="node">
<title>Node16</title>
<g id="a_node16"><a xlink:href="classcpp_1_1ast_1_1Method.html" target="_top" xlink:title=" ">
<polygon fill="white" stroke="black" points="576,-171.5 576,-190.5 668,-190.5 668,-171.5 576,-171.5"/>
<text text-anchor="middle" x="622" y="-178.5" font-family="Helvetica,sans-Serif" font-size="10.00">cpp.ast.Method</text>
</a>
</g>
</g>
<!-- Node15&#45;&gt;Node16 -->
<g id="edge15" class="edge">
<title>Node15&#45;&gt;Node16</title>
<path fill="none" stroke="midnightblue" d="M522.71,-181C540.27,-181 559.33,-181 575.95,-181"/>
<polygon fill="midnightblue" stroke="midnightblue" points="522.58,-177.5 512.58,-181 522.58,-184.5 522.58,-177.5"/>
</g>
<!-- Node21 -->
<g id="node21" class="node">
<title>Node21</title>
<g id="a_node21"><a xlink:href="classcpp_1_1ast_1_1Enum.html" target="_top" xlink:title=" ">
<polygon fill="white" stroke="black" points="580.5,-38.5 580.5,-57.5 663.5,-57.5 663.5,-38.5 580.5,-38.5"/>
<text text-anchor="middle" x="622" y="-45.5" font-family="Helvetica,sans-Serif" font-size="10.00">cpp.ast.Enum</text>
</a>
</g>
</g>
<!-- Node20&#45;&gt;Node21 -->
<g id="edge20" class="edge">
<title>Node20&#45;&gt;Node21</title>
<path fill="none" stroke="midnightblue" d="M533.68,-37.33C549.49,-39.26 565.83,-41.26 580.04,-42.99"/>
<polygon fill="midnightblue" stroke="midnightblue" points="533.75,-33.81 523.4,-36.07 532.9,-40.76 533.75,-33.81"/>
</g>
<!-- Node22 -->
<g id="node22" class="node">
<title>Node22</title>
<g id="a_node22"><a xlink:href="classcpp_1_1ast_1_1Union.html" target="_top" xlink:title=" ">
<polygon fill="white" stroke="black" points="580.5,-0.5 580.5,-19.5 663.5,-19.5 663.5,-0.5 580.5,-0.5"/>
<text text-anchor="middle" x="622" y="-7.5" font-family="Helvetica,sans-Serif" font-size="10.00">cpp.ast.Union</text>
</a>
</g>
</g>
<!-- Node20&#45;&gt;Node22 -->
<g id="edge21" class="edge">
<title>Node20&#45;&gt;Node22</title>
<path fill="none" stroke="midnightblue" d="M533.68,-20.67C549.49,-18.74 565.83,-16.74 580.04,-15.01"/>
<polygon fill="midnightblue" stroke="midnightblue" points="532.9,-17.24 523.4,-21.93 533.75,-24.19 532.9,-17.24"/>
</g>
</g>
</svg>
