<?xml version="1.0" encoding="UTF-8" standalone="no"?>
<!DOCTYPE svg PUBLIC "-//W3C//DTD SVG 1.1//EN"
 "http://www.w3.org/Graphics/SVG/1.1/DTD/svg11.dtd">
<!-- Generated by graphviz version 2.43.0 (0)
 -->
<!-- Title: Graphical Class Hierarchy Pages: 1 -->
<svg width="550pt" height="1178pt"
 viewBox="0.00 0.00 550.00 1177.50" xmlns="http://www.w3.org/2000/svg" xmlns:xlink="http://www.w3.org/1999/xlink">
<g id="graph0" class="graph" transform="scale(1 1) rotate(0) translate(4 1173.5)">
<title>Graphical Class Hierarchy</title>
<polygon fill="white" stroke="transparent" points="-4,4 -4,-1173.5 546,-1173.5 546,4 -4,4"/>
<!-- Node444 -->
<g id="node1" class="node">
<title>Node444</title>
<g id="a_node1"><a xlink:title=" ">
<polygon fill="white" stroke="#bfbfbf" points="0,-588 0,-607 138,-607 138,-588 0,-588"/>
<text text-anchor="middle" x="69" y="-595" font-family="Helvetica,sans-Serif" font-size="10.00">gtest_test_utils.TestCase</text>
</a>
</g>
</g>
<!-- Node0 -->
<g id="node2" class="node">
<title>Node0</title>
<g id="a_node2"><a xlink:href="classgoogletest-break-on-failure-unittest_1_1GTestBreakOnFailureUnitTest.html" target="_top" xlink:title=" ">
<polygon fill="white" stroke="black" points="188.5,-1128 188.5,-1169 340.5,-1169 340.5,-1128 188.5,-1128"/>
<text text-anchor="start" x="196.5" y="-1157" font-family="Helvetica,sans-Serif" font-size="10.00">googletest&#45;break&#45;on</text>
<text text-anchor="start" x="196.5" y="-1146" font-family="Helvetica,sans-Serif" font-size="10.00">&#45;failure&#45;unittest.GTestBreak</text>
<text text-anchor="middle" x="264.5" y="-1135" font-family="Helvetica,sans-Serif" font-size="10.00">OnFailureUnitTest</text>
</a>
</g>
</g>
<!-- Node444&#45;&gt;Node0 -->
<g id="edge1" class="edge">
<title>Node444&#45;&gt;Node0</title>
<path fill="none" stroke="midnightblue" d="M71.35,-617.41C77.56,-703.3 106.02,-1041.34 174,-1118.5 178.12,-1123.17 182.98,-1127.12 188.29,-1130.45"/>
<polygon fill="midnightblue" stroke="midnightblue" points="74.84,-617.14 70.65,-607.41 67.86,-617.63 74.84,-617.14"/>
</g>
<!-- Node446 -->
<g id="node3" class="node">
<title>Node446</title>
<g id="a_node3"><a xlink:href="classgoogletest-catch-exceptions-test_1_1CatchCxxExceptionsTest.html" target="_top" xlink:title=" ">
<polygon fill="white" stroke="black" points="184,-1078.5 184,-1108.5 345,-1108.5 345,-1078.5 184,-1078.5"/>
<text text-anchor="start" x="192" y="-1096.5" font-family="Helvetica,sans-Serif" font-size="10.00">googletest&#45;catch&#45;exceptions</text>
<text text-anchor="middle" x="264.5" y="-1085.5" font-family="Helvetica,sans-Serif" font-size="10.00">&#45;test.CatchCxxExceptionsTest</text>
</a>
</g>
</g>
<!-- Node444&#45;&gt;Node446 -->
<g id="edge2" class="edge">
<title>Node444&#45;&gt;Node446</title>
<path fill="none" stroke="midnightblue" d="M71.7,-617.66C78.94,-699.07 109.9,-1002.44 174,-1069.5 177.22,-1072.87 180.87,-1075.79 184.79,-1078.31"/>
<polygon fill="midnightblue" stroke="midnightblue" points="75.15,-616.97 70.8,-607.31 68.18,-617.58 75.15,-616.97"/>
</g>
<!-- Node447 -->
<g id="node4" class="node">
<title>Node447</title>
<g id="a_node4"><a xlink:href="classgoogletest-catch-exceptions-test_1_1CatchSehExceptionsTest.html" target="_top" xlink:title=" ">
<polygon fill="white" stroke="black" points="184,-1029.5 184,-1059.5 345,-1059.5 345,-1029.5 184,-1029.5"/>
<text text-anchor="start" x="192" y="-1047.5" font-family="Helvetica,sans-Serif" font-size="10.00">googletest&#45;catch&#45;exceptions</text>
<text text-anchor="middle" x="264.5" y="-1036.5" font-family="Helvetica,sans-Serif" font-size="10.00">&#45;test.CatchSehExceptionsTest</text>
</a>
</g>
</g>
<!-- Node444&#45;&gt;Node447 -->
<g id="edge3" class="edge">
<title>Node444&#45;&gt;Node447</title>
<path fill="none" stroke="midnightblue" d="M72.17,-617C80.91,-692.07 115.87,-961.14 174,-1020.5 177.38,-1023.95 181.19,-1026.92 185.29,-1029.47"/>
<polygon fill="midnightblue" stroke="midnightblue" points="75.64,-616.57 71.03,-607.03 68.69,-617.36 75.64,-616.57"/>
</g>
<!-- Node448 -->
<g id="node5" class="node">
<title>Node448</title>
<g id="a_node5"><a xlink:href="classgoogletest-color-test_1_1GTestColorTest.html" target="_top" xlink:title=" ">
<polygon fill="white" stroke="black" points="190,-980.5 190,-1010.5 339,-1010.5 339,-980.5 190,-980.5"/>
<text text-anchor="start" x="198" y="-998.5" font-family="Helvetica,sans-Serif" font-size="10.00">googletest&#45;color&#45;test.GTest</text>
<text text-anchor="middle" x="264.5" y="-987.5" font-family="Helvetica,sans-Serif" font-size="10.00">ColorTest</text>
</a>
</g>
</g>
<!-- Node444&#45;&gt;Node448 -->
<g id="edge4" class="edge">
<title>Node444&#45;&gt;Node448</title>
<path fill="none" stroke="midnightblue" d="M72.9,-617.39C83.47,-687.26 122.07,-920.05 174,-971.5 178.57,-976.03 183.9,-979.73 189.64,-982.75"/>
<polygon fill="midnightblue" stroke="midnightblue" points="76.33,-616.67 71.4,-607.29 69.41,-617.7 76.33,-616.67"/>
</g>
<!-- Node449 -->
<g id="node6" class="node">
<title>Node449</title>
<g id="a_node6"><a xlink:href="classgoogletest-env-var-test_1_1GTestEnvVarTest.html" target="_top" xlink:title=" ">
<polygon fill="white" stroke="black" points="203.5,-931.5 203.5,-961.5 325.5,-961.5 325.5,-931.5 203.5,-931.5"/>
<text text-anchor="start" x="211.5" y="-949.5" font-family="Helvetica,sans-Serif" font-size="10.00">googletest&#45;env&#45;var</text>
<text text-anchor="middle" x="264.5" y="-938.5" font-family="Helvetica,sans-Serif" font-size="10.00">&#45;test.GTestEnvVarTest</text>
</a>
</g>
</g>
<!-- Node444&#45;&gt;Node449 -->
<g id="edge5" class="edge">
<title>Node444&#45;&gt;Node449</title>
<path fill="none" stroke="midnightblue" d="M70.15,-617.25C71.71,-673.63 84.14,-836.83 174,-922.5 182.15,-930.27 192.54,-935.59 203.32,-939.21"/>
<polygon fill="midnightblue" stroke="midnightblue" points="73.65,-617.11 69.97,-607.17 66.65,-617.24 73.65,-617.11"/>
</g>
<!-- Node450 -->
<g id="node7" class="node">
<title>Node450</title>
<g id="a_node7"><a xlink:href="classgoogletest-failfast-unittest_1_1GTestFailFastUnitTest.html" target="_top" xlink:title=" ">
<polygon fill="white" stroke="black" points="182.5,-882.5 182.5,-912.5 346.5,-912.5 346.5,-882.5 182.5,-882.5"/>
<text text-anchor="start" x="190.5" y="-900.5" font-family="Helvetica,sans-Serif" font-size="10.00">googletest&#45;failfast</text>
<text text-anchor="middle" x="264.5" y="-889.5" font-family="Helvetica,sans-Serif" font-size="10.00">&#45;unittest.GTestFailFastUnitTest</text>
</a>
</g>
</g>
<!-- Node444&#45;&gt;Node450 -->
<g id="edge6" class="edge">
<title>Node444&#45;&gt;Node450</title>
<path fill="none" stroke="midnightblue" d="M71.44,-617.24C76.22,-667.78 96.03,-802.84 174,-873.5 177.81,-876.96 182.07,-879.92 186.61,-882.47"/>
<polygon fill="midnightblue" stroke="midnightblue" points="74.91,-616.71 70.58,-607.04 67.93,-617.3 74.91,-616.71"/>
</g>
<!-- Node451 -->
<g id="node8" class="node">
<title>Node451</title>
<g id="a_node8"><a xlink:href="classgoogletest-filter-unittest_1_1GTestFilterUnitTest.html" target="_top" xlink:title=" ">
<polygon fill="white" stroke="black" points="195,-833.5 195,-863.5 334,-863.5 334,-833.5 195,-833.5"/>
<text text-anchor="start" x="203" y="-851.5" font-family="Helvetica,sans-Serif" font-size="10.00">googletest&#45;filter&#45;unittest.</text>
<text text-anchor="middle" x="264.5" y="-840.5" font-family="Helvetica,sans-Serif" font-size="10.00">GTestFilterUnitTest</text>
</a>
</g>
</g>
<!-- Node444&#45;&gt;Node451 -->
<g id="edge7" class="edge">
<title>Node444&#45;&gt;Node451</title>
<path fill="none" stroke="midnightblue" d="M73.29,-617.55C81.65,-661.87 107.9,-768.65 174,-824.5 180.14,-829.69 187.3,-833.77 194.84,-836.97"/>
<polygon fill="midnightblue" stroke="midnightblue" points="76.7,-616.71 71.5,-607.47 69.81,-617.93 76.7,-616.71"/>
</g>
<!-- Node452 -->
<g id="node9" class="node">
<title>Node452</title>
<g id="a_node9"><a xlink:href="classgoogletest-json-outfiles-test_1_1GTestJsonOutFilesTest.html" target="_top" xlink:title=" ">
<polygon fill="white" stroke="black" points="190,-784.5 190,-814.5 339,-814.5 339,-784.5 190,-784.5"/>
<text text-anchor="start" x="198" y="-802.5" font-family="Helvetica,sans-Serif" font-size="10.00">googletest&#45;json&#45;outfiles</text>
<text text-anchor="middle" x="264.5" y="-791.5" font-family="Helvetica,sans-Serif" font-size="10.00">&#45;test.GTestJsonOutFilesTest</text>
</a>
</g>
</g>
<!-- Node444&#45;&gt;Node452 -->
<g id="edge8" class="edge">
<title>Node444&#45;&gt;Node452</title>
<path fill="none" stroke="midnightblue" d="M75.83,-616.95C87.88,-653.74 119.11,-733.6 174,-775.5 178.86,-779.21 184.25,-782.35 189.9,-785"/>
<polygon fill="midnightblue" stroke="midnightblue" points="79.16,-615.87 72.82,-607.39 72.48,-617.98 79.16,-615.87"/>
</g>
<!-- Node453 -->
<g id="node10" class="node">
<title>Node453</title>
<g id="a_node10"><a xlink:href="classgoogletest-json-output-unittest_1_1GTestJsonOutputUnitTest.html" target="_top" xlink:title=" ">
<polygon fill="white" stroke="black" points="174,-735.5 174,-765.5 355,-765.5 355,-735.5 174,-735.5"/>
<text text-anchor="start" x="182" y="-753.5" font-family="Helvetica,sans-Serif" font-size="10.00">googletest&#45;json&#45;output</text>
<text text-anchor="middle" x="264.5" y="-742.5" font-family="Helvetica,sans-Serif" font-size="10.00">&#45;unittest.GTestJsonOutputUnitTest</text>
</a>
</g>
</g>
<!-- Node444&#45;&gt;Node453 -->
<g id="edge9" class="edge">
<title>Node444&#45;&gt;Node453</title>
<path fill="none" stroke="midnightblue" d="M79.92,-616.22C95.89,-644.5 130.01,-697.86 174,-726.5 179.26,-729.92 184.99,-732.86 190.93,-735.38"/>
<polygon fill="midnightblue" stroke="midnightblue" points="82.93,-614.42 75.04,-607.34 76.79,-617.79 82.93,-614.42"/>
</g>
<!-- Node454 -->
<g id="node11" class="node">
<title>Node454</title>
<g id="a_node11"><a xlink:href="classgoogletest-list-tests-unittest_1_1GTestListTestsUnitTest.html" target="_top" xlink:title=" ">
<polygon fill="white" stroke="black" points="179.5,-686.5 179.5,-716.5 349.5,-716.5 349.5,-686.5 179.5,-686.5"/>
<text text-anchor="start" x="187.5" y="-704.5" font-family="Helvetica,sans-Serif" font-size="10.00">googletest&#45;list&#45;tests</text>
<text text-anchor="middle" x="264.5" y="-693.5" font-family="Helvetica,sans-Serif" font-size="10.00">&#45;unittest.GTestListTestsUnitTest</text>
</a>
</g>
</g>
<!-- Node444&#45;&gt;Node454 -->
<g id="edge10" class="edge">
<title>Node444&#45;&gt;Node454</title>
<path fill="none" stroke="midnightblue" d="M87.17,-614.21C106.69,-632.3 140.23,-660.81 174,-677.5 180.92,-680.92 188.4,-683.9 195.97,-686.49"/>
<polygon fill="midnightblue" stroke="midnightblue" points="89.38,-611.48 79.71,-607.15 84.57,-616.56 89.38,-611.48"/>
</g>
<!-- Node455 -->
<g id="node12" class="node">
<title>Node455</title>
<g id="a_node12"><a xlink:href="classgoogletest-output-test_1_1GTestOutputTest.html" target="_top" xlink:title=" ">
<polygon fill="white" stroke="black" points="186.5,-637.5 186.5,-667.5 342.5,-667.5 342.5,-637.5 186.5,-637.5"/>
<text text-anchor="start" x="194.5" y="-655.5" font-family="Helvetica,sans-Serif" font-size="10.00">googletest&#45;output&#45;test.GTest</text>
<text text-anchor="middle" x="264.5" y="-644.5" font-family="Helvetica,sans-Serif" font-size="10.00">OutputTest</text>
</a>
</g>
</g>
<!-- Node444&#45;&gt;Node455 -->
<g id="edge11" class="edge">
<title>Node444&#45;&gt;Node455</title>
<path fill="none" stroke="midnightblue" d="M112.54,-609.86C131.36,-615.3 153.77,-621.76 174,-627.5 185.33,-630.72 197.48,-634.13 209.05,-637.37"/>
<polygon fill="midnightblue" stroke="midnightblue" points="113.35,-606.45 102.77,-607.03 111.4,-613.17 113.35,-606.45"/>
</g>
<!-- Node456 -->
<g id="node13" class="node">
<title>Node456</title>
<g id="a_node13"><a xlink:href="classgoogletest-param-test-invalid-name1-test_1_1GTestParamTestInvalidName1Test.html" target="_top" xlink:title=" ">
<polygon fill="white" stroke="black" points="177.5,-577 177.5,-618 351.5,-618 351.5,-577 177.5,-577"/>
<text text-anchor="start" x="185.5" y="-606" font-family="Helvetica,sans-Serif" font-size="10.00">googletest&#45;param&#45;test</text>
<text text-anchor="start" x="185.5" y="-595" font-family="Helvetica,sans-Serif" font-size="10.00">&#45;invalid&#45;name1&#45;test.GTestParam</text>
<text text-anchor="middle" x="264.5" y="-584" font-family="Helvetica,sans-Serif" font-size="10.00">TestInvalidName1Test</text>
</a>
</g>
</g>
<!-- Node444&#45;&gt;Node456 -->
<g id="edge12" class="edge">
<title>Node444&#45;&gt;Node456</title>
<path fill="none" stroke="midnightblue" d="M148.41,-597.5C157.91,-597.5 167.65,-597.5 177.25,-597.5"/>
<polygon fill="midnightblue" stroke="midnightblue" points="148.22,-594 138.22,-597.5 148.22,-601 148.22,-594"/>
</g>
<!-- Node457 -->
<g id="node14" class="node">
<title>Node457</title>
<g id="a_node14"><a xlink:href="classgoogletest-param-test-invalid-name2-test_1_1GTestParamTestInvalidName2Test.html" target="_top" xlink:title=" ">
<polygon fill="white" stroke="black" points="177.5,-517 177.5,-558 351.5,-558 351.5,-517 177.5,-517"/>
<text text-anchor="start" x="185.5" y="-546" font-family="Helvetica,sans-Serif" font-size="10.00">googletest&#45;param&#45;test</text>
<text text-anchor="start" x="185.5" y="-535" font-family="Helvetica,sans-Serif" font-size="10.00">&#45;invalid&#45;name2&#45;test.GTestParam</text>
<text text-anchor="middle" x="264.5" y="-524" font-family="Helvetica,sans-Serif" font-size="10.00">TestInvalidName2Test</text>
</a>
</g>
</g>
<!-- Node444&#45;&gt;Node457 -->
<g id="edge13" class="edge">
<title>Node444&#45;&gt;Node457</title>
<path fill="none" stroke="midnightblue" d="M110.24,-585.02C135.39,-577.22 168.39,-566.99 197.33,-558.02"/>
<polygon fill="midnightblue" stroke="midnightblue" points="109.18,-581.69 100.66,-587.99 111.25,-588.37 109.18,-581.69"/>
</g>
<!-- Node458 -->
<g id="node15" class="node">
<title>Node458</title>
<g id="a_node15"><a xlink:href="classgoogletest-setuptestsuite-test_1_1GTestSetUpTestSuiteTest.html" target="_top" xlink:title=" ">
<polygon fill="white" stroke="black" points="183.5,-467.5 183.5,-497.5 345.5,-497.5 345.5,-467.5 183.5,-467.5"/>
<text text-anchor="start" x="191.5" y="-485.5" font-family="Helvetica,sans-Serif" font-size="10.00">googletest&#45;setuptestsuite</text>
<text text-anchor="middle" x="264.5" y="-474.5" font-family="Helvetica,sans-Serif" font-size="10.00">&#45;test.GTestSetUpTestSuiteTest</text>
</a>
</g>
</g>
<!-- Node444&#45;&gt;Node458 -->
<g id="edge14" class="edge">
<title>Node444&#45;&gt;Node458</title>
<path fill="none" stroke="midnightblue" d="M85.34,-580.22C104.26,-559.95 138.32,-526.66 174,-507.5 181.11,-503.68 188.85,-500.4 196.71,-497.6"/>
<polygon fill="midnightblue" stroke="midnightblue" points="82.59,-578.05 78.42,-587.79 87.75,-582.78 82.59,-578.05"/>
</g>
<!-- Node459 -->
<g id="node16" class="node">
<title>Node459</title>
<g id="a_node16"><a xlink:href="classgoogletest-shuffle-test_1_1GTestShuffleUnitTest.html" target="_top" xlink:title=" ">
<polygon fill="white" stroke="black" points="193,-418.5 193,-448.5 336,-448.5 336,-418.5 193,-418.5"/>
<text text-anchor="start" x="201" y="-436.5" font-family="Helvetica,sans-Serif" font-size="10.00">googletest&#45;shuffle</text>
<text text-anchor="middle" x="264.5" y="-425.5" font-family="Helvetica,sans-Serif" font-size="10.00">&#45;test.GTestShuffleUnitTest</text>
</a>
</g>
</g>
<!-- Node444&#45;&gt;Node459 -->
<g id="edge15" class="edge">
<title>Node444&#45;&gt;Node459</title>
<path fill="none" stroke="midnightblue" d="M78.93,-578.66C94.14,-548.61 127.98,-490.02 174,-458.5 179.72,-454.58 186.05,-451.27 192.61,-448.48"/>
<polygon fill="midnightblue" stroke="midnightblue" points="75.76,-577.16 74.49,-587.68 82.05,-580.25 75.76,-577.16"/>
</g>
<!-- Node460 -->
<g id="node17" class="node">
<title>Node460</title>
<g id="a_node17"><a xlink:href="classgoogletest-throw-on-failure-test_1_1ThrowOnFailureTest.html" target="_top" xlink:title=" ">
<polygon fill="white" stroke="black" points="178,-369.5 178,-399.5 351,-399.5 351,-369.5 178,-369.5"/>
<text text-anchor="start" x="186" y="-387.5" font-family="Helvetica,sans-Serif" font-size="10.00">googletest&#45;throw&#45;on</text>
<text text-anchor="middle" x="264.5" y="-376.5" font-family="Helvetica,sans-Serif" font-size="10.00">&#45;failure&#45;test.ThrowOnFailureTest</text>
</a>
</g>
</g>
<!-- Node444&#45;&gt;Node460 -->
<g id="edge16" class="edge">
<title>Node444&#45;&gt;Node460</title>
<path fill="none" stroke="midnightblue" d="M75.22,-578.11C86.54,-539.88 117.01,-454.56 174,-409.5 178.94,-405.6 184.44,-402.3 190.24,-399.53"/>
<polygon fill="midnightblue" stroke="midnightblue" points="71.79,-577.4 72.42,-587.98 78.52,-579.31 71.79,-577.4"/>
</g>
<!-- Node461 -->
<g id="node18" class="node">
<title>Node461</title>
<g id="a_node18"><a xlink:href="classgoogletest-uninitialized-test_1_1GTestUninitializedTest.html" target="_top" xlink:title=" ">
<polygon fill="white" stroke="black" points="189.5,-320.5 189.5,-350.5 339.5,-350.5 339.5,-320.5 189.5,-320.5"/>
<text text-anchor="start" x="197.5" y="-338.5" font-family="Helvetica,sans-Serif" font-size="10.00">googletest&#45;uninitialized</text>
<text text-anchor="middle" x="264.5" y="-327.5" font-family="Helvetica,sans-Serif" font-size="10.00">&#45;test.GTestUninitializedTest</text>
</a>
</g>
</g>
<!-- Node444&#45;&gt;Node461 -->
<g id="edge17" class="edge">
<title>Node444&#45;&gt;Node461</title>
<path fill="none" stroke="midnightblue" d="M72.9,-577.56C80.59,-532.01 105.8,-419.69 174,-360.5 178.63,-356.48 183.86,-353.11 189.4,-350.27"/>
<polygon fill="midnightblue" stroke="midnightblue" points="69.41,-577.2 71.3,-587.63 76.32,-578.3 69.41,-577.2"/>
</g>
<!-- Node462 -->
<g id="node19" class="node">
<title>Node462</title>
<g id="a_node19"><a xlink:href="classgtest__help__test_1_1GTestHelpTest.html" target="_top" xlink:title=" ">
<polygon fill="white" stroke="black" points="182.5,-282 182.5,-301 346.5,-301 346.5,-282 182.5,-282"/>
<text text-anchor="middle" x="264.5" y="-289" font-family="Helvetica,sans-Serif" font-size="10.00">gtest_help_test.GTestHelpTest</text>
</a>
</g>
</g>
<!-- Node444&#45;&gt;Node462 -->
<g id="edge18" class="edge">
<title>Node444&#45;&gt;Node462</title>
<path fill="none" stroke="midnightblue" d="M70.97,-577.55C74.66,-525.29 92.09,-383.48 174,-311.5 178.9,-307.19 184.53,-303.75 190.53,-301.01"/>
<polygon fill="midnightblue" stroke="midnightblue" points="67.46,-577.61 70.35,-587.8 74.45,-578.03 67.46,-577.61"/>
</g>
<!-- Node463 -->
<g id="node20" class="node">
<title>Node463</title>
<g id="a_node20"><a xlink:href="classgtest__list__output__unittest_1_1GTestListTestsOutputUnitTest.html" target="_top" xlink:title=" ">
<polygon fill="white" stroke="black" points="185.5,-232.5 185.5,-262.5 343.5,-262.5 343.5,-232.5 185.5,-232.5"/>
<text text-anchor="start" x="193.5" y="-250.5" font-family="Helvetica,sans-Serif" font-size="10.00">gtest_list_output_unittest.</text>
<text text-anchor="middle" x="264.5" y="-239.5" font-family="Helvetica,sans-Serif" font-size="10.00">GTestListTestsOutputUnitTest</text>
</a>
</g>
</g>
<!-- Node444&#45;&gt;Node463 -->
<g id="edge19" class="edge">
<title>Node444&#45;&gt;Node463</title>
<path fill="none" stroke="midnightblue" d="M70.2,-577.8C71.87,-521.53 84.59,-358.63 174,-272.5 177.95,-268.69 182.43,-265.46 187.23,-262.71"/>
<polygon fill="midnightblue" stroke="midnightblue" points="66.7,-577.78 69.99,-587.85 73.7,-577.93 66.7,-577.78"/>
</g>
<!-- Node464 -->
<g id="node21" class="node">
<title>Node464</title>
<g id="a_node21"><a xlink:href="classgtest__skip__check__output__test_1_1SkipEntireEnvironmentTest.html" target="_top" xlink:title=" ">
<polygon fill="white" stroke="black" points="177,-183.5 177,-213.5 352,-213.5 352,-183.5 177,-183.5"/>
<text text-anchor="start" x="185" y="-201.5" font-family="Helvetica,sans-Serif" font-size="10.00">gtest_skip_check_output</text>
<text text-anchor="middle" x="264.5" y="-190.5" font-family="Helvetica,sans-Serif" font-size="10.00">_test.SkipEntireEnvironmentTest</text>
</a>
</g>
</g>
<!-- Node444&#45;&gt;Node464 -->
<g id="edge20" class="edge">
<title>Node444&#45;&gt;Node464</title>
<path fill="none" stroke="midnightblue" d="M69.22,-577.39C67.95,-515.3 72.88,-324.74 174,-223.5 177.88,-219.62 182.3,-216.33 187.06,-213.54"/>
<polygon fill="midnightblue" stroke="midnightblue" points="65.73,-577.84 69.52,-587.74 72.73,-577.64 65.73,-577.84"/>
</g>
<!-- Node465 -->
<g id="node22" class="node">
<title>Node465</title>
<g id="a_node22"><a xlink:href="classgtest__skip__environment__check__output__test_1_1SkipEntireEnvironmentTest.html" target="_top" xlink:title=" ">
<polygon fill="white" stroke="black" points="182.5,-123 182.5,-164 346.5,-164 346.5,-123 182.5,-123"/>
<text text-anchor="start" x="190.5" y="-152" font-family="Helvetica,sans-Serif" font-size="10.00">gtest_skip_environment</text>
<text text-anchor="start" x="190.5" y="-141" font-family="Helvetica,sans-Serif" font-size="10.00">_check_output_test.SkipEntire</text>
<text text-anchor="middle" x="264.5" y="-130" font-family="Helvetica,sans-Serif" font-size="10.00">EnvironmentTest</text>
</a>
</g>
</g>
<!-- Node444&#45;&gt;Node465 -->
<g id="edge21" class="edge">
<title>Node444&#45;&gt;Node465</title>
<path fill="none" stroke="midnightblue" d="M72.36,-577.63C81.68,-502.35 118.15,-235.76 174,-174.5 177.55,-170.61 181.6,-167.21 185.99,-164.24"/>
<polygon fill="midnightblue" stroke="midnightblue" points="68.88,-577.31 71.14,-587.66 75.82,-578.16 68.88,-577.31"/>
</g>
<!-- Node466 -->
<g id="node23" class="node">
<title>Node466</title>
<g id="a_node23"><a xlink:href="classgtest__testbridge__test_1_1GTestTestFilterTest.html" target="_top" xlink:title=" ">
<polygon fill="white" stroke="black" points="189.5,-73.5 189.5,-103.5 339.5,-103.5 339.5,-73.5 189.5,-73.5"/>
<text text-anchor="start" x="197.5" y="-91.5" font-family="Helvetica,sans-Serif" font-size="10.00">gtest_testbridge_test.GTest</text>
<text text-anchor="middle" x="264.5" y="-80.5" font-family="Helvetica,sans-Serif" font-size="10.00">TestFilterTest</text>
</a>
</g>
</g>
<!-- Node444&#45;&gt;Node466 -->
<g id="edge22" class="edge">
<title>Node444&#45;&gt;Node466</title>
<path fill="none" stroke="midnightblue" d="M71.59,-577.39C78.53,-494.81 108.74,-182.85 174,-113.5 178.42,-108.8 183.65,-104.96 189.32,-101.82"/>
<polygon fill="midnightblue" stroke="midnightblue" points="68.06,-577.6 70.74,-587.85 75.04,-578.17 68.06,-577.6"/>
</g>
<!-- Node467 -->
<g id="node24" class="node">
<title>Node467</title>
<g id="a_node24"><a xlink:href="classgtest__xml__test__utils_1_1GTestXMLTestCase.html" target="_top" xlink:title=" ">
<polygon fill="white" stroke="black" points="191.5,-24.5 191.5,-54.5 337.5,-54.5 337.5,-24.5 191.5,-24.5"/>
<text text-anchor="start" x="199.5" y="-42.5" font-family="Helvetica,sans-Serif" font-size="10.00">gtest_xml_test_utils.GTest</text>
<text text-anchor="middle" x="264.5" y="-31.5" font-family="Helvetica,sans-Serif" font-size="10.00">XMLTestCase</text>
</a>
</g>
</g>
<!-- Node444&#45;&gt;Node467 -->
<g id="edge23" class="edge">
<title>Node444&#45;&gt;Node467</title>
<path fill="none" stroke="midnightblue" d="M71.15,-577.61C76.59,-490.31 102.54,-141.9 174,-64.5 178.92,-59.17 184.88,-54.93 191.36,-51.58"/>
<polygon fill="midnightblue" stroke="midnightblue" points="67.65,-577.55 70.54,-587.75 74.63,-577.97 67.65,-577.55"/>
</g>
<!-- Node468 -->
<g id="node25" class="node">
<title>Node468</title>
<g id="a_node25"><a xlink:href="classgtest__xml__outfiles__test_1_1GTestXMLOutFilesTest.html" target="_top" xlink:title=" ">
<polygon fill="white" stroke="black" points="391,-49.5 391,-79.5 542,-79.5 542,-49.5 391,-49.5"/>
<text text-anchor="start" x="399" y="-67.5" font-family="Helvetica,sans-Serif" font-size="10.00">gtest_xml_outfiles</text>
<text text-anchor="middle" x="466.5" y="-56.5" font-family="Helvetica,sans-Serif" font-size="10.00">_test.GTestXMLOutFilesTest</text>
</a>
</g>
</g>
<!-- Node467&#45;&gt;Node468 -->
<g id="edge24" class="edge">
<title>Node467&#45;&gt;Node468</title>
<path fill="none" stroke="midnightblue" d="M347.92,-49.8C362.09,-51.57 376.75,-53.41 390.71,-55.15"/>
<polygon fill="midnightblue" stroke="midnightblue" points="348.06,-46.29 337.7,-48.53 347.19,-53.24 348.06,-46.29"/>
</g>
<!-- Node469 -->
<g id="node26" class="node">
<title>Node469</title>
<g id="a_node26"><a xlink:href="classgtest__xml__output__unittest_1_1GTestXMLOutputUnitTest.html" target="_top" xlink:title=" ">
<polygon fill="white" stroke="black" points="392.5,-0.5 392.5,-30.5 540.5,-30.5 540.5,-0.5 392.5,-0.5"/>
<text text-anchor="start" x="400.5" y="-18.5" font-family="Helvetica,sans-Serif" font-size="10.00">gtest_xml_output_unittest.</text>
<text text-anchor="middle" x="466.5" y="-7.5" font-family="Helvetica,sans-Serif" font-size="10.00">GTestXMLOutputUnitTest</text>
</a>
</g>
</g>
<!-- Node467&#45;&gt;Node469 -->
<g id="edge25" class="edge">
<title>Node467&#45;&gt;Node469</title>
<path fill="none" stroke="midnightblue" d="M347.83,-29.62C362.6,-27.85 377.9,-26.01 392.39,-24.27"/>
<polygon fill="midnightblue" stroke="midnightblue" points="347.22,-26.17 337.7,-30.84 348.05,-33.12 347.22,-26.17"/>
</g>
</g>
</svg>
