<?xml version="1.0" encoding="UTF-8" standalone="no"?>
<!DOCTYPE svg PUBLIC "-//W3C//DTD SVG 1.1//EN"
 "http://www.w3.org/Graphics/SVG/1.1/DTD/svg11.dtd">
<!-- Generated by graphviz version 2.43.0 (0)
 -->
<!-- Title: Graphical Class Hierarchy Pages: 1 -->
<svg width="330pt" height="252pt"
 viewBox="0.00 0.00 330.00 251.50" xmlns="http://www.w3.org/2000/svg" xmlns:xlink="http://www.w3.org/1999/xlink">
<g id="graph0" class="graph" transform="scale(1 1) rotate(0) translate(4 247.5)">
<title>Graphical Class Hierarchy</title>
<polygon fill="white" stroke="transparent" points="-4,4 -4,-247.5 326,-247.5 326,4 -4,4"/>
<!-- Node0 -->
<g id="node1" class="node">
<title>Node0</title>
<g id="a_node1"><a xlink:href="classtesting_1_1Environment.html" target="_top" xlink:title=" ">
<polygon fill="white" stroke="black" points="0,-126 0,-145 119,-145 119,-126 0,-126"/>
<text text-anchor="middle" x="59.5" y="-133" font-family="Helvetica,sans-Serif" font-size="10.00">testing::Environment</text>
</a>
</g>
</g>
<!-- Node1 -->
<g id="node2" class="node">
<title>Node1</title>
<g id="a_node2"><a xlink:href="classBarEnvironment.html" target="_top" xlink:title=" ">
<polygon fill="white" stroke="black" points="191,-224 191,-243 286,-243 286,-224 191,-224"/>
<text text-anchor="middle" x="238.5" y="-231" font-family="Helvetica,sans-Serif" font-size="10.00">BarEnvironment</text>
</a>
</g>
</g>
<!-- Node0&#45;&gt;Node1 -->
<g id="edge1" class="edge">
<title>Node0&#45;&gt;Node1</title>
<path fill="none" stroke="midnightblue" d="M76.21,-152.76C93.68,-170.89 123.62,-198.9 155,-214.5 166.06,-220 178.74,-223.93 190.79,-226.74"/>
<polygon fill="midnightblue" stroke="midnightblue" points="78.5,-150.09 69.09,-145.2 73.4,-154.88 78.5,-150.09"/>
</g>
<!-- Node2 -->
<g id="node3" class="node">
<title>Node2</title>
<g id="a_node3"><a xlink:href="classFooEnvironment.html" target="_top" xlink:title=" ">
<polygon fill="white" stroke="black" points="190.5,-186 190.5,-205 286.5,-205 286.5,-186 190.5,-186"/>
<text text-anchor="middle" x="238.5" y="-193" font-family="Helvetica,sans-Serif" font-size="10.00">FooEnvironment</text>
</a>
</g>
</g>
<!-- Node0&#45;&gt;Node2 -->
<g id="edge2" class="edge">
<title>Node0&#45;&gt;Node2</title>
<path fill="none" stroke="midnightblue" d="M88.69,-149.35C107.21,-158.04 132.14,-168.98 155,-176.5 166.31,-180.22 178.72,-183.49 190.41,-186.22"/>
<polygon fill="midnightblue" stroke="midnightblue" points="90.18,-146.18 79.64,-145.04 87.17,-152.5 90.18,-146.18"/>
</g>
<!-- Node3 -->
<g id="node4" class="node">
<title>Node3</title>
<g id="a_node4"><a xlink:href="classSetupEnvironment.html" target="_top" xlink:title=" ">
<polygon fill="white" stroke="black" points="185,-148 185,-167 292,-167 292,-148 185,-148"/>
<text text-anchor="middle" x="238.5" y="-155" font-family="Helvetica,sans-Serif" font-size="10.00">SetupEnvironment</text>
</a>
</g>
</g>
<!-- Node0&#45;&gt;Node3 -->
<g id="edge3" class="edge">
<title>Node0&#45;&gt;Node3</title>
<path fill="none" stroke="midnightblue" d="M129.5,-144.08C147.87,-146.36 167.43,-148.79 184.77,-150.95"/>
<polygon fill="midnightblue" stroke="midnightblue" points="129.79,-140.59 119.44,-142.83 128.93,-147.53 129.79,-140.59"/>
</g>
<!-- Node4 -->
<g id="node5" class="node">
<title>Node4</title>
<g id="a_node5"><a xlink:href="classTestGenerationEnvironment.html" target="_top" xlink:title=" ">
<polygon fill="white" stroke="black" points="162.5,-98.5 162.5,-128.5 314.5,-128.5 314.5,-98.5 162.5,-98.5"/>
<text text-anchor="start" x="170.5" y="-116.5" font-family="Helvetica,sans-Serif" font-size="10.00">TestGenerationEnvironment</text>
<text text-anchor="middle" x="238.5" y="-105.5" font-family="Helvetica,sans-Serif" font-size="10.00">&lt; kExpectedCalls &gt;</text>
</a>
</g>
</g>
<!-- Node0&#45;&gt;Node4 -->
<g id="edge4" class="edge">
<title>Node0&#45;&gt;Node4</title>
<path fill="none" stroke="midnightblue" d="M129.62,-126.91C140.38,-125.57 151.55,-124.18 162.45,-122.83"/>
<polygon fill="midnightblue" stroke="midnightblue" points="128.93,-123.47 119.44,-128.17 129.79,-130.41 128.93,-123.47"/>
</g>
<!-- Node5 -->
<g id="node6" class="node">
<title>Node5</title>
<g id="a_node6"><a xlink:href="classtesting_1_1internal_1_1EnvironmentInvocationCatcher.html" target="_top" xlink:title=" ">
<polygon fill="white" stroke="black" points="155,-49.5 155,-79.5 322,-79.5 322,-49.5 155,-49.5"/>
<text text-anchor="start" x="163" y="-67.5" font-family="Helvetica,sans-Serif" font-size="10.00">testing::internal::</text>
<text text-anchor="middle" x="238.5" y="-56.5" font-family="Helvetica,sans-Serif" font-size="10.00">EnvironmentInvocationCatcher</text>
</a>
</g>
</g>
<!-- Node0&#45;&gt;Node5 -->
<g id="edge5" class="edge">
<title>Node0&#45;&gt;Node5</title>
<path fill="none" stroke="midnightblue" d="M86.96,-121.22C105.63,-111.49 131.42,-98.74 155,-89.5 164.06,-85.95 173.83,-82.59 183.38,-79.55"/>
<polygon fill="midnightblue" stroke="midnightblue" points="85.1,-118.24 77.89,-126 88.37,-124.43 85.1,-118.24"/>
</g>
<!-- Node6 -->
<g id="node7" class="node">
<title>Node6</title>
<g id="a_node7"><a xlink:href="classtesting_1_1internal_1_1FinalSuccessChecker.html" target="_top" xlink:title=" ">
<polygon fill="white" stroke="black" points="179.5,-0.5 179.5,-30.5 297.5,-30.5 297.5,-0.5 179.5,-0.5"/>
<text text-anchor="start" x="187.5" y="-18.5" font-family="Helvetica,sans-Serif" font-size="10.00">testing::internal::</text>
<text text-anchor="middle" x="238.5" y="-7.5" font-family="Helvetica,sans-Serif" font-size="10.00">FinalSuccessChecker</text>
</a>
</g>
</g>
<!-- Node0&#45;&gt;Node6 -->
<g id="edge6" class="edge">
<title>Node0&#45;&gt;Node6</title>
<path fill="none" stroke="midnightblue" d="M73.67,-117.67C90.33,-96.34 120.98,-60.95 155,-40.5 162.44,-36.03 170.74,-32.3 179.14,-29.21"/>
<polygon fill="midnightblue" stroke="midnightblue" points="70.7,-115.8 67.42,-125.87 76.26,-120.04 70.7,-115.8"/>
</g>
</g>
</svg>
