<?xml version="1.0" encoding="UTF-8" standalone="no"?>
<!DOCTYPE svg PUBLIC "-//W3C//DTD SVG 1.1//EN"
 "http://www.w3.org/Graphics/SVG/1.1/DTD/svg11.dtd">
<!-- Generated by graphviz version 2.43.0 (0)
 -->
<!-- Title: reload_media_file Pages: 1 -->
<svg width="189pt" height="28pt"
 viewBox="0.00 0.00 189.00 28.00" xmlns="http://www.w3.org/2000/svg" xmlns:xlink="http://www.w3.org/1999/xlink">
<g id="graph0" class="graph" transform="scale(1 1) rotate(0) translate(4 24)">
<title>reload_media_file</title>
<polygon fill="white" stroke="transparent" points="-4,4 -4,-24 185,-24 185,4 -4,4"/>
<!-- Node1 -->
<g id="node1" class="node">
<title>Node1</title>
<g id="a_node1"><a xlink:title="Reloads mediafile.">
<polygon fill="#bfbfbf" stroke="black" points="77,-0.5 77,-19.5 181,-19.5 181,-0.5 77,-0.5"/>
<text text-anchor="middle" x="129" y="-7.5" font-family="Helvetica,sans-Serif" font-size="10.00">reload_media_file</text>
</a>
</g>
</g>
<!-- Node2 -->
<g id="node2" class="node">
<title>Node2</title>
<g id="a_node2"><a xlink:href="main_8cpp.html#a62ff4bbdad1e8b10ee0771f049752381" target="_top" xlink:title="Main function for core application.">
<polygon fill="white" stroke="black" points="0,-0.5 0,-19.5 41,-19.5 41,-0.5 0,-0.5"/>
<text text-anchor="middle" x="20.5" y="-7.5" font-family="Helvetica,sans-Serif" font-size="10.00">main</text>
</a>
</g>
</g>
<!-- Node1&#45;&gt;Node2 -->
<g id="edge1" class="edge">
<title>Node1&#45;&gt;Node2</title>
<path fill="none" stroke="midnightblue" d="M66.83,-10C57.58,-10 48.66,-10 41.22,-10"/>
<polygon fill="midnightblue" stroke="midnightblue" points="66.93,-13.5 76.93,-10 66.93,-6.5 66.93,-13.5"/>
</g>
</g>
</svg>
