<?xml version="1.0" encoding="UTF-8" standalone="no"?>
<!DOCTYPE svg PUBLIC "-//W3C//DTD SVG 1.1//EN"
 "http://www.w3.org/Graphics/SVG/1.1/DTD/svg11.dtd">
<!-- Generated by graphviz version 2.43.0 (0)
 -->
<!-- Title: media_framework.cpp Pages: 1 -->
<svg width="1425pt" height="588pt"
 viewBox="0.00 0.00 1424.50 588.00" xmlns="http://www.w3.org/2000/svg" xmlns:xlink="http://www.w3.org/1999/xlink">
<g id="graph0" class="graph" transform="scale(1 1) rotate(0) translate(4 584)">
<title>media_framework.cpp</title>
<polygon fill="white" stroke="transparent" points="-4,4 -4,-584 1420.5,-584 1420.5,4 -4,4"/>
<!-- Node1 -->
<g id="node1" class="node">
<title>Node1</title>
<g id="a_node1"><a xlink:title=" ">
<polygon fill="#bfbfbf" stroke="black" points="860,-560.5 860,-579.5 986,-579.5 986,-560.5 860,-560.5"/>
<text text-anchor="middle" x="923" y="-567.5" font-family="Helvetica,sans-Serif" font-size="10.00">media_framework.cpp</text>
</a>
</g>
</g>
<!-- Node2 -->
<g id="node2" class="node">
<title>Node2</title>
<g id="a_node2"><a xlink:href="media__framework_8hpp.html" target="_top" xlink:title=" ">
<polygon fill="white" stroke="black" points="612.5,-504.5 612.5,-523.5 739.5,-523.5 739.5,-504.5 612.5,-504.5"/>
<text text-anchor="middle" x="676" y="-511.5" font-family="Helvetica,sans-Serif" font-size="10.00">media_framework.hpp</text>
</a>
</g>
</g>
<!-- Node1&#45;&gt;Node2 -->
<g id="edge1" class="edge">
<title>Node1&#45;&gt;Node2</title>
<path fill="none" stroke="midnightblue" d="M883.86,-560.44C840.77,-551.02 771.44,-535.87 724.83,-525.68"/>
<polygon fill="midnightblue" stroke="midnightblue" points="725.47,-522.23 714.95,-523.52 723.98,-529.07 725.47,-522.23"/>
</g>
<!-- Node3 -->
<g id="node3" class="node">
<title>Node3</title>
<g id="a_node3"><a xlink:href="Prelude_8hpp.html" target="_top" xlink:title="Includes call C++ Wrappers for Gstreamer.">
<polygon fill="white" stroke="black" points="547,-448.5 547,-467.5 621,-467.5 621,-448.5 547,-448.5"/>
<text text-anchor="middle" x="584" y="-455.5" font-family="Helvetica,sans-Serif" font-size="10.00">Prelude.hpp</text>
</a>
</g>
</g>
<!-- Node1&#45;&gt;Node3 -->
<g id="edge41" class="edge">
<title>Node1&#45;&gt;Node3</title>
<path fill="none" stroke="midnightblue" d="M859.72,-568.02C777.59,-565.45 640.34,-556.3 603,-524 589.82,-512.6 585.53,-492.61 584.26,-477.8"/>
<polygon fill="midnightblue" stroke="midnightblue" points="587.75,-477.53 583.77,-467.71 580.76,-477.87 587.75,-477.53"/>
</g>
<!-- Node11 -->
<g id="node11" class="node">
<title>Node11</title>
<g id="a_node11"><a xlink:title=" ">
<polygon fill="white" stroke="#bfbfbf" points="809.5,-56.5 809.5,-75.5 912.5,-75.5 912.5,-56.5 809.5,-56.5"/>
<text text-anchor="middle" x="861" y="-63.5" font-family="Helvetica,sans-Serif" font-size="10.00">gst/gstmessage.h</text>
</a>
</g>
</g>
<!-- Node1&#45;&gt;Node11 -->
<g id="edge47" class="edge">
<title>Node1&#45;&gt;Node11</title>
<path fill="none" stroke="midnightblue" d="M923,-560.44C923,-541.94 923,-496.81 923,-459 923,-459 923,-459 923,-177 923,-146.9 919.05,-138.07 904,-112 897.61,-100.94 887.96,-90.49 879.41,-82.46"/>
<polygon fill="midnightblue" stroke="midnightblue" points="881.48,-79.62 871.7,-75.55 876.81,-84.83 881.48,-79.62"/>
</g>
<!-- Node13 -->
<g id="node13" class="node">
<title>Node13</title>
<g id="a_node13"><a xlink:title=" ">
<polygon fill="white" stroke="#bfbfbf" points="457.5,-56.5 457.5,-75.5 546.5,-75.5 546.5,-56.5 457.5,-56.5"/>
<text text-anchor="middle" x="502" y="-63.5" font-family="Helvetica,sans-Serif" font-size="10.00">gst/gstobject.h</text>
</a>
</g>
</g>
<!-- Node1&#45;&gt;Node13 -->
<g id="edge48" class="edge">
<title>Node1&#45;&gt;Node13</title>
<path fill="none" stroke="midnightblue" d="M886.66,-560.39C840.85,-547.12 768,-516.91 768,-459 768,-459 768,-459 768,-233 768,-177.99 781.4,-150.38 742,-112 735.36,-105.53 625.62,-86.87 556.86,-75.72"/>
<polygon fill="midnightblue" stroke="midnightblue" points="557.05,-72.2 546.62,-74.06 555.93,-79.11 557.05,-72.2"/>
</g>
<!-- Node14 -->
<g id="node14" class="node">
<title>Node14</title>
<g id="a_node14"><a xlink:title=" ">
<polygon fill="white" stroke="#bfbfbf" points="357,-0.5 357,-19.5 401,-19.5 401,-0.5 357,-0.5"/>
<text text-anchor="middle" x="379" y="-7.5" font-family="Helvetica,sans-Serif" font-size="10.00">string</text>
</a>
</g>
</g>
<!-- Node1&#45;&gt;Node14 -->
<g id="edge52" class="edge">
<title>Node1&#45;&gt;Node14</title>
<path fill="none" stroke="midnightblue" d="M928.28,-560.23C938.73,-542.04 961,-498.6 961,-459 961,-459 961,-459 961,-121 961,-87.31 950.61,-73.8 922,-56 878.62,-29.01 521.69,-15.52 411.37,-11.97"/>
<polygon fill="midnightblue" stroke="midnightblue" points="411.29,-8.47 401.19,-11.65 411.07,-15.47 411.29,-8.47"/>
</g>
<!-- Node15 -->
<g id="node15" class="node">
<title>Node15</title>
<g id="a_node15"><a xlink:title=" ">
<polygon fill="white" stroke="#bfbfbf" points="657,-112.5 657,-131.5 733,-131.5 733,-112.5 657,-112.5"/>
<text text-anchor="middle" x="695" y="-119.5" font-family="Helvetica,sans-Serif" font-size="10.00">gst/gstbus.h</text>
</a>
</g>
</g>
<!-- Node1&#45;&gt;Node15 -->
<g id="edge44" class="edge">
<title>Node1&#45;&gt;Node15</title>
<path fill="none" stroke="midnightblue" d="M917.44,-560.27C906.45,-542.15 883,-498.83 883,-459 883,-459 883,-459 883,-233 883,-168.21 798.79,-140.87 743.09,-129.88"/>
<polygon fill="midnightblue" stroke="midnightblue" points="743.52,-126.4 733.04,-128.01 742.24,-133.28 743.52,-126.4"/>
</g>
<!-- Node16 -->
<g id="node16" class="node">
<title>Node16</title>
<g id="a_node16"><a xlink:href="Pad_8hpp_source.html" target="_top" xlink:title=" ">
<polygon fill="white" stroke="black" points="238.5,-168.5 238.5,-187.5 317.5,-187.5 317.5,-168.5 238.5,-168.5"/>
<text text-anchor="middle" x="278" y="-175.5" font-family="Helvetica,sans-Serif" font-size="10.00">core/Pad.hpp</text>
</a>
</g>
</g>
<!-- Node1&#45;&gt;Node16 -->
<g id="edge42" class="edge">
<title>Node1&#45;&gt;Node16</title>
<path fill="none" stroke="midnightblue" d="M859.71,-567.79C657.15,-563.07 38,-541.88 38,-459 38,-459 38,-459 38,-345 38,-253.25 158.1,-208.24 228.38,-189.75"/>
<polygon fill="midnightblue" stroke="midnightblue" points="229.54,-193.07 238.37,-187.22 227.81,-186.29 229.54,-193.07"/>
</g>
<!-- Node18 -->
<g id="node18" class="node">
<title>Node18</title>
<g id="a_node18"><a xlink:href="Structure_8hpp_source.html" target="_top" xlink:title=" ">
<polygon fill="white" stroke="black" points="30,-56.5 30,-75.5 136,-75.5 136,-56.5 30,-56.5"/>
<text text-anchor="middle" x="83" y="-63.5" font-family="Helvetica,sans-Serif" font-size="10.00">core/Structure.hpp</text>
</a>
</g>
</g>
<!-- Node1&#45;&gt;Node18 -->
<g id="edge43" class="edge">
<title>Node1&#45;&gt;Node18</title>
<path fill="none" stroke="midnightblue" d="M859.83,-569.35C694.08,-569.67 249.84,-566.42 110,-524 55.66,-507.52 0,-515.79 0,-459 0,-459 0,-459 0,-177 0,-135.91 37.36,-100.44 61.95,-81.55"/>
<polygon fill="midnightblue" stroke="midnightblue" points="64.07,-84.33 70.03,-75.57 59.91,-78.7 64.07,-84.33"/>
</g>
<!-- Node28 -->
<g id="node28" class="node">
<title>Node28</title>
<g id="a_node28"><a xlink:title=" ">
<polygon fill="white" stroke="#bfbfbf" points="989,-504.5 989,-523.5 1073,-523.5 1073,-504.5 989,-504.5"/>
<text text-anchor="middle" x="1031" y="-511.5" font-family="Helvetica,sans-Serif" font-size="10.00">gst/gstclock.h</text>
</a>
</g>
</g>
<!-- Node1&#45;&gt;Node28 -->
<g id="edge45" class="edge">
<title>Node1&#45;&gt;Node28</title>
<path fill="none" stroke="midnightblue" d="M940.35,-560.32C957.67,-551.66 984.52,-538.24 1004.5,-528.25"/>
<polygon fill="midnightblue" stroke="midnightblue" points="1006.31,-531.26 1013.69,-523.65 1003.18,-525 1006.31,-531.26"/>
</g>
<!-- Node29 -->
<g id="node29" class="node">
<title>Node29</title>
<g id="a_node29"><a xlink:title=" ">
<polygon fill="white" stroke="#bfbfbf" points="1091.5,-504.5 1091.5,-523.5 1168.5,-523.5 1168.5,-504.5 1091.5,-504.5"/>
<text text-anchor="middle" x="1130" y="-511.5" font-family="Helvetica,sans-Serif" font-size="10.00">gst/gstinfo.h</text>
</a>
</g>
</g>
<!-- Node1&#45;&gt;Node29 -->
<g id="edge46" class="edge">
<title>Node1&#45;&gt;Node29</title>
<path fill="none" stroke="midnightblue" d="M955.8,-560.44C991.38,-551.16 1048.31,-536.31 1087.35,-526.13"/>
<polygon fill="midnightblue" stroke="midnightblue" points="1088.56,-529.43 1097.35,-523.52 1086.79,-522.65 1088.56,-529.43"/>
</g>
<!-- Node30 -->
<g id="node30" class="node">
<title>Node30</title>
<g id="a_node30"><a xlink:title=" ">
<polygon fill="white" stroke="#bfbfbf" points="1187,-504.5 1187,-523.5 1255,-523.5 1255,-504.5 1187,-504.5"/>
<text text-anchor="middle" x="1221" y="-511.5" font-family="Helvetica,sans-Serif" font-size="10.00">filesystem</text>
</a>
</g>
</g>
<!-- Node1&#45;&gt;Node30 -->
<g id="edge49" class="edge">
<title>Node1&#45;&gt;Node30</title>
<path fill="none" stroke="midnightblue" d="M974.37,-560.43C1023.72,-552.08 1100.63,-538.78 1176.54,-524.24"/>
<polygon fill="midnightblue" stroke="midnightblue" points="1177.59,-527.6 1186.75,-522.27 1176.27,-520.72 1177.59,-527.6"/>
</g>
<!-- Node31 -->
<g id="node31" class="node">
<title>Node31</title>
<g id="a_node31"><a xlink:title=" ">
<polygon fill="white" stroke="#bfbfbf" points="1273,-504.5 1273,-523.5 1333,-523.5 1333,-504.5 1273,-504.5"/>
<text text-anchor="middle" x="1303" y="-511.5" font-family="Helvetica,sans-Serif" font-size="10.00">iostream</text>
</a>
</g>
</g>
<!-- Node1&#45;&gt;Node31 -->
<g id="edge50" class="edge">
<title>Node1&#45;&gt;Node31</title>
<path fill="none" stroke="midnightblue" d="M986.13,-562.5C1052.64,-555.23 1160.62,-542.28 1262.94,-524.04"/>
<polygon fill="midnightblue" stroke="midnightblue" points="1263.6,-527.48 1272.83,-522.26 1262.36,-520.59 1263.6,-527.48"/>
</g>
<!-- Node32 -->
<g id="node32" class="node">
<title>Node32</title>
<g id="a_node32"><a xlink:title=" ">
<polygon fill="white" stroke="#bfbfbf" points="1351.5,-504.5 1351.5,-523.5 1416.5,-523.5 1416.5,-504.5 1351.5,-504.5"/>
<text text-anchor="middle" x="1384" y="-511.5" font-family="Helvetica,sans-Serif" font-size="10.00">stdexcept</text>
</a>
</g>
</g>
<!-- Node1&#45;&gt;Node32 -->
<g id="edge51" class="edge">
<title>Node1&#45;&gt;Node32</title>
<path fill="none" stroke="midnightblue" d="M986.09,-564.28C1066.33,-557.83 1209.29,-544.79 1341.17,-523.98"/>
<polygon fill="midnightblue" stroke="midnightblue" points="1341.72,-527.43 1351.05,-522.4 1340.62,-520.52 1341.72,-527.43"/>
</g>
<!-- Node2&#45;&gt;Node3 -->
<g id="edge2" class="edge">
<title>Node2&#45;&gt;Node3</title>
<path fill="none" stroke="midnightblue" d="M661.22,-504.32C646.73,-495.82 624.43,-482.73 607.51,-472.8"/>
<polygon fill="midnightblue" stroke="midnightblue" points="609.14,-469.7 598.74,-467.65 605.6,-475.74 609.14,-469.7"/>
</g>
<!-- Node4 -->
<g id="node4" class="node">
<title>Node4</title>
<g id="a_node4"><a xlink:href="core_8hpp_source.html" target="_top" xlink:title=" ">
<polygon fill="white" stroke="black" points="507.5,-392.5 507.5,-411.5 566.5,-411.5 566.5,-392.5 507.5,-392.5"/>
<text text-anchor="middle" x="537" y="-399.5" font-family="Helvetica,sans-Serif" font-size="10.00">core.hpp</text>
</a>
</g>
</g>
<!-- Node3&#45;&gt;Node4 -->
<g id="edge3" class="edge">
<title>Node3&#45;&gt;Node4</title>
<path fill="none" stroke="midnightblue" d="M576.24,-448.08C569.46,-440.3 559.46,-428.8 551.24,-419.37"/>
<polygon fill="midnightblue" stroke="midnightblue" points="553.82,-417 544.62,-411.75 548.54,-421.59 553.82,-417"/>
</g>
<!-- Node5 -->
<g id="node5" class="node">
<title>Node5</title>
<g id="a_node5"><a xlink:href="Bin_8hpp_source.html" target="_top" xlink:title=" ">
<polygon fill="white" stroke="black" points="412.5,-280.5 412.5,-299.5 489.5,-299.5 489.5,-280.5 412.5,-280.5"/>
<text text-anchor="middle" x="451" y="-287.5" font-family="Helvetica,sans-Serif" font-size="10.00">core/Bin.hpp</text>
</a>
</g>
</g>
<!-- Node4&#45;&gt;Node5 -->
<g id="edge4" class="edge">
<title>Node4&#45;&gt;Node5</title>
<path fill="none" stroke="midnightblue" d="M530.25,-392.37C516,-374.14 482.61,-331.43 464.04,-307.68"/>
<polygon fill="midnightblue" stroke="midnightblue" points="466.63,-305.31 457.72,-299.59 461.12,-309.63 466.63,-305.31"/>
</g>
<!-- Node6 -->
<g id="node6" class="node">
<title>Node6</title>
<g id="a_node6"><a xlink:href="Element_8hpp_source.html" target="_top" xlink:title=" ">
<polygon fill="white" stroke="black" points="334,-224.5 334,-243.5 436,-243.5 436,-224.5 334,-224.5"/>
<text text-anchor="middle" x="385" y="-231.5" font-family="Helvetica,sans-Serif" font-size="10.00">core/Element.hpp</text>
</a>
</g>
</g>
<!-- Node4&#45;&gt;Node6 -->
<g id="edge30" class="edge">
<title>Node4&#45;&gt;Node6</title>
<path fill="none" stroke="midnightblue" d="M536.65,-392.44C535.32,-370.76 528.9,-313.05 498,-280 482.75,-263.69 460.81,-253.17 440.32,-246.45"/>
<polygon fill="midnightblue" stroke="midnightblue" points="441.31,-243.09 430.73,-243.53 439.28,-249.79 441.31,-243.09"/>
</g>
<!-- Node7 -->
<g id="node7" class="node">
<title>Node7</title>
<g id="a_node7"><a xlink:href="Bus_8hpp_source.html" target="_top" xlink:title=" ">
<polygon fill="white" stroke="black" points="660,-168.5 660,-187.5 740,-187.5 740,-168.5 660,-168.5"/>
<text text-anchor="middle" x="700" y="-175.5" font-family="Helvetica,sans-Serif" font-size="10.00">core/Bus.hpp</text>
</a>
</g>
</g>
<!-- Node4&#45;&gt;Node7 -->
<g id="edge27" class="edge">
<title>Node4&#45;&gt;Node7</title>
<path fill="none" stroke="midnightblue" d="M566.96,-395.93C591.47,-390.27 625.35,-378.73 646,-356 687.55,-310.29 697.15,-233.4 699.35,-197.95"/>
<polygon fill="midnightblue" stroke="midnightblue" points="702.86,-197.78 699.85,-187.62 695.87,-197.44 702.86,-197.78"/>
</g>
<!-- Node8 -->
<g id="node8" class="node">
<title>Node8</title>
<g id="a_node8"><a xlink:href="Clock_8hpp_source.html" target="_top" xlink:title=" ">
<polygon fill="white" stroke="black" points="549.5,-112.5 549.5,-131.5 638.5,-131.5 638.5,-112.5 549.5,-112.5"/>
<text text-anchor="middle" x="594" y="-119.5" font-family="Helvetica,sans-Serif" font-size="10.00">core/Clock.hpp</text>
</a>
</g>
</g>
<!-- Node4&#45;&gt;Node8 -->
<g id="edge29" class="edge">
<title>Node4&#45;&gt;Node8</title>
<path fill="none" stroke="midnightblue" d="M552.69,-392.4C579.67,-376.31 632,-338.94 632,-291 632,-291 632,-291 632,-233 632,-198.81 615.4,-161.76 604.14,-140.57"/>
<polygon fill="midnightblue" stroke="midnightblue" points="607.18,-138.83 599.28,-131.77 601.05,-142.22 607.18,-138.83"/>
</g>
<!-- Node10 -->
<g id="node10" class="node">
<title>Node10</title>
<g id="a_node10"><a xlink:href="Message_8hpp_source.html" target="_top" xlink:title=" ">
<polygon fill="white" stroke="black" points="789.5,-112.5 789.5,-131.5 894.5,-131.5 894.5,-112.5 789.5,-112.5"/>
<text text-anchor="middle" x="842" y="-119.5" font-family="Helvetica,sans-Serif" font-size="10.00">core/Message.hpp</text>
</a>
</g>
</g>
<!-- Node4&#45;&gt;Node10 -->
<g id="edge34" class="edge">
<title>Node4&#45;&gt;Node10</title>
<path fill="none" stroke="midnightblue" d="M566.63,-396.15C639.96,-383.33 824,-345.69 824,-291 824,-291 824,-291 824,-233 824,-200.54 831.73,-163.38 837.06,-141.63"/>
<polygon fill="midnightblue" stroke="midnightblue" points="840.49,-142.32 839.57,-131.76 833.71,-140.59 840.49,-142.32"/>
</g>
<!-- Node12 -->
<g id="node12" class="node">
<title>Node12</title>
<g id="a_node12"><a xlink:href="Object_8hpp_source.html" target="_top" xlink:title=" ">
<polygon fill="white" stroke="black" points="438.5,-112.5 438.5,-131.5 531.5,-131.5 531.5,-112.5 438.5,-112.5"/>
<text text-anchor="middle" x="485" y="-119.5" font-family="Helvetica,sans-Serif" font-size="10.00">core/Object.hpp</text>
</a>
</g>
</g>
<!-- Node4&#45;&gt;Node12 -->
<g id="edge35" class="edge">
<title>Node4&#45;&gt;Node12</title>
<path fill="none" stroke="midnightblue" d="M545.17,-392.38C560.93,-374.81 594,-332.94 594,-291 594,-291 594,-291 594,-233 594,-202.2 590.28,-191.18 570,-168 557.13,-153.29 538.27,-142.63 521.57,-135.38"/>
<polygon fill="midnightblue" stroke="midnightblue" points="522.64,-132.04 512.06,-131.51 520,-138.52 522.64,-132.04"/>
</g>
<!-- Node4&#45;&gt;Node16 -->
<g id="edge36" class="edge">
<title>Node4&#45;&gt;Node16</title>
<path fill="none" stroke="midnightblue" d="M507.42,-398.44C421.8,-390.35 177.03,-362.06 133,-300 98.26,-251.04 187.4,-210.21 240.97,-190.94"/>
<polygon fill="midnightblue" stroke="midnightblue" points="242.25,-194.2 250.53,-187.59 239.93,-187.59 242.25,-194.2"/>
</g>
<!-- Node17 -->
<g id="node17" class="node">
<title>Node17</title>
<g id="a_node17"><a xlink:href="Caps_8hpp_source.html" target="_top" xlink:title=" ">
<polygon fill="white" stroke="black" points="334,-112.5 334,-131.5 420,-131.5 420,-112.5 334,-112.5"/>
<text text-anchor="middle" x="377" y="-119.5" font-family="Helvetica,sans-Serif" font-size="10.00">core/Caps.hpp</text>
</a>
</g>
</g>
<!-- Node4&#45;&gt;Node17 -->
<g id="edge28" class="edge">
<title>Node4&#45;&gt;Node17</title>
<path fill="none" stroke="midnightblue" d="M539.56,-392.25C544.75,-373.74 556,-329.18 556,-291 556,-291 556,-291 556,-233 556,-201.18 550.01,-188.88 526,-168 511.28,-155.19 465.74,-142.52 428.85,-133.9"/>
<polygon fill="midnightblue" stroke="midnightblue" points="429.24,-130.39 418.71,-131.58 427.67,-137.22 429.24,-130.39"/>
</g>
<!-- Node4&#45;&gt;Node18 -->
<g id="edge40" class="edge">
<title>Node4&#45;&gt;Node18</title>
<path fill="none" stroke="midnightblue" d="M507.42,-399.38C433.83,-395.01 244.28,-381.55 187,-356 152.17,-340.47 140.71,-333.23 122,-300 81.91,-228.78 80.6,-127.26 81.99,-85.77"/>
<polygon fill="midnightblue" stroke="midnightblue" points="85.49,-85.87 82.42,-75.73 78.5,-85.57 85.49,-85.87"/>
</g>
<!-- Node25 -->
<g id="node25" class="node">
<title>Node25</title>
<g id="a_node25"><a xlink:href="ElementFactory_8hpp_source.html" target="_top" xlink:title=" ">
<polygon fill="white" stroke="black" points="142,-280.5 142,-299.5 278,-299.5 278,-280.5 142,-280.5"/>
<text text-anchor="middle" x="210" y="-287.5" font-family="Helvetica,sans-Serif" font-size="10.00">core/ElementFactory.hpp</text>
</a>
</g>
</g>
<!-- Node4&#45;&gt;Node25 -->
<g id="edge31" class="edge">
<title>Node4&#45;&gt;Node25</title>
<path fill="none" stroke="midnightblue" d="M507.5,-396.45C468.6,-389.96 398.37,-376.5 341,-356 301.78,-341.99 259.03,-319.24 233.38,-304.71"/>
<polygon fill="midnightblue" stroke="midnightblue" points="234.85,-301.52 224.43,-299.58 231.37,-307.59 234.85,-301.52"/>
</g>
<!-- Node26 -->
<g id="node26" class="node">
<title>Node26</title>
<g id="a_node26"><a xlink:href="Pipeline_8hpp_source.html" target="_top" xlink:title=" ">
<polygon fill="white" stroke="black" points="350.5,-336.5 350.5,-355.5 451.5,-355.5 451.5,-336.5 350.5,-336.5"/>
<text text-anchor="middle" x="401" y="-343.5" font-family="Helvetica,sans-Serif" font-size="10.00">core/Pipeline.hpp</text>
</a>
</g>
</g>
<!-- Node4&#45;&gt;Node26 -->
<g id="edge37" class="edge">
<title>Node4&#45;&gt;Node26</title>
<path fill="none" stroke="midnightblue" d="M515.45,-392.44C492.97,-383.52 457.51,-369.44 432.02,-359.32"/>
<polygon fill="midnightblue" stroke="midnightblue" points="433.03,-355.95 422.45,-355.52 430.45,-362.46 433.03,-355.95"/>
</g>
<!-- Node5&#45;&gt;Node6 -->
<g id="edge5" class="edge">
<title>Node5&#45;&gt;Node6</title>
<path fill="none" stroke="midnightblue" d="M440.4,-280.32C430.54,-272.26 415.65,-260.08 403.78,-250.37"/>
<polygon fill="midnightblue" stroke="midnightblue" points="405.75,-247.46 395.8,-243.83 401.32,-252.88 405.75,-247.46"/>
</g>
<!-- Node24 -->
<g id="node24" class="node">
<title>Node24</title>
<g id="a_node24"><a xlink:title=" ">
<polygon fill="white" stroke="#bfbfbf" points="454,-224.5 454,-243.5 528,-243.5 528,-224.5 454,-224.5"/>
<text text-anchor="middle" x="491" y="-231.5" font-family="Helvetica,sans-Serif" font-size="10.00">gst/gstbin.h</text>
</a>
</g>
</g>
<!-- Node5&#45;&gt;Node24 -->
<g id="edge26" class="edge">
<title>Node5&#45;&gt;Node24</title>
<path fill="none" stroke="midnightblue" d="M457.61,-280.08C463.26,-272.46 471.54,-261.26 478.45,-251.94"/>
<polygon fill="midnightblue" stroke="midnightblue" points="481.38,-253.87 484.52,-243.75 475.75,-249.7 481.38,-253.87"/>
</g>
<!-- Node6&#45;&gt;Node7 -->
<g id="edge6" class="edge">
<title>Node6&#45;&gt;Node7</title>
<path fill="none" stroke="midnightblue" d="M434.91,-224.44C493.66,-214.37 590.67,-197.74 649.63,-187.64"/>
<polygon fill="midnightblue" stroke="midnightblue" points="650.55,-191.03 659.82,-185.89 649.37,-184.13 650.55,-191.03"/>
</g>
<!-- Node6&#45;&gt;Node16 -->
<g id="edge15" class="edge">
<title>Node6&#45;&gt;Node16</title>
<path fill="none" stroke="midnightblue" d="M367.81,-224.32C350.65,-215.66 324.05,-202.24 304.25,-192.25"/>
<polygon fill="midnightblue" stroke="midnightblue" points="305.65,-189.04 295.15,-187.65 302.5,-195.28 305.65,-189.04"/>
</g>
<!-- Node22 -->
<g id="node22" class="node">
<title>Node22</title>
<g id="a_node22"><a xlink:title=" ">
<polygon fill="white" stroke="#bfbfbf" points="335.5,-168.5 335.5,-187.5 434.5,-187.5 434.5,-168.5 335.5,-168.5"/>
<text text-anchor="middle" x="385" y="-175.5" font-family="Helvetica,sans-Serif" font-size="10.00">gst/gstelement.h</text>
</a>
</g>
</g>
<!-- Node6&#45;&gt;Node22 -->
<g id="edge24" class="edge">
<title>Node6&#45;&gt;Node22</title>
<path fill="none" stroke="midnightblue" d="M385,-224.08C385,-217.01 385,-206.86 385,-197.99"/>
<polygon fill="midnightblue" stroke="midnightblue" points="388.5,-197.75 385,-187.75 381.5,-197.75 388.5,-197.75"/>
</g>
<!-- Node23 -->
<g id="node23" class="node">
<title>Node23</title>
<g id="a_node23"><a xlink:title=" ">
<polygon fill="white" stroke="#bfbfbf" points="452.5,-168.5 452.5,-187.5 517.5,-187.5 517.5,-168.5 452.5,-168.5"/>
<text text-anchor="middle" x="485" y="-175.5" font-family="Helvetica,sans-Serif" font-size="10.00">functional</text>
</a>
</g>
</g>
<!-- Node6&#45;&gt;Node23 -->
<g id="edge25" class="edge">
<title>Node6&#45;&gt;Node23</title>
<path fill="none" stroke="midnightblue" d="M401.07,-224.32C416.96,-215.74 441.51,-202.49 459.96,-192.52"/>
<polygon fill="midnightblue" stroke="midnightblue" points="461.84,-195.49 468.97,-187.65 458.51,-189.33 461.84,-195.49"/>
</g>
<!-- Node7&#45;&gt;Node8 -->
<g id="edge7" class="edge">
<title>Node7&#45;&gt;Node8</title>
<path fill="none" stroke="midnightblue" d="M682.97,-168.32C665.97,-159.66 639.62,-146.24 620.01,-136.25"/>
<polygon fill="midnightblue" stroke="midnightblue" points="621.49,-133.08 610.99,-131.65 618.31,-139.31 621.49,-133.08"/>
</g>
<!-- Node7&#45;&gt;Node10 -->
<g id="edge9" class="edge">
<title>Node7&#45;&gt;Node10</title>
<path fill="none" stroke="midnightblue" d="M722.5,-168.44C746.08,-159.48 783.32,-145.31 809.96,-135.18"/>
<polygon fill="midnightblue" stroke="midnightblue" points="811.5,-138.34 819.6,-131.52 809.01,-131.8 811.5,-138.34"/>
</g>
<!-- Node7&#45;&gt;Node12 -->
<g id="edge11" class="edge">
<title>Node7&#45;&gt;Node12</title>
<path fill="none" stroke="midnightblue" d="M665.93,-168.44C628.82,-159.12 569.34,-144.18 528.79,-134"/>
<polygon fill="midnightblue" stroke="midnightblue" points="529.46,-130.56 518.91,-131.52 527.75,-137.35 529.46,-130.56"/>
</g>
<!-- Node7&#45;&gt;Node15 -->
<g id="edge14" class="edge">
<title>Node7&#45;&gt;Node15</title>
<path fill="none" stroke="midnightblue" d="M699.17,-168.08C698.52,-161.01 697.58,-150.86 696.76,-141.99"/>
<polygon fill="midnightblue" stroke="midnightblue" points="700.22,-141.39 695.81,-131.75 693.25,-142.03 700.22,-141.39"/>
</g>
<!-- Node9 -->
<g id="node9" class="node">
<title>Node9</title>
<g id="a_node9"><a xlink:title=" ">
<polygon fill="white" stroke="#bfbfbf" points="569,-56.5 569,-75.5 619,-75.5 619,-56.5 569,-56.5"/>
<text text-anchor="middle" x="594" y="-63.5" font-family="Helvetica,sans-Serif" font-size="10.00">cstdint</text>
</a>
</g>
</g>
<!-- Node8&#45;&gt;Node9 -->
<g id="edge8" class="edge">
<title>Node8&#45;&gt;Node9</title>
<path fill="none" stroke="midnightblue" d="M594,-112.08C594,-105.01 594,-94.86 594,-85.99"/>
<polygon fill="midnightblue" stroke="midnightblue" points="597.5,-85.75 594,-75.75 590.5,-85.75 597.5,-85.75"/>
</g>
<!-- Node10&#45;&gt;Node11 -->
<g id="edge10" class="edge">
<title>Node10&#45;&gt;Node11</title>
<path fill="none" stroke="midnightblue" d="M845.14,-112.08C847.68,-104.85 851.36,-94.41 854.53,-85.4"/>
<polygon fill="midnightblue" stroke="midnightblue" points="857.9,-86.35 857.92,-75.75 851.3,-84.02 857.9,-86.35"/>
</g>
<!-- Node12&#45;&gt;Node13 -->
<g id="edge12" class="edge">
<title>Node12&#45;&gt;Node13</title>
<path fill="none" stroke="midnightblue" d="M487.81,-112.08C490.08,-104.85 493.37,-94.41 496.21,-85.4"/>
<polygon fill="midnightblue" stroke="midnightblue" points="499.58,-86.34 499.25,-75.75 492.9,-84.24 499.58,-86.34"/>
</g>
<!-- Node12&#45;&gt;Node14 -->
<g id="edge13" class="edge">
<title>Node12&#45;&gt;Node14</title>
<path fill="none" stroke="midnightblue" d="M476.68,-112.37C458.96,-93.97 417.23,-50.67 394.47,-27.05"/>
<polygon fill="midnightblue" stroke="midnightblue" points="396.74,-24.36 387.28,-19.59 391.7,-29.22 396.74,-24.36"/>
</g>
<!-- Node16&#45;&gt;Node12 -->
<g id="edge22" class="edge">
<title>Node16&#45;&gt;Node12</title>
<path fill="none" stroke="midnightblue" d="M310.8,-168.44C346.38,-159.16 403.31,-144.31 442.35,-134.13"/>
<polygon fill="midnightblue" stroke="midnightblue" points="443.56,-137.43 452.35,-131.52 441.79,-130.65 443.56,-137.43"/>
</g>
<!-- Node16&#45;&gt;Node17 -->
<g id="edge16" class="edge">
<title>Node16&#45;&gt;Node17</title>
<path fill="none" stroke="midnightblue" d="M293.91,-168.32C309.64,-159.74 333.94,-146.49 352.21,-136.52"/>
<polygon fill="midnightblue" stroke="midnightblue" points="354.03,-139.52 361.13,-131.65 350.68,-133.37 354.03,-139.52"/>
</g>
<!-- Node21 -->
<g id="node21" class="node">
<title>Node21</title>
<g id="a_node21"><a xlink:title=" ">
<polygon fill="white" stroke="#bfbfbf" points="238.5,-112.5 238.5,-131.5 315.5,-131.5 315.5,-112.5 238.5,-112.5"/>
<text text-anchor="middle" x="277" y="-119.5" font-family="Helvetica,sans-Serif" font-size="10.00">gst/gstpad.h</text>
</a>
</g>
</g>
<!-- Node16&#45;&gt;Node21 -->
<g id="edge23" class="edge">
<title>Node16&#45;&gt;Node21</title>
<path fill="none" stroke="midnightblue" d="M277.83,-168.08C277.7,-161.01 277.52,-150.86 277.35,-141.99"/>
<polygon fill="midnightblue" stroke="midnightblue" points="280.85,-141.68 277.16,-131.75 273.85,-141.81 280.85,-141.68"/>
</g>
<!-- Node17&#45;&gt;Node14 -->
<g id="edge21" class="edge">
<title>Node17&#45;&gt;Node14</title>
<path fill="none" stroke="midnightblue" d="M377.16,-112.37C377.48,-94.62 378.22,-53.67 378.66,-29.6"/>
<polygon fill="midnightblue" stroke="midnightblue" points="382.16,-29.65 378.84,-19.59 375.16,-29.53 382.16,-29.65"/>
</g>
<!-- Node17&#45;&gt;Node18 -->
<g id="edge17" class="edge">
<title>Node17&#45;&gt;Node18</title>
<path fill="none" stroke="midnightblue" d="M333.94,-113.09C282.48,-103.64 196.23,-87.8 139.47,-77.37"/>
<polygon fill="midnightblue" stroke="midnightblue" points="140.05,-73.92 129.58,-75.56 138.78,-80.8 140.05,-73.92"/>
</g>
<!-- Node20 -->
<g id="node20" class="node">
<title>Node20</title>
<g id="a_node20"><a xlink:title=" ">
<polygon fill="white" stroke="#bfbfbf" points="269.5,-56.5 269.5,-75.5 350.5,-75.5 350.5,-56.5 269.5,-56.5"/>
<text text-anchor="middle" x="310" y="-63.5" font-family="Helvetica,sans-Serif" font-size="10.00">gst/gstcaps.h</text>
</a>
</g>
</g>
<!-- Node17&#45;&gt;Node20 -->
<g id="edge20" class="edge">
<title>Node17&#45;&gt;Node20</title>
<path fill="none" stroke="midnightblue" d="M366.24,-112.32C356.23,-104.26 341.11,-92.08 329.07,-82.37"/>
<polygon fill="midnightblue" stroke="midnightblue" points="330.94,-79.38 320.96,-75.83 326.55,-84.83 330.94,-79.38"/>
</g>
<!-- Node18&#45;&gt;Node14 -->
<g id="edge19" class="edge">
<title>Node18&#45;&gt;Node14</title>
<path fill="none" stroke="midnightblue" d="M129.9,-56.44C190.45,-45.4 294.23,-26.46 346.67,-16.9"/>
<polygon fill="midnightblue" stroke="midnightblue" points="347.53,-20.3 356.74,-15.06 346.27,-13.41 347.53,-20.3"/>
</g>
<!-- Node19 -->
<g id="node19" class="node">
<title>Node19</title>
<g id="a_node19"><a xlink:title=" ">
<polygon fill="white" stroke="#bfbfbf" points="32,-0.5 32,-19.5 134,-19.5 134,-0.5 32,-0.5"/>
<text text-anchor="middle" x="83" y="-7.5" font-family="Helvetica,sans-Serif" font-size="10.00">gst/gststructure.h</text>
</a>
</g>
</g>
<!-- Node18&#45;&gt;Node19 -->
<g id="edge18" class="edge">
<title>Node18&#45;&gt;Node19</title>
<path fill="none" stroke="midnightblue" d="M83,-56.08C83,-49.01 83,-38.86 83,-29.99"/>
<polygon fill="midnightblue" stroke="midnightblue" points="86.5,-29.75 83,-19.75 79.5,-29.75 86.5,-29.75"/>
</g>
<!-- Node25&#45;&gt;Node6 -->
<g id="edge32" class="edge">
<title>Node25&#45;&gt;Node6</title>
<path fill="none" stroke="midnightblue" d="M237.73,-280.44C267.43,-271.28 314.72,-256.69 347.67,-246.52"/>
<polygon fill="midnightblue" stroke="midnightblue" points="348.88,-249.81 357.4,-243.52 346.81,-243.12 348.88,-249.81"/>
</g>
<!-- Node25&#45;&gt;Node14 -->
<g id="edge33" class="edge">
<title>Node25&#45;&gt;Node14</title>
<path fill="none" stroke="midnightblue" d="M210,-280.44C210,-261.94 210,-216.81 210,-179 210,-179 210,-179 210,-121 210,-56.29 298.12,-27.68 347.09,-16.77"/>
<polygon fill="midnightblue" stroke="midnightblue" points="347.84,-20.19 356.91,-14.71 346.4,-13.34 347.84,-20.19"/>
</g>
<!-- Node26&#45;&gt;Node5 -->
<g id="edge38" class="edge">
<title>Node26&#45;&gt;Node5</title>
<path fill="none" stroke="midnightblue" d="M409.26,-336.08C416.46,-328.3 427.11,-316.8 435.85,-307.37"/>
<polygon fill="midnightblue" stroke="midnightblue" points="438.67,-309.47 442.9,-299.75 433.53,-304.71 438.67,-309.47"/>
</g>
<!-- Node27 -->
<g id="node27" class="node">
<title>Node27</title>
<g id="a_node27"><a xlink:title=" ">
<polygon fill="white" stroke="#bfbfbf" points="296,-280.5 296,-299.5 394,-299.5 394,-280.5 296,-280.5"/>
<text text-anchor="middle" x="345" y="-287.5" font-family="Helvetica,sans-Serif" font-size="10.00">gst/gstpipeline.h</text>
</a>
</g>
</g>
<!-- Node26&#45;&gt;Node27 -->
<g id="edge39" class="edge">
<title>Node26&#45;&gt;Node27</title>
<path fill="none" stroke="midnightblue" d="M392,-336.32C383.81,-328.42 371.49,-316.55 361.53,-306.94"/>
<polygon fill="midnightblue" stroke="midnightblue" points="363.79,-304.26 354.16,-299.83 358.93,-309.29 363.79,-304.26"/>
</g>
</g>
</svg>
