<?xml version="1.0" encoding="UTF-8" standalone="no"?>
<!DOCTYPE svg PUBLIC "-//W3C//DTD SVG 1.1//EN"
 "http://www.w3.org/Graphics/SVG/1.1/DTD/svg11.dtd">
<!-- Generated by graphviz version 2.43.0 (0)
 -->
<!-- Title: googletest&#45;json&#45;output&#45;unittest.GTestJsonOutputUnitTest Pages: 1 -->
<svg width="189pt" height="95pt"
 viewBox="0.00 0.00 189.00 95.00" xmlns="http://www.w3.org/2000/svg" xmlns:xlink="http://www.w3.org/1999/xlink">
<g id="graph0" class="graph" transform="scale(1 1) rotate(0) translate(4 91)">
<title>googletest&#45;json&#45;output&#45;unittest.GTestJsonOutputUnitTest</title>
<polygon fill="white" stroke="transparent" points="-4,4 -4,-91 185,-91 185,4 -4,4"/>
<!-- Node1 -->
<g id="node1" class="node">
<title>Node1</title>
<g id="a_node1"><a xlink:title=" ">
<polygon fill="#bfbfbf" stroke="black" points="0,-0.5 0,-30.5 181,-30.5 181,-0.5 0,-0.5"/>
<text text-anchor="start" x="8" y="-18.5" font-family="Helvetica,sans-Serif" font-size="10.00">googletest&#45;json&#45;output</text>
<text text-anchor="middle" x="90.5" y="-7.5" font-family="Helvetica,sans-Serif" font-size="10.00">&#45;unittest.GTestJsonOutputUnitTest</text>
</a>
</g>
</g>
<!-- Node2 -->
<g id="node2" class="node">
<title>Node2</title>
<g id="a_node2"><a xlink:title=" ">
<polygon fill="white" stroke="#bfbfbf" points="21.5,-67.5 21.5,-86.5 159.5,-86.5 159.5,-67.5 21.5,-67.5"/>
<text text-anchor="middle" x="90.5" y="-74.5" font-family="Helvetica,sans-Serif" font-size="10.00">gtest_test_utils.TestCase</text>
</a>
</g>
</g>
<!-- Node2&#45;&gt;Node1 -->
<g id="edge1" class="edge">
<title>Node2&#45;&gt;Node1</title>
<path fill="none" stroke="midnightblue" d="M90.5,-57.23C90.5,-48.59 90.5,-38.5 90.5,-30.52"/>
<polygon fill="midnightblue" stroke="midnightblue" points="87,-57.48 90.5,-67.48 94,-57.48 87,-57.48"/>
</g>
</g>
</svg>
