<?xml version="1.0" encoding="UTF-8" standalone="no"?>
<!DOCTYPE svg PUBLIC "-//W3C//DTD SVG 1.1//EN"
 "http://www.w3.org/Graphics/SVG/1.1/DTD/svg11.dtd">
<!-- Generated by graphviz version 2.43.0 (0)
 -->
<!-- Title: main Pages: 1 -->
<svg width="237pt" height="230pt"
 viewBox="0.00 0.00 237.00 229.50" xmlns="http://www.w3.org/2000/svg" xmlns:xlink="http://www.w3.org/1999/xlink">
<g id="graph0" class="graph" transform="scale(1 1) rotate(0) translate(4 225.5)">
<title>main</title>
<polygon fill="white" stroke="transparent" points="-4,4 -4,-225.5 233,-225.5 233,4 -4,4"/>
<!-- Node1 -->
<g id="node1" class="node">
<title>Node1</title>
<g id="a_node1"><a xlink:title="this method creates and deletes a json file to be able to use all public methods and prints the resul...">
<polygon fill="#bfbfbf" stroke="black" points="0,-95.5 0,-114.5 41,-114.5 41,-95.5 0,-95.5"/>
<text text-anchor="middle" x="20.5" y="-102.5" font-family="Helvetica,sans-Serif" font-size="10.00">main</text>
</a>
</g>
</g>
<!-- Node2 -->
<g id="node2" class="node">
<title>Node2</title>
<g id="a_node2"><a xlink:href="classMediaReader.html#a352b413f2fb5352081270de914a5d0f7" target="_top" xlink:title="checks whether file contains given value or not">
<polygon fill="white" stroke="black" points="89,-191 89,-221 217,-221 217,-191 89,-191"/>
<text text-anchor="start" x="97" y="-209" font-family="Helvetica,sans-Serif" font-size="10.00">MediaReader::contains</text>
<text text-anchor="middle" x="153" y="-198" font-family="Helvetica,sans-Serif" font-size="10.00">_value</text>
</a>
</g>
</g>
<!-- Node1&#45;&gt;Node2 -->
<g id="edge1" class="edge">
<title>Node1&#45;&gt;Node2</title>
<path fill="none" stroke="midnightblue" d="M26.05,-114.66C34.09,-130.73 52.33,-162.98 77,-181 79.52,-182.84 82.19,-184.56 84.96,-186.15"/>
<polygon fill="midnightblue" stroke="midnightblue" points="83.58,-189.37 94.07,-190.83 86.77,-183.15 83.58,-189.37"/>
</g>
<!-- Node3 -->
<g id="node3" class="node">
<title>Node3</title>
<g id="a_node3"><a xlink:href="json__demo_8cpp.html#a19b67ff851ea9c8cc5c7b46c5cd224d6" target="_top" xlink:title="an example of how the json file must look like">
<polygon fill="white" stroke="black" points="93.5,-152.5 93.5,-171.5 212.5,-171.5 212.5,-152.5 93.5,-152.5"/>
<text text-anchor="middle" x="153" y="-159.5" font-family="Helvetica,sans-Serif" font-size="10.00">generate_demo_json</text>
</a>
</g>
</g>
<!-- Node1&#45;&gt;Node3 -->
<g id="edge2" class="edge">
<title>Node1&#45;&gt;Node3</title>
<path fill="none" stroke="midnightblue" d="M33.11,-114.77C43.86,-123.35 60.61,-135.6 77,-143 82.33,-145.41 88.02,-147.55 93.79,-149.44"/>
<polygon fill="midnightblue" stroke="midnightblue" points="92.95,-152.84 103.53,-152.39 94.98,-146.14 92.95,-152.84"/>
</g>
<!-- Node4 -->
<g id="node4" class="node">
<title>Node4</title>
<g id="a_node4"><a xlink:href="classMediaReader.html#a42aa75542d95e7f42c1e25d44e192591" target="_top" xlink:title="returns identifier at given position">
<polygon fill="white" stroke="black" points="77,-114.5 77,-133.5 229,-133.5 229,-114.5 77,-114.5"/>
<text text-anchor="middle" x="153" y="-121.5" font-family="Helvetica,sans-Serif" font-size="10.00">MediaReader::get_identifier</text>
</a>
</g>
</g>
<!-- Node1&#45;&gt;Node4 -->
<g id="edge3" class="edge">
<title>Node1&#45;&gt;Node4</title>
<path fill="none" stroke="midnightblue" d="M41.04,-107.84C50.84,-109.27 63.41,-111.1 76.54,-113.01"/>
<polygon fill="midnightblue" stroke="midnightblue" points="76.26,-116.51 86.66,-114.49 77.27,-109.58 76.26,-116.51"/>
</g>
<!-- Node5 -->
<g id="node5" class="node">
<title>Node5</title>
<g id="a_node5"><a xlink:href="classMediaReader.html#aea6a1fb36ab4af46b61f56925ba9e82d" target="_top" xlink:title="returns path at given position">
<polygon fill="white" stroke="black" points="88,-76.5 88,-95.5 218,-95.5 218,-76.5 88,-76.5"/>
<text text-anchor="middle" x="153" y="-83.5" font-family="Helvetica,sans-Serif" font-size="10.00">MediaReader::get_path</text>
</a>
</g>
</g>
<!-- Node1&#45;&gt;Node5 -->
<g id="edge4" class="edge">
<title>Node1&#45;&gt;Node5</title>
<path fill="none" stroke="midnightblue" d="M41.04,-102.16C51.16,-100.68 64.24,-98.78 77.85,-96.8"/>
<polygon fill="midnightblue" stroke="midnightblue" points="78.42,-100.25 87.82,-95.34 77.42,-93.32 78.42,-100.25"/>
</g>
<!-- Node6 -->
<g id="node6" class="node">
<title>Node6</title>
<g id="a_node6"><a xlink:href="classMediaReader.html#abb08358a7d90598fd96c449d5e947bb5" target="_top" xlink:title="checks whether an element at given position is empty or not">
<polygon fill="white" stroke="black" points="87,-38.5 87,-57.5 219,-57.5 219,-38.5 87,-38.5"/>
<text text-anchor="middle" x="153" y="-45.5" font-family="Helvetica,sans-Serif" font-size="10.00">MediaReader::is_empty</text>
</a>
</g>
</g>
<!-- Node1&#45;&gt;Node6 -->
<g id="edge5" class="edge">
<title>Node1&#45;&gt;Node6</title>
<path fill="none" stroke="midnightblue" d="M33.11,-95.23C43.86,-86.65 60.61,-74.4 77,-67 82.33,-64.59 88.02,-62.45 93.79,-60.56"/>
<polygon fill="midnightblue" stroke="midnightblue" points="94.98,-63.86 103.53,-57.61 92.95,-57.16 94.98,-63.86"/>
</g>
<!-- Node7 -->
<g id="node7" class="node">
<title>Node7</title>
<g id="a_node7"><a xlink:href="classMediaReader.html#a18085972f9333f91a8154a291ca8cebb" target="_top" xlink:title="public methods to do the following: to set the file to check whether file contains a key to check whe...">
<polygon fill="white" stroke="black" points="92,-0.5 92,-19.5 214,-19.5 214,-0.5 92,-0.5"/>
<text text-anchor="middle" x="153" y="-7.5" font-family="Helvetica,sans-Serif" font-size="10.00">MediaReader::set_file</text>
</a>
</g>
</g>
<!-- Node1&#45;&gt;Node7 -->
<g id="edge6" class="edge">
<title>Node1&#45;&gt;Node7</title>
<path fill="none" stroke="midnightblue" d="M25.78,-95.4C33.55,-79.12 51.55,-46.19 77,-29 80.07,-26.92 83.36,-25.07 86.77,-23.43"/>
<polygon fill="midnightblue" stroke="midnightblue" points="88.19,-26.62 96.05,-19.52 85.48,-20.17 88.19,-26.62"/>
</g>
</g>
</svg>
