

D:\Uni\7.Semester\Bachlorpraktikum\Repo\medienserver\web_app\backend\ListManager.ts
    1:16   error    Strings must use doublequote                                                  quotes
    1:20   error    Expected linebreaks to be 'LF' but found 'CRLF'                               linebreak-style
    1:20   error    Missing semicolon                                                             semi
    2:1    error    Expected linebreaks to be 'LF' but found 'CRLF'                               linebreak-style
    3:4    error    Expected linebreaks to be 'LF' but found 'CRLF'                               linebreak-style
    4:49   error    Expected linebreaks to be 'LF' but found 'CRLF'                               linebreak-style
    5:4    error    Expected linebreaks to be 'LF' but found 'CRLF'                               linebreak-style
    6:29   error    Expected linebreaks to be 'LF' but found 'CRLF'                               linebreak-style
    7:24   error    Expected linebreaks to be 'LF' but found 'CRLF'                               linebreak-style
    8:18   error    Expected linebreaks to be 'LF' but found 'CRLF'                               linebreak-style
    9:2    error    Expected linebreaks to be 'LF' but found 'CRLF'                               linebreak-style
   10:1    error    Expected linebreaks to be 'LF' but found 'CRLF'                               linebreak-style
   11:4    error    Expected linebreaks to be 'LF' but found 'CRLF'                               linebreak-style
   12:43   error    Expected linebreaks to be 'LF' but found 'CRLF'                               linebreak-style
   13:4    error    Expected linebreaks to be 'LF' but found 'CRLF'                               linebreak-style
   14:26   error    Expected linebreaks to be 'LF' but found 'CRLF'                               linebreak-style
   15:24   error    Expected linebreaks to be 'LF' but found 'CRLF'                               linebreak-style
   16:27   error    Expected linebreaks to be 'LF' but found 'CRLF'                               linebreak-style
   17:2    error    Expected linebreaks to be 'LF' but found 'CRLF'                               linebreak-style
   18:1    error    Expected linebreaks to be 'LF' but found 'CRLF'                               linebreak-style
   19:4    error    Expected linebreaks to be 'LF' but found 'CRLF'                               linebreak-style
   20:56   error    Expected linebreaks to be 'LF' but found 'CRLF'                               linebreak-style
   21:4    error    Expected linebreaks to be 'LF' but found 'CRLF'                               linebreak-style
   22:29   error    Expected linebreaks to be 'LF' but found 'CRLF'                               linebreak-style
   23:20   error    Expected linebreaks to be 'LF' but found 'CRLF'                               linebreak-style
   24:2    error    Expected linebreaks to be 'LF' but found 'CRLF'                               linebreak-style
   25:1    error    Expected linebreaks to be 'LF' but found 'CRLF'                               linebreak-style
   26:4    error    Expected linebreaks to be 'LF' but found 'CRLF'                               linebreak-style
   27:88   error    Expected linebreaks to be 'LF' but found 'CRLF'                               linebreak-style
   28:4    error    Expected linebreaks to be 'LF' but found 'CRLF'                               linebreak-style
   29:34   error    Expected linebreaks to be 'LF' but found 'CRLF'                               linebreak-style
   30:21   error    Expected linebreaks to be 'LF' but found 'CRLF'                               linebreak-style
   31:21   error    Expected linebreaks to be 'LF' but found 'CRLF'                               linebreak-style
   32:2    error    Expected linebreaks to be 'LF' but found 'CRLF'                               linebreak-style
   33:1    error    Expected linebreaks to be 'LF' but found 'CRLF'                               linebreak-style
   34:4    error    Expected linebreaks to be 'LF' but found 'CRLF'                               linebreak-style
   35:75   error    Expected linebreaks to be 'LF' but found 'CRLF'                               linebreak-style
   36:29   error    Expected linebreaks to be 'LF' but found 'CRLF'                               linebreak-style
   37:4    error    Expected linebreaks to be 'LF' but found 'CRLF'                               linebreak-style
   38:36   error    Expected linebreaks to be 'LF' but found 'CRLF'                               linebreak-style
   39:26   error    Strings must use doublequote                                                  quotes
   39:36   error    Strings must use doublequote                                                  quotes
   39:41   error    Expected linebreaks to be 'LF' but found 'CRLF'                               linebreak-style
   40:2    error    Expected linebreaks to be 'LF' but found 'CRLF'                               linebreak-style
   41:1    error    Expected linebreaks to be 'LF' but found 'CRLF'                               linebreak-style
   42:4    error    Expected linebreaks to be 'LF' but found 'CRLF'                               linebreak-style
   43:87   error    Expected linebreaks to be 'LF' but found 'CRLF'                               linebreak-style
   44:35   error    Expected linebreaks to be 'LF' but found 'CRLF'                               linebreak-style
   45:4    error    Expected linebreaks to be 'LF' but found 'CRLF'                               linebreak-style
   46:43   error    Expected linebreaks to be 'LF' but found 'CRLF'                               linebreak-style
   47:43   error    Expected linebreaks to be 'LF' but found 'CRLF'                               linebreak-style
   48:2    error    Expected linebreaks to be 'LF' but found 'CRLF'                               linebreak-style
   49:1    error    Expected linebreaks to be 'LF' but found 'CRLF'                               linebreak-style
   50:4    error    Expected linebreaks to be 'LF' but found 'CRLF'                               linebreak-style
   51:103  error    Expected linebreaks to be 'LF' but found 'CRLF'                               linebreak-style
   52:25   error    Expected linebreaks to be 'LF' but found 'CRLF'                               linebreak-style
   53:4    error    Expected linebreaks to be 'LF' but found 'CRLF'                               linebreak-style
   54:31   error    Expected linebreaks to be 'LF' but found 'CRLF'                               linebreak-style
   55:26   error    Strings must use doublequote                                                  quotes
   55:61   error    Expected linebreaks to be 'LF' but found 'CRLF'                               linebreak-style
   56:2    error    Expected linebreaks to be 'LF' but found 'CRLF'                               linebreak-style
   57:1    error    Expected linebreaks to be 'LF' but found 'CRLF'                               linebreak-style
   58:4    error    Expected linebreaks to be 'LF' but found 'CRLF'                               linebreak-style
   59:90   error    Expected linebreaks to be 'LF' but found 'CRLF'                               linebreak-style
   60:46   error    Expected linebreaks to be 'LF' but found 'CRLF'                               linebreak-style
   61:4    error    Expected linebreaks to be 'LF' but found 'CRLF'                               linebreak-style
   62:38   error    Expected linebreaks to be 'LF' but found 'CRLF'                               linebreak-style
   63:41   error    Expected linebreaks to be 'LF' but found 'CRLF'                               linebreak-style
   64:2    error    Expected linebreaks to be 'LF' but found 'CRLF'                               linebreak-style
   65:1    error    Expected linebreaks to be 'LF' but found 'CRLF'                               linebreak-style
   66:4    error    Expected linebreaks to be 'LF' but found 'CRLF'                               linebreak-style
   67:85   error    Expected linebreaks to be 'LF' but found 'CRLF'                               linebreak-style
   68:32   error    Expected linebreaks to be 'LF' but found 'CRLF'                               linebreak-style
   69:4    error    Expected linebreaks to be 'LF' but found 'CRLF'                               linebreak-style
   70:10   warning  'gen_media_json' is defined but never used                                    @typescript-eslint/no-unused-vars
   70:39   error    Expected linebreaks to be 'LF' but found 'CRLF'                               linebreak-style
   71:40   error    Expected linebreaks to be 'LF' but found 'CRLF'                               linebreak-style
   72:2    error    Expected linebreaks to be 'LF' but found 'CRLF'                               linebreak-style
   73:1    error    Expected linebreaks to be 'LF' but found 'CRLF'                               linebreak-style
   74:4    error    Expected linebreaks to be 'LF' but found 'CRLF'                               linebreak-style
   75:128  error    Expected linebreaks to be 'LF' but found 'CRLF'                               linebreak-style
   76:25   error    Expected linebreaks to be 'LF' but found 'CRLF'                               linebreak-style
   77:28   error    Expected linebreaks to be 'LF' but found 'CRLF'                               linebreak-style
   78:22   error    Expected linebreaks to be 'LF' but found 'CRLF'                               linebreak-style
   79:4    error    Expected linebreaks to be 'LF' but found 'CRLF'                               linebreak-style
   80:25   error    Expected linebreaks to be 'LF' but found 'CRLF'                               linebreak-style
   81:28   error    Expected linebreaks to be 'LF' but found 'CRLF'                               linebreak-style
   82:22   error    Expected linebreaks to be 'LF' but found 'CRLF'                               linebreak-style
   83:4    error    Expected linebreaks to be 'LF' but found 'CRLF'                               linebreak-style
   84:21   error    Expected linebreaks to be 'LF' but found 'CRLF'                               linebreak-style
   85:18   error    Expected linebreaks to be 'LF' but found 'CRLF'                               linebreak-style
   86:4    error    Expected linebreaks to be 'LF' but found 'CRLF'                               linebreak-style
   87:19   error    Expected linebreaks to be 'LF' but found 'CRLF'                               linebreak-style
   88:15   error    Expected linebreaks to be 'LF' but found 'CRLF'                               linebreak-style
   89:19   error    Expected linebreaks to be 'LF' but found 'CRLF'                               linebreak-style
   90:17   error    Expected linebreaks to be 'LF' but found 'CRLF'                               linebreak-style
   91:4    error    Expected linebreaks to be 'LF' but found 'CRLF'                               linebreak-style
   92:35   error    Expected linebreaks to be 'LF' but found 'CRLF'                               linebreak-style
   93:21   error    Expected linebreaks to be 'LF' but found 'CRLF'                               linebreak-style
   94:30   error    Expected linebreaks to be 'LF' but found 'CRLF'                               linebreak-style
   95:5    error    Type string trivially inferred from a string literal, remove type annotation  @typescript-eslint/no-inferrable-types
   95:47   error    Expected linebreaks to be 'LF' but found 'CRLF'                               linebreak-style
   96:23   warning  Unexpected any. Specify a different type                                      @typescript-eslint/no-explicit-any
   96:29   error    Expected linebreaks to be 'LF' but found 'CRLF'                               linebreak-style
   97:26   error    Expected linebreaks to be 'LF' but found 'CRLF'                               linebreak-style
   98:26   error    Expected linebreaks to be 'LF' but found 'CRLF'                               linebreak-style
   99:6    error    Expected linebreaks to be 'LF' but found 'CRLF'                               linebreak-style
  100:1    error    Expected linebreaks to be 'LF' but found 'CRLF'                               linebreak-style
  101:8    error    Expected linebreaks to be 'LF' but found 'CRLF'                               linebreak-style
  102:41   error    Expected linebreaks to be 'LF' but found 'CRLF'                               linebreak-style
  103:8    error    Expected linebreaks to be 'LF' but found 'CRLF'                               linebreak-style
  104:34   error    Expected linebreaks to be 'LF' but found 'CRLF'                               linebreak-style
  105:37   error    Expected linebreaks to be 'LF' but found 'CRLF'                               linebreak-style
  106:39   error    Expected linebreaks to be 'LF' but found 'CRLF'                               linebreak-style
  107:8    error    Expected linebreaks to be 'LF' but found 'CRLF'                               linebreak-style
  108:72   error    Expected linebreaks to be 'LF' but found 'CRLF'                               linebreak-style
  109:82   error    Expected linebreaks to be 'LF' but found 'CRLF'                               linebreak-style
  110:64   error    Expected linebreaks to be 'LF' but found 'CRLF'                               linebreak-style
  110:64   error    Missing semicolon                                                             semi
  111:17   error    Expected linebreaks to be 'LF' but found 'CRLF'                               linebreak-style
  112:120  error    Expected linebreaks to be 'LF' but found 'CRLF'                               linebreak-style
  113:10   error    Expected linebreaks to be 'LF' but found 'CRLF'                               linebreak-style
  114:30   error    Expected linebreaks to be 'LF' but found 'CRLF'                               linebreak-style
  115:6    error    Expected linebreaks to be 'LF' but found 'CRLF'                               linebreak-style
  116:1    error    Expected linebreaks to be 'LF' but found 'CRLF'                               linebreak-style
  117:8    error    Expected linebreaks to be 'LF' but found 'CRLF'                               linebreak-style
  118:41   error    Expected linebreaks to be 'LF' but found 'CRLF'                               linebreak-style
  119:8    error    Expected linebreaks to be 'LF' but found 'CRLF'                               linebreak-style
  120:34   error    Expected linebreaks to be 'LF' but found 'CRLF'                               linebreak-style
  121:37   error    Expected linebreaks to be 'LF' but found 'CRLF'                               linebreak-style
  122:27   error    Expected linebreaks to be 'LF' but found 'CRLF'                               linebreak-style
  123:8    error    Expected linebreaks to be 'LF' but found 'CRLF'                               linebreak-style
  124:84   error    Expected linebreaks to be 'LF' but found 'CRLF'                               linebreak-style
  125:82   error    Expected linebreaks to be 'LF' but found 'CRLF'                               linebreak-style
  126:62   error    Expected linebreaks to be 'LF' but found 'CRLF'                               linebreak-style
  127:17   error    Expected linebreaks to be 'LF' but found 'CRLF'                               linebreak-style
  128:121  error    Expected linebreaks to be 'LF' but found 'CRLF'                               linebreak-style
  129:10   error    Expected linebreaks to be 'LF' but found 'CRLF'                               linebreak-style
  130:1    error    Expected linebreaks to be 'LF' but found 'CRLF'                               linebreak-style
  131:6    error    Expected linebreaks to be 'LF' but found 'CRLF'                               linebreak-style
  132:1    error    Expected linebreaks to be 'LF' but found 'CRLF'                               linebreak-style
  133:8    error    Expected linebreaks to be 'LF' but found 'CRLF'                               linebreak-style
  134:34   error    Expected linebreaks to be 'LF' but found 'CRLF'                               linebreak-style
  135:8    error    Expected linebreaks to be 'LF' but found 'CRLF'                               linebreak-style
  136:29   error    Expected linebreaks to be 'LF' but found 'CRLF'                               linebreak-style
  137:47   error    Expected linebreaks to be 'LF' but found 'CRLF'                               linebreak-style
  138:8    error    Expected linebreaks to be 'LF' but found 'CRLF'                               linebreak-style
  139:43   error    Expected linebreaks to be 'LF' but found 'CRLF'                               linebreak-style
  140:37   error    Expected linebreaks to be 'LF' but found 'CRLF'                               linebreak-style
  141:40   error    Expected linebreaks to be 'LF' but found 'CRLF'                               linebreak-style
  141:40   error    Missing semicolon                                                             semi
  142:17   error    Expected linebreaks to be 'LF' but found 'CRLF'                               linebreak-style
  143:84   error    Expected linebreaks to be 'LF' but found 'CRLF'                               linebreak-style
  144:10   error    Expected linebreaks to be 'LF' but found 'CRLF'                               linebreak-style
  145:28   error    Expected linebreaks to be 'LF' but found 'CRLF'                               linebreak-style
  146:6    error    Expected linebreaks to be 'LF' but found 'CRLF'                               linebreak-style
  147:1    error    Expected linebreaks to be 'LF' but found 'CRLF'                               linebreak-style
  148:8    error    Expected linebreaks to be 'LF' but found 'CRLF'                               linebreak-style
  149:40   error    Expected linebreaks to be 'LF' but found 'CRLF'                               linebreak-style
  150:8    error    Expected linebreaks to be 'LF' but found 'CRLF'                               linebreak-style
  151:29   error    Expected linebreaks to be 'LF' but found 'CRLF'                               linebreak-style
  152:61   error    Expected linebreaks to be 'LF' but found 'CRLF'                               linebreak-style
  153:8    error    Expected linebreaks to be 'LF' but found 'CRLF'                               linebreak-style
  154:55   error    Expected linebreaks to be 'LF' but found 'CRLF'                               linebreak-style
  155:37   error    Expected linebreaks to be 'LF' but found 'CRLF'                               linebreak-style
  156:38   error    Expected linebreaks to be 'LF' but found 'CRLF'                               linebreak-style
  157:17   error    Expected linebreaks to be 'LF' but found 'CRLF'                               linebreak-style
  158:84   error    Expected linebreaks to be 'LF' but found 'CRLF'                               linebreak-style
  159:10   error    Expected linebreaks to be 'LF' but found 'CRLF'                               linebreak-style
  160:6    error    Expected linebreaks to be 'LF' but found 'CRLF'                               linebreak-style
  161:1    error    Expected linebreaks to be 'LF' but found 'CRLF'                               linebreak-style
  162:5    error    Expected linebreaks to be 'LF' but found 'CRLF'                               linebreak-style
  163:63   error    Expected linebreaks to be 'LF' but found 'CRLF'                               linebreak-style
  164:51   error    Expected linebreaks to be 'LF' but found 'CRLF'                               linebreak-style
  165:6    error    Expected linebreaks to be 'LF' but found 'CRLF'                               linebreak-style
  166:1    error    Expected linebreaks to be 'LF' but found 'CRLF'                               linebreak-style
  167:89   error    Expected linebreaks to be 'LF' but found 'CRLF'                               linebreak-style
  168:68   error    Expected linebreaks to be 'LF' but found 'CRLF'                               linebreak-style
  168:68   error    Missing semicolon                                                             semi
  169:6    error    Expected linebreaks to be 'LF' but found 'CRLF'                               linebreak-style
  170:1    error    Expected linebreaks to be 'LF' but found 'CRLF'                               linebreak-style
  171:77   error    Expected linebreaks to be 'LF' but found 'CRLF'                               linebreak-style
  172:56   error    Expected linebreaks to be 'LF' but found 'CRLF'                               linebreak-style
  172:56   error    Missing semicolon                                                             semi
  173:6    error    Expected linebreaks to be 'LF' but found 'CRLF'                               linebreak-style
  174:1    error    Expected linebreaks to be 'LF' but found 'CRLF'                               linebreak-style
  175:45   error    Expected linebreaks to be 'LF' but found 'CRLF'                               linebreak-style
  176:45   error    Expected linebreaks to be 'LF' but found 'CRLF'                               linebreak-style
  177:6    error    Expected linebreaks to be 'LF' but found 'CRLF'                               linebreak-style
  178:1    error    Expected linebreaks to be 'LF' but found 'CRLF'                               linebreak-style
  179:37   error    Expected linebreaks to be 'LF' but found 'CRLF'                               linebreak-style
  180:65   error    Expected linebreaks to be 'LF' but found 'CRLF'                               linebreak-style
  181:6    error    Expected linebreaks to be 'LF' but found 'CRLF'                               linebreak-style
  182:1    error    Expected linebreaks to be 'LF' but found 'CRLF'                               linebreak-style
  183:51   error    Expected linebreaks to be 'LF' but found 'CRLF'                               linebreak-style
  184:79   error    Expected linebreaks to be 'LF' but found 'CRLF'                               linebreak-style
  185:6    error    Expected linebreaks to be 'LF' but found 'CRLF'                               linebreak-style
  186:1    error    Expected linebreaks to be 'LF' but found 'CRLF'                               linebreak-style
  187:45   error    Expected linebreaks to be 'LF' but found 'CRLF'                               linebreak-style
  188:73   error    Expected linebreaks to be 'LF' but found 'CRLF'                               linebreak-style
  189:6    error    Expected linebreaks to be 'LF' but found 'CRLF'                               linebreak-style
  190:1    error    Expected linebreaks to be 'LF' but found 'CRLF'                               linebreak-style
  191:44   error    Expected linebreaks to be 'LF' but found 'CRLF'                               linebreak-style
  192:43   error    Expected linebreaks to be 'LF' but found 'CRLF'                               linebreak-style
  193:6    error    Expected linebreaks to be 'LF' but found 'CRLF'                               linebreak-style
  194:1    error    Expected linebreaks to be 'LF' but found 'CRLF'                               linebreak-style
  195:71   error    Expected linebreaks to be 'LF' but found 'CRLF'                               linebreak-style
  196:62   error    Expected linebreaks to be 'LF' but found 'CRLF'                               linebreak-style
  196:62   error    Missing semicolon                                                             semi
  197:6    error    Expected linebreaks to be 'LF' but found 'CRLF'                               linebreak-style
  198:1    error    Expected linebreaks to be 'LF' but found 'CRLF'                               linebreak-style
  199:65   error    Expected linebreaks to be 'LF' but found 'CRLF'                               linebreak-style
  200:56   error    Expected linebreaks to be 'LF' but found 'CRLF'                               linebreak-style
  200:56   error    Missing semicolon                                                             semi
  201:6    error    Expected linebreaks to be 'LF' but found 'CRLF'                               linebreak-style
  202:1    error    Expected linebreaks to be 'LF' but found 'CRLF'                               linebreak-style
  203:62   error    Expected linebreaks to be 'LF' but found 'CRLF'                               linebreak-style
  204:62   error    Expected linebreaks to be 'LF' but found 'CRLF'                               linebreak-style
  204:62   error    Missing semicolon                                                             semi
  205:6    error    Expected linebreaks to be 'LF' but found 'CRLF'                               linebreak-style
  206:1    error    Expected linebreaks to be 'LF' but found 'CRLF'                               linebreak-style
  207:36   error    Expected linebreaks to be 'LF' but found 'CRLF'                               linebreak-style
  208:43   error    Expected linebreaks to be 'LF' but found 'CRLF'                               linebreak-style
  209:6    error    Expected linebreaks to be 'LF' but found 'CRLF'                               linebreak-style
  210:1    error    Expected linebreaks to be 'LF' but found 'CRLF'                               linebreak-style
  211:32   error    Expected linebreaks to be 'LF' but found 'CRLF'                               linebreak-style
  212:60   warning  'index' is defined but never used                                             @typescript-eslint/no-unused-vars
  212:67   warning  'obj' is defined but never used                                               @typescript-eslint/no-unused-vars
  212:88   error    Expected linebreaks to be 'LF' but found 'CRLF'                               linebreak-style
  212:88   error    Missing semicolon                                                             semi
  213:6    error    Expected linebreaks to be 'LF' but found 'CRLF'                               linebreak-style
  214:1    error    Expected linebreaks to be 'LF' but found 'CRLF'                               linebreak-style
  215:46   error    Expected linebreaks to be 'LF' but found 'CRLF'                               linebreak-style
  216:66   warning  'index' is defined but never used                                             @typescript-eslint/no-unused-vars
  216:73   warning  'obj' is defined but never used                                               @typescript-eslint/no-unused-vars
  216:94   error    Expected linebreaks to be 'LF' but found 'CRLF'                               linebreak-style
  216:94   error    Missing semicolon                                                             semi
  217:6    error    Expected linebreaks to be 'LF' but found 'CRLF'                               linebreak-style
  218:1    error    Expected linebreaks to be 'LF' but found 'CRLF'                               linebreak-style
  219:26   error    Expected linebreaks to be 'LF' but found 'CRLF'                               linebreak-style
  220:77   error    Expected linebreaks to be 'LF' but found 'CRLF'                               linebreak-style
  221:6    error    Expected linebreaks to be 'LF' but found 'CRLF'                               linebreak-style
  222:1    error    Expected linebreaks to be 'LF' but found 'CRLF'                               linebreak-style
  223:25   error    Expected linebreaks to be 'LF' but found 'CRLF'                               linebreak-style
  224:13   error    'errors' is never reassigned. Use 'const' instead                             prefer-const
  224:43   error    Expected linebreaks to be 'LF' but found 'CRLF'                               linebreak-style
  225:39   error    Expected linebreaks to be 'LF' but found 'CRLF'                               linebreak-style
  226:43   error    Expected linebreaks to be 'LF' but found 'CRLF'                               linebreak-style
  227:39   error    Expected linebreaks to be 'LF' but found 'CRLF'                               linebreak-style
  228:59   error    Expected linebreaks to be 'LF' but found 'CRLF'                               linebreak-style
  229:10   error    Expected linebreaks to be 'LF' but found 'CRLF'                               linebreak-style
  230:13   error    'lists' is never reassigned. Use 'const' instead                              prefer-const
  230:47   error    Expected linebreaks to be 'LF' but found 'CRLF'                               linebreak-style
  231:43   error    Expected linebreaks to be 'LF' but found 'CRLF'                               linebreak-style
  232:36   error    Expected linebreaks to be 'LF' but found 'CRLF'                               linebreak-style
  233:17   error    'message' is never reassigned. Use 'const' instead                            prefer-const
  233:107  error    Expected linebreaks to be 'LF' but found 'CRLF'                               linebreak-style
  234:44   error    Expected linebreaks to be 'LF' but found 'CRLF'                               linebreak-style
  235:32   error    Don't use `Number` as a type. Use number instead                              @typescript-eslint/ban-types
  235:60   error    Expected linebreaks to be 'LF' but found 'CRLF'                               linebreak-style
  236:35   error    Expected linebreaks to be 'LF' but found 'CRLF'                               linebreak-style
  237:69   error    Missing semicolon                                                             semi
  237:71   error    Expected linebreaks to be 'LF' but found 'CRLF'                               linebreak-style
  238:25   error    Expected linebreaks to be 'LF' but found 'CRLF'                               linebreak-style
  239:80   error    Missing semicolon                                                             semi
  239:82   error    Expected linebreaks to be 'LF' but found 'CRLF'                               linebreak-style
  240:18   error    Expected linebreaks to be 'LF' but found 'CRLF'                               linebreak-style
  241:14   error    Expected linebreaks to be 'LF' but found 'CRLF'                               linebreak-style
  241:14   error    Missing semicolon                                                             semi
  242:59   error    Expected linebreaks to be 'LF' but found 'CRLF'                               linebreak-style
  242:59   error    Missing semicolon                                                             semi
  243:48   error    Expected linebreaks to be 'LF' but found 'CRLF'                               linebreak-style
  244:10   error    Expected linebreaks to be 'LF' but found 'CRLF'                               linebreak-style
  245:1    error    Expected linebreaks to be 'LF' but found 'CRLF'                               linebreak-style
  246:56   error    Expected linebreaks to be 'LF' but found 'CRLF'                               linebreak-style
  247:1    error    Expected linebreaks to be 'LF' but found 'CRLF'                               linebreak-style
  248:67   error    Expected linebreaks to be 'LF' but found 'CRLF'                               linebreak-style
  249:47   error    Expected linebreaks to be 'LF' but found 'CRLF'                               linebreak-style
  250:21   error    'message' is never reassigned. Use 'const' instead                            prefer-const
  250:83   error    Expected linebreaks to be 'LF' but found 'CRLF'                               linebreak-style
  251:47   error    Expected linebreaks to be 'LF' but found 'CRLF'                               linebreak-style
  252:80   error    Expected linebreaks to be 'LF' but found 'CRLF'                               linebreak-style
  253:18   error    Expected linebreaks to be 'LF' but found 'CRLF'                               linebreak-style
  253:18   error    Missing semicolon                                                             semi
  254:62   error    Expected linebreaks to be 'LF' but found 'CRLF'                               linebreak-style
  254:62   error    Missing semicolon                                                             semi
  255:14   error    Expected linebreaks to be 'LF' but found 'CRLF'                               linebreak-style
  256:1    error    Expected linebreaks to be 'LF' but found 'CRLF'                               linebreak-style
  257:65   error    Expected linebreaks to be 'LF' but found 'CRLF'                               linebreak-style
  258:45   error    Expected linebreaks to be 'LF' but found 'CRLF'                               linebreak-style
  259:21   error    'message' is never reassigned. Use 'const' instead                            prefer-const
  259:81   error    Expected linebreaks to be 'LF' but found 'CRLF'                               linebreak-style
  260:45   error    Expected linebreaks to be 'LF' but found 'CRLF'                               linebreak-style
  261:98   error    Expected linebreaks to be 'LF' but found 'CRLF'                               linebreak-style
  262:18   error    Expected linebreaks to be 'LF' but found 'CRLF'                               linebreak-style
  262:18   error    Missing semicolon                                                             semi
  263:60   error    Expected linebreaks to be 'LF' but found 'CRLF'                               linebreak-style
  263:60   error    Missing semicolon                                                             semi
  264:21   error    Expected linebreaks to be 'LF' but found 'CRLF'                               linebreak-style
  265:1    error    Expected linebreaks to be 'LF' but found 'CRLF'                               linebreak-style
  266:61   error    Expected linebreaks to be 'LF' but found 'CRLF'                               linebreak-style
  267:21   error    'elem_list' is never reassigned. Use 'const' instead                          prefer-const
  267:64   error    Expected linebreaks to be 'LF' but found 'CRLF'                               linebreak-style
  268:52   error    Expected linebreaks to be 'LF' but found 'CRLF'                               linebreak-style
  269:48   error    Expected linebreaks to be 'LF' but found 'CRLF'                               linebreak-style
  270:25   error    'message' is never reassigned. Use 'const' instead                            prefer-const
  270:142  error    Expected linebreaks to be 'LF' but found 'CRLF'                               linebreak-style
  271:52   error    Expected linebreaks to be 'LF' but found 'CRLF'                               linebreak-style
  272:40   error    Don't use `Number` as a type. Use number instead                              @typescript-eslint/ban-types
  272:72   error    Expected linebreaks to be 'LF' but found 'CRLF'                               linebreak-style
  273:43   error    Expected linebreaks to be 'LF' but found 'CRLF'                               linebreak-style
  274:81   error    Missing semicolon                                                             semi
  274:83   error    Expected linebreaks to be 'LF' but found 'CRLF'                               linebreak-style
  275:33   error    Expected linebreaks to be 'LF' but found 'CRLF'                               linebreak-style
  276:94   error    Missing semicolon                                                             semi
  276:96   error    Expected linebreaks to be 'LF' but found 'CRLF'                               linebreak-style
  277:26   error    Expected linebreaks to be 'LF' but found 'CRLF'                               linebreak-style
  278:22   error    Expected linebreaks to be 'LF' but found 'CRLF'                               linebreak-style
  278:22   error    Missing semicolon                                                             semi
  279:67   error    Expected linebreaks to be 'LF' but found 'CRLF'                               linebreak-style
  279:67   error    Missing semicolon                                                             semi
  280:65   error    Expected linebreaks to be 'LF' but found 'CRLF'                               linebreak-style
  281:18   error    Expected linebreaks to be 'LF' but found 'CRLF'                               linebreak-style
  282:1    error    Expected linebreaks to be 'LF' but found 'CRLF'                               linebreak-style
  283:69   error    Expected linebreaks to be 'LF' but found 'CRLF'                               linebreak-style
  284:78   error    Expected linebreaks to be 'LF' but found 'CRLF'                               linebreak-style
  285:44   error    Expected linebreaks to be 'LF' but found 'CRLF'                               linebreak-style
  285:44   error    Missing semicolon                                                             semi
  286:59   error    Expected linebreaks to be 'LF' but found 'CRLF'                               linebreak-style
  287:29   error    'message' is never reassigned. Use 'const' instead                            prefer-const
  287:115  error    Expected linebreaks to be 'LF' but found 'CRLF'                               linebreak-style
  288:55   error    Expected linebreaks to be 'LF' but found 'CRLF'                               linebreak-style
  289:88   error    Expected linebreaks to be 'LF' but found 'CRLF'                               linebreak-style
  290:26   error    Expected linebreaks to be 'LF' but found 'CRLF'                               linebreak-style
  290:26   error    Missing semicolon                                                             semi
  291:70   error    Expected linebreaks to be 'LF' but found 'CRLF'                               linebreak-style
  291:70   error    Missing semicolon                                                             semi
  292:22   error    Expected linebreaks to be 'LF' but found 'CRLF'                               linebreak-style
  293:1    error    Expected linebreaks to be 'LF' but found 'CRLF'                               linebreak-style
  294:75   error    Expected linebreaks to be 'LF' but found 'CRLF'                               linebreak-style
  295:53   error    Expected linebreaks to be 'LF' but found 'CRLF'                               linebreak-style
  296:29   error    'message' is never reassigned. Use 'const' instead                            prefer-const
  296:109  error    Expected linebreaks to be 'LF' but found 'CRLF'                               linebreak-style
  297:49   error    Expected linebreaks to be 'LF' but found 'CRLF'                               linebreak-style
  298:94   error    Expected linebreaks to be 'LF' but found 'CRLF'                               linebreak-style
  299:26   error    Expected linebreaks to be 'LF' but found 'CRLF'                               linebreak-style
  299:26   error    Missing semicolon                                                             semi
  300:64   error    Expected linebreaks to be 'LF' but found 'CRLF'                               linebreak-style
  300:64   error    Missing semicolon                                                             semi
  301:22   error    Expected linebreaks to be 'LF' but found 'CRLF'                               linebreak-style
  302:18   error    Expected linebreaks to be 'LF' but found 'CRLF'                               linebreak-style
  303:14   error    Expected linebreaks to be 'LF' but found 'CRLF'                               linebreak-style
  304:10   error    Expected linebreaks to be 'LF' but found 'CRLF'                               linebreak-style
  305:30   error    Expected linebreaks to be 'LF' but found 'CRLF'                               linebreak-style
  306:35   error    Expected linebreaks to be 'LF' but found 'CRLF'                               linebreak-style
  306:35   error    Missing semicolon                                                             semi
  307:6    error    Expected linebreaks to be 'LF' but found 'CRLF'                               linebreak-style
  308:1    error    Expected linebreaks to be 'LF' but found 'CRLF'                               linebreak-style
  309:5    error    Expected linebreaks to be 'LF' but found 'CRLF'                               linebreak-style
  310:26   error    Expected linebreaks to be 'LF' but found 'CRLF'                               linebreak-style
  311:55   error    Expected linebreaks to be 'LF' but found 'CRLF'                               linebreak-style
  312:40   error    Expected linebreaks to be 'LF' but found 'CRLF'                               linebreak-style
  312:40   error    Missing semicolon                                                             semi
  313:10   error    Expected linebreaks to be 'LF' but found 'CRLF'                               linebreak-style
  314:6    error    Expected linebreaks to be 'LF' but found 'CRLF'                               linebreak-style
  315:1    error    Expected linebreaks to be 'LF' but found 'CRLF'                               linebreak-style
  316:8    error    Expected linebreaks to be 'LF' but found 'CRLF'                               linebreak-style
  317:45   error    Expected linebreaks to be 'LF' but found 'CRLF'                               linebreak-style
  318:8    error    Expected linebreaks to be 'LF' but found 'CRLF'                               linebreak-style
  319:24   error    Expected linebreaks to be 'LF' but found 'CRLF'                               linebreak-style
  320:40   error    Expected linebreaks to be 'LF' but found 'CRLF'                               linebreak-style
  321:27   error    Expected linebreaks to be 'LF' but found 'CRLF'                               linebreak-style
  321:27   error    Missing semicolon                                                             semi
  322:10   error    Expected linebreaks to be 'LF' but found 'CRLF'                               linebreak-style
  323:55   error    Expected linebreaks to be 'LF' but found 'CRLF'                               linebreak-style
  324:61   error    Expected linebreaks to be 'LF' but found 'CRLF'                               linebreak-style
  324:61   error    Missing semicolon                                                             semi
  325:33   error    Expected linebreaks to be 'LF' but found 'CRLF'                               linebreak-style
  325:33   error    Missing semicolon                                                             semi
  326:10   error    Expected linebreaks to be 'LF' but found 'CRLF'                               linebreak-style
  327:6    error    Expected linebreaks to be 'LF' but found 'CRLF'                               linebreak-style
  328:8    error    Expected linebreaks to be 'LF' but found 'CRLF'                               linebreak-style
  329:88   error    Expected linebreaks to be 'LF' but found 'CRLF'                               linebreak-style
  330:8    error    Expected linebreaks to be 'LF' but found 'CRLF'                               linebreak-style
  331:99   error    Expected linebreaks to be 'LF' but found 'CRLF'                               linebreak-style
  332:9    error    Expected linebreaks to be 'LF' but found 'CRLF'                               linebreak-style
  333:34   error    Expected linebreaks to be 'LF' but found 'CRLF'                               linebreak-style
  334:61   error    Expected linebreaks to be 'LF' but found 'CRLF'                               linebreak-style
  335:62   error    Expected linebreaks to be 'LF' but found 'CRLF'                               linebreak-style
  336:8    error    Expected linebreaks to be 'LF' but found 'CRLF'                               linebreak-style
  337:72   error    Expected linebreaks to be 'LF' but found 'CRLF'                               linebreak-style
  338:1    error    Expected linebreaks to be 'LF' but found 'CRLF'                               linebreak-style
  339:45   error    Expected linebreaks to be 'LF' but found 'CRLF'                               linebreak-style
  339:45   error    Missing semicolon                                                             semi
  340:13   error    'tmp' is never reassigned. Use 'const' instead                                prefer-const
  340:33   error    Expected linebreaks to be 'LF' but found 'CRLF'                               linebreak-style
  341:1    error    Expected linebreaks to be 'LF' but found 'CRLF'                               linebreak-style
  342:35   error    Expected linebreaks to be 'LF' but found 'CRLF'                               linebreak-style
  343:34   error    Expected linebreaks to be 'LF' but found 'CRLF'                               linebreak-style
  344:122  error    Expected linebreaks to be 'LF' but found 'CRLF'                               linebreak-style
  345:46   error    Expected linebreaks to be 'LF' but found 'CRLF'                               linebreak-style
  346:10   error    Expected linebreaks to be 'LF' but found 'CRLF'                               linebreak-style
  347:30   error    Expected linebreaks to be 'LF' but found 'CRLF'                               linebreak-style
  348:15   error    Expected linebreaks to be 'LF' but found 'CRLF'                               linebreak-style
  349:17   error    'tmpLst' is never reassigned. Use 'const' instead                             prefer-const
  349:137  error    Expected linebreaks to be 'LF' but found 'CRLF'                               linebreak-style
  350:49   error    Expected linebreaks to be 'LF' but found 'CRLF'                               linebreak-style
  351:10   error    Expected linebreaks to be 'LF' but found 'CRLF'                               linebreak-style
  352:6    error    Expected linebreaks to be 'LF' but found 'CRLF'                               linebreak-style
  353:8    error    Expected linebreaks to be 'LF' but found 'CRLF'                               linebreak-style
  354:85   error    Expected linebreaks to be 'LF' but found 'CRLF'                               linebreak-style
  355:8    error    Expected linebreaks to be 'LF' but found 'CRLF'                               linebreak-style
  356:99   error    Expected linebreaks to be 'LF' but found 'CRLF'                               linebreak-style
  357:8    error    Expected linebreaks to be 'LF' but found 'CRLF'                               linebreak-style
  358:61   error    Expected linebreaks to be 'LF' but found 'CRLF'                               linebreak-style
  359:62   error    Expected linebreaks to be 'LF' but found 'CRLF'                               linebreak-style
  360:8    error    Expected linebreaks to be 'LF' but found 'CRLF'                               linebreak-style
  361:56   error    Expected linebreaks to be 'LF' but found 'CRLF'                               linebreak-style
  362:37   error    Expected linebreaks to be 'LF' but found 'CRLF'                               linebreak-style
  363:13   error    'tmp' is never reassigned. Use 'const' instead                                prefer-const
  363:35   error    Expected linebreaks to be 'LF' but found 'CRLF'                               linebreak-style
  364:39   error    Expected linebreaks to be 'LF' but found 'CRLF'                               linebreak-style
  365:34   error    Expected linebreaks to be 'LF' but found 'CRLF'                               linebreak-style
  366:130  error    Expected linebreaks to be 'LF' but found 'CRLF'                               linebreak-style
  367:37   error    Expected linebreaks to be 'LF' but found 'CRLF'                               linebreak-style
  368:10   error    Expected linebreaks to be 'LF' but found 'CRLF'                               linebreak-style
  369:30   error    Expected linebreaks to be 'LF' but found 'CRLF'                               linebreak-style
  370:15   error    Expected linebreaks to be 'LF' but found 'CRLF'                               linebreak-style
  371:22   error    Expected linebreaks to be 'LF' but found 'CRLF'                               linebreak-style
  372:17   error    'tmpLst' is never reassigned. Use 'const' instead                             prefer-const
  372:143  error    Expected linebreaks to be 'LF' but found 'CRLF'                               linebreak-style
  373:38   error    Expected linebreaks to be 'LF' but found 'CRLF'                               linebreak-style
  374:10   error    Expected linebreaks to be 'LF' but found 'CRLF'                               linebreak-style
  375:1    error    Expected linebreaks to be 'LF' but found 'CRLF'                               linebreak-style
  376:6    error    Expected linebreaks to be 'LF' but found 'CRLF'                               linebreak-style

D:\Uni\7.Semester\Bachlorpraktikum\Repo\medienserver\web_app\backend\index.ts
    1:3   error    Expected linebreaks to be 'LF' but found 'CRLF'   linebreak-style
    2:11  error    Expected linebreaks to be 'LF' but found 'CRLF'   linebreak-style
    3:3   error    Expected linebreaks to be 'LF' but found 'CRLF'   linebreak-style
    4:30  error    Strings must use doublequote                      quotes
    4:39  error    Expected linebreaks to be 'LF' but found 'CRLF'   linebreak-style
    4:39  error    Missing semicolon                                 semi
    5:23  error    Strings must use doublequote                      quotes
    5:48  error    Expected linebreaks to be 'LF' but found 'CRLF'   linebreak-style
    6:23  warning  'MediaJsonError' is defined but never used        @typescript-eslint/no-unused-vars
    6:39  warning  'M_List' is defined but never used                @typescript-eslint/no-unused-vars
    6:53  error    Strings must use doublequote                      quotes
    6:69  error    Expected linebreaks to be 'LF' but found 'CRLF'   linebreak-style
    7:18  error    Strings must use doublequote                      quotes
    7:27  error    Expected linebreaks to be 'LF' but found 'CRLF'   linebreak-style
    8:1   error    Expected linebreaks to be 'LF' but found 'CRLF'   linebreak-style
    9:47  error    Expected linebreaks to be 'LF' but found 'CRLF'   linebreak-style
   10:52  error    Expected linebreaks to be 'LF' but found 'CRLF'   linebreak-style
   11:16  error    Expected linebreaks to be 'LF' but found 'CRLF'   linebreak-style
   12:5   error    'valid' is never reassigned. Use 'const' instead  prefer-const
   12:26  error    Expected linebreaks to be 'LF' but found 'CRLF'   linebreak-style
   13:34  error    Expected linebreaks to be 'LF' but found 'CRLF'   linebreak-style
   13:34  error    Missing semicolon                                 semi
   14:1   error    Expected linebreaks to be 'LF' but found 'CRLF'   linebreak-style
   15:1   error    Expected linebreaks to be 'LF' but found 'CRLF'   linebreak-style
   16:68  error    Expected linebreaks to be 'LF' but found 'CRLF'   linebreak-style
   17:4   error    Expected linebreaks to be 'LF' but found 'CRLF'   linebreak-style
   18:42  error    Expected linebreaks to be 'LF' but found 'CRLF'   linebreak-style
   19:4   error    Expected linebreaks to be 'LF' but found 'CRLF'   linebreak-style
   20:69  error    Expected linebreaks to be 'LF' but found 'CRLF'   linebreak-style
   21:1   error    Expected linebreaks to be 'LF' but found 'CRLF'   linebreak-style
   22:9   error    Strings must use doublequote                      quotes
   22:29  error    Expected linebreaks to be 'LF' but found 'CRLF'   linebreak-style
   23:1   error    Expected indentation of 4 spaces but found 2      indent
   23:27  error    Expected linebreaks to be 'LF' but found 'CRLF'   linebreak-style
   23:27  error    Missing semicolon                                 semi
   24:4   error    Expected linebreaks to be 'LF' but found 'CRLF'   linebreak-style
   25:1   error    Expected linebreaks to be 'LF' but found 'CRLF'   linebreak-style
   26:4   error    Expected linebreaks to be 'LF' but found 'CRLF'   linebreak-style
   27:44  error    Expected linebreaks to be 'LF' but found 'CRLF'   linebreak-style
   28:25  error    Expected linebreaks to be 'LF' but found 'CRLF'   linebreak-style
   29:4   error    Expected linebreaks to be 'LF' but found 'CRLF'   linebreak-style
   30:9   error    Strings must use doublequote                      quotes
   30:49  error    Expected linebreaks to be 'LF' but found 'CRLF'   linebreak-style
   31:1   error    Expected indentation of 4 spaces but found 2      indent
   31:36  error    Expected linebreaks to be 'LF' but found 'CRLF'   linebreak-style
   31:36  error    Missing semicolon                                 semi
   32:3   error    Expected linebreaks to be 'LF' but found 'CRLF'   linebreak-style
   32:3   error    Missing semicolon                                 semi
   33:1   error    Expected linebreaks to be 'LF' but found 'CRLF'   linebreak-style
   34:4   error    Expected linebreaks to be 'LF' but found 'CRLF'   linebreak-style
   35:57  error    Expected linebreaks to be 'LF' but found 'CRLF'   linebreak-style
   36:24  error    Expected linebreaks to be 'LF' but found 'CRLF'   linebreak-style
   37:4   error    Expected linebreaks to be 'LF' but found 'CRLF'   linebreak-style
   38:9   error    Strings must use doublequote                      quotes
   38:63  error    Expected linebreaks to be 'LF' but found 'CRLF'   linebreak-style
   39:1   error    Expected indentation of 4 spaces but found 2      indent
   39:43  error    Expected linebreaks to be 'LF' but found 'CRLF'   linebreak-style
   39:43  error    Missing semicolon                                 semi
   40:1   error    Expected indentation of 4 spaces but found 2      indent
   40:53  error    Expected linebreaks to be 'LF' but found 'CRLF'   linebreak-style
   40:53  error    Missing semicolon                                 semi
   41:3   error    Expected linebreaks to be 'LF' but found 'CRLF'   linebreak-style
   41:3   error    Missing semicolon                                 semi
   42:1   error    Expected linebreaks to be 'LF' but found 'CRLF'   linebreak-style
   43:68  error    Expected linebreaks to be 'LF' but found 'CRLF'   linebreak-style
   44:4   error    Expected linebreaks to be 'LF' but found 'CRLF'   linebreak-style
   45:45  error    Expected linebreaks to be 'LF' but found 'CRLF'   linebreak-style
   46:4   error    Expected linebreaks to be 'LF' but found 'CRLF'   linebreak-style
   47:69  error    Expected linebreaks to be 'LF' but found 'CRLF'   linebreak-style
   48:1   error    Expected linebreaks to be 'LF' but found 'CRLF'   linebreak-style
   49:4   error    Expected linebreaks to be 'LF' but found 'CRLF'   linebreak-style
   50:68  error    Expected linebreaks to be 'LF' but found 'CRLF'   linebreak-style
   51:36  error    Expected linebreaks to be 'LF' but found 'CRLF'   linebreak-style
   52:4   error    Expected linebreaks to be 'LF' but found 'CRLF'   linebreak-style
   53:9   error    Strings must use doublequote                      quotes
   53:61  error    Expected linebreaks to be 'LF' but found 'CRLF'   linebreak-style
   54:1   error    Expected indentation of 4 spaces but found 2      indent
   54:43  error    Expected linebreaks to be 'LF' but found 'CRLF'   linebreak-style
   54:43  error    Missing semicolon                                 semi
   55:1   error    Expected indentation of 4 spaces but found 2      indent
   55:31  error    Expected linebreaks to be 'LF' but found 'CRLF'   linebreak-style
   55:31  error    Missing semicolon                                 semi
   56:3   error    Expected linebreaks to be 'LF' but found 'CRLF'   linebreak-style
   56:3   error    Missing semicolon                                 semi
   57:1   error    Expected linebreaks to be 'LF' but found 'CRLF'   linebreak-style
   58:4   error    Expected linebreaks to be 'LF' but found 'CRLF'   linebreak-style
   59:80  error    Expected linebreaks to be 'LF' but found 'CRLF'   linebreak-style
   60:4   error    Expected linebreaks to be 'LF' but found 'CRLF'   linebreak-style
   61:9   error    Strings must use doublequote                      quotes
   61:72  error    Expected linebreaks to be 'LF' but found 'CRLF'   linebreak-style
   62:1   error    Expected indentation of 4 spaces but found 2      indent
   62:43  error    Expected linebreaks to be 'LF' but found 'CRLF'   linebreak-style
   62:43  error    Missing semicolon                                 semi
   63:1   error    Expected indentation of 4 spaces but found 2      indent
   63:41  error    Expected linebreaks to be 'LF' but found 'CRLF'   linebreak-style
   63:41  error    Missing semicolon                                 semi
   64:3   error    Expected linebreaks to be 'LF' but found 'CRLF'   linebreak-style
   64:3   error    Missing semicolon                                 semi
   65:1   error    Expected linebreaks to be 'LF' but found 'CRLF'   linebreak-style
   66:4   error    Expected linebreaks to be 'LF' but found 'CRLF'   linebreak-style
   67:74  error    Expected linebreaks to be 'LF' but found 'CRLF'   linebreak-style
   68:4   error    Expected linebreaks to be 'LF' but found 'CRLF'   linebreak-style
   69:9   error    Strings must use doublequote                      quotes
   69:66  error    Expected linebreaks to be 'LF' but found 'CRLF'   linebreak-style
   70:1   error    Expected indentation of 4 spaces but found 2      indent
   70:43  error    Expected linebreaks to be 'LF' but found 'CRLF'   linebreak-style
   70:43  error    Missing semicolon                                 semi
   71:1   error    Expected indentation of 4 spaces but found 2      indent
   71:35  error    Expected linebreaks to be 'LF' but found 'CRLF'   linebreak-style
   71:35  error    Missing semicolon                                 semi
   72:3   error    Expected linebreaks to be 'LF' but found 'CRLF'   linebreak-style
   72:3   error    Missing semicolon                                 semi
   73:1   error    Expected linebreaks to be 'LF' but found 'CRLF'   linebreak-style
   74:1   error    Expected linebreaks to be 'LF' but found 'CRLF'   linebreak-style
   75:4   error    Expected linebreaks to be 'LF' but found 'CRLF'   linebreak-style
   76:87  error    Expected linebreaks to be 'LF' but found 'CRLF'   linebreak-style
   77:4   error    Expected linebreaks to be 'LF' but found 'CRLF'   linebreak-style
   78:9   error    Strings must use doublequote                      quotes
   78:86  error    Expected linebreaks to be 'LF' but found 'CRLF'   linebreak-style
   79:1   error    Expected indentation of 4 spaces but found 2      indent
   79:48  error    Expected linebreaks to be 'LF' but found 'CRLF'   linebreak-style
   79:48  error    Missing semicolon                                 semi
   80:1   error    Expected indentation of 4 spaces but found 2      indent
   80:48  error    Expected linebreaks to be 'LF' but found 'CRLF'   linebreak-style
   80:48  error    Missing semicolon                                 semi
   81:1   error    Expected indentation of 4 spaces but found 2      indent
   81:23  error    Expected linebreaks to be 'LF' but found 'CRLF'   linebreak-style
   81:23  error    Missing semicolon                                 semi
   82:1   error    Expected indentation of 4 spaces but found 2      indent
   82:23  error    Expected linebreaks to be 'LF' but found 'CRLF'   linebreak-style
   82:23  error    Missing semicolon                                 semi
   83:1   error    Expected indentation of 4 spaces but found 2      indent
   83:70  error    Expected linebreaks to be 'LF' but found 'CRLF'   linebreak-style
   83:70  error    Missing semicolon                                 semi
   84:3   error    Expected linebreaks to be 'LF' but found 'CRLF'   linebreak-style
   84:3   error    Missing semicolon                                 semi
   85:1   error    Expected linebreaks to be 'LF' but found 'CRLF'   linebreak-style
   86:4   error    Expected linebreaks to be 'LF' but found 'CRLF'   linebreak-style
   87:81  error    Expected linebreaks to be 'LF' but found 'CRLF'   linebreak-style
   88:4   error    Expected linebreaks to be 'LF' but found 'CRLF'   linebreak-style
   89:9   error    Strings must use doublequote                      quotes
   89:80  error    Expected linebreaks to be 'LF' but found 'CRLF'   linebreak-style
   90:1   error    Expected indentation of 4 spaces but found 2      indent
   90:48  error    Expected linebreaks to be 'LF' but found 'CRLF'   linebreak-style
   90:48  error    Missing semicolon                                 semi
   91:1   error    Expected indentation of 4 spaces but found 2      indent
   91:48  error    Expected linebreaks to be 'LF' but found 'CRLF'   linebreak-style
   91:48  error    Missing semicolon                                 semi
   92:1   error    Expected indentation of 4 spaces but found 2      indent
   92:58  error    Expected linebreaks to be 'LF' but found 'CRLF'   linebreak-style
   92:58  error    Missing semicolon                                 semi
   93:3   error    Expected linebreaks to be 'LF' but found 'CRLF'   linebreak-style
   93:3   error    Missing semicolon                                 semi
   94:1   error    Expected linebreaks to be 'LF' but found 'CRLF'   linebreak-style
   95:68  error    Expected linebreaks to be 'LF' but found 'CRLF'   linebreak-style
   96:4   error    Expected linebreaks to be 'LF' but found 'CRLF'   linebreak-style
   97:43  error    Expected linebreaks to be 'LF' but found 'CRLF'   linebreak-style
   98:4   error    Expected linebreaks to be 'LF' but found 'CRLF'   linebreak-style
   99:69  error    Expected linebreaks to be 'LF' but found 'CRLF'   linebreak-style
  100:4   error    Expected linebreaks to be 'LF' but found 'CRLF'   linebreak-style
  101:31  error    Expected linebreaks to be 'LF' but found 'CRLF'   linebreak-style
  102:20  error    Expected linebreaks to be 'LF' but found 'CRLF'   linebreak-style
  103:44  error    Expected linebreaks to be 'LF' but found 'CRLF'   linebreak-style
  104:4   error    Expected linebreaks to be 'LF' but found 'CRLF'   linebreak-style
  105:10  error    Strings must use doublequote                      quotes
  105:43  error    Expected linebreaks to be 'LF' but found 'CRLF'   linebreak-style
  106:1   error    Expected indentation of 4 spaces but found 2      indent
  106:42  error    Expected linebreaks to be 'LF' but found 'CRLF'   linebreak-style
  107:1   error    Expected indentation of 4 spaces but found 2      indent
  107:50  error    Expected linebreaks to be 'LF' but found 'CRLF'   linebreak-style
  108:1   error    Expected indentation of 8 spaces but found 4      indent
  108:25  error    Expected linebreaks to be 'LF' but found 'CRLF'   linebreak-style
  109:1   error    Expected indentation of 4 spaces but found 2      indent
  109:4   error    Expected linebreaks to be 'LF' but found 'CRLF'   linebreak-style
  110:1   error    Expected indentation of 4 spaces but found 2      indent
  110:43  error    Expected linebreaks to be 'LF' but found 'CRLF'   linebreak-style
  110:43  error    Missing semicolon                                 semi
  111:1   error    Expected indentation of 4 spaces but found 2      indent
  111:41  error    Expected linebreaks to be 'LF' but found 'CRLF'   linebreak-style
  112:1   error    Expected indentation of 4 spaces but found 2      indent
  112:25  error    Expected linebreaks to be 'LF' but found 'CRLF'   linebreak-style
  112:25  error    Missing semicolon                                 semi
  113:3   error    Expected linebreaks to be 'LF' but found 'CRLF'   linebreak-style
  113:3   error    Missing semicolon                                 semi
  114:1   error    Expected linebreaks to be 'LF' but found 'CRLF'   linebreak-style
  115:10  error    Strings must use doublequote                      quotes
  115:60  error    Expected linebreaks to be 'LF' but found 'CRLF'   linebreak-style
  116:1   error    Expected indentation of 4 spaces but found 2      indent
  116:48  error    Expected linebreaks to be 'LF' but found 'CRLF'   linebreak-style
  116:48  error    Missing semicolon                                 semi
  117:1   error    Expected indentation of 4 spaces but found 2      indent
  117:26  error    Expected linebreaks to be 'LF' but found 'CRLF'   linebreak-style
  118:1   error    Expected indentation of 4 spaces but found 2      indent
  118:23  error    Expected linebreaks to be 'LF' but found 'CRLF'   linebreak-style
  119:3   error    Expected linebreaks to be 'LF' but found 'CRLF'   linebreak-style
  119:3   error    Missing semicolon                                 semi
  120:1   error    Expected linebreaks to be 'LF' but found 'CRLF'   linebreak-style
  121:1   error    Expected linebreaks to be 'LF' but found 'CRLF'   linebreak-style
  122:68  error    Expected linebreaks to be 'LF' but found 'CRLF'   linebreak-style
  123:4   error    Expected linebreaks to be 'LF' but found 'CRLF'   linebreak-style
  124:46  error    Expected linebreaks to be 'LF' but found 'CRLF'   linebreak-style
  125:4   error    Expected linebreaks to be 'LF' but found 'CRLF'   linebreak-style
  126:69  error    Expected linebreaks to be 'LF' but found 'CRLF'   linebreak-style
  127:1   error    Expected linebreaks to be 'LF' but found 'CRLF'   linebreak-style
  128:4   error    Expected linebreaks to be 'LF' but found 'CRLF'   linebreak-style
  129:31  error    Expected linebreaks to be 'LF' but found 'CRLF'   linebreak-style
  130:30  error    Expected linebreaks to be 'LF' but found 'CRLF'   linebreak-style
  131:44  error    Expected linebreaks to be 'LF' but found 'CRLF'   linebreak-style
  132:4   error    Expected linebreaks to be 'LF' but found 'CRLF'   linebreak-style
  133:10  error    Strings must use doublequote                      quotes
  133:65  error    Expected linebreaks to be 'LF' but found 'CRLF'   linebreak-style
  134:1   error    Expected indentation of 4 spaces but found 2      indent
  134:48  error    Expected linebreaks to be 'LF' but found 'CRLF'   linebreak-style
  134:48  error    Missing semicolon                                 semi
  135:1   error    Expected indentation of 4 spaces but found 2      indent
  135:42  error    Expected linebreaks to be 'LF' but found 'CRLF'   linebreak-style
  136:1   error    Expected indentation of 4 spaces but found 2      indent
  136:30  error    Expected linebreaks to be 'LF' but found 'CRLF'   linebreak-style
  137:1   error    Expected indentation of 4 spaces but found 2      indent
  137:50  error    Expected linebreaks to be 'LF' but found 'CRLF'   linebreak-style
  138:1   error    Expected indentation of 8 spaces but found 4      indent
  138:25  error    Expected linebreaks to be 'LF' but found 'CRLF'   linebreak-style
  139:1   error    Expected indentation of 4 spaces but found 2      indent
  139:4   error    Expected linebreaks to be 'LF' but found 'CRLF'   linebreak-style
  140:1   error    Expected indentation of 4 spaces but found 2      indent
  140:54  error    Expected linebreaks to be 'LF' but found 'CRLF'   linebreak-style
  141:1   error    Expected indentation of 4 spaces but found 2      indent
  141:53  error    Expected linebreaks to be 'LF' but found 'CRLF'   linebreak-style
  142:1   error    Expected indentation of 4 spaces but found 2      indent
  142:41  error    Expected linebreaks to be 'LF' but found 'CRLF'   linebreak-style
  143:1   error    Expected indentation of 4 spaces but found 2      indent
  143:25  error    Expected linebreaks to be 'LF' but found 'CRLF'   linebreak-style
  143:25  error    Missing semicolon                                 semi
  144:3   error    Expected linebreaks to be 'LF' but found 'CRLF'   linebreak-style
  144:3   error    Missing semicolon                                 semi
  145:1   error    Expected linebreaks to be 'LF' but found 'CRLF'   linebreak-style
  146:4   error    Expected linebreaks to be 'LF' but found 'CRLF'   linebreak-style
  147:33  error    Expected linebreaks to be 'LF' but found 'CRLF'   linebreak-style
  148:4   error    Expected linebreaks to be 'LF' but found 'CRLF'   linebreak-style
  149:10  error    Strings must use doublequote                      quotes
  149:83  error    Expected linebreaks to be 'LF' but found 'CRLF'   linebreak-style
  150:1   error    Expected indentation of 4 spaces but found 2      indent
  150:48  error    Expected linebreaks to be 'LF' but found 'CRLF'   linebreak-style
  150:48  error    Missing semicolon                                 semi
  151:1   error    Expected indentation of 4 spaces but found 2      indent
  151:48  error    Expected linebreaks to be 'LF' but found 'CRLF'   linebreak-style
  151:48  error    Missing semicolon                                 semi
  152:1   error    Expected indentation of 4 spaces but found 2      indent
  152:38  error    Expected linebreaks to be 'LF' but found 'CRLF'   linebreak-style
  153:1   error    Expected indentation of 4 spaces but found 2      indent
  153:23  error    Expected linebreaks to be 'LF' but found 'CRLF'   linebreak-style
  154:3   error    Expected linebreaks to be 'LF' but found 'CRLF'   linebreak-style
  154:3   error    Missing semicolon                                 semi
  155:10  error    Strings must use doublequote                      quotes
  155:45  error    Expected linebreaks to be 'LF' but found 'CRLF'   linebreak-style
  156:1   error    Expected indentation of 4 spaces but found 2      indent
  156:18  error    Expected linebreaks to be 'LF' but found 'CRLF'   linebreak-style
  157:1   error    Expected indentation of 4 spaces but found 2      indent
  157:20  error    Expected linebreaks to be 'LF' but found 'CRLF'   linebreak-style
  158:1   error    Expected indentation of 4 spaces but found 2      indent
  158:23  error    Expected linebreaks to be 'LF' but found 'CRLF'   linebreak-style
  159:4   error    Expected linebreaks to be 'LF' but found 'CRLF'   linebreak-style
  160:1   error    Expected linebreaks to be 'LF' but found 'CRLF'   linebreak-style
  161:10  error    Strings must use doublequote                      quotes
  161:86  error    Expected linebreaks to be 'LF' but found 'CRLF'   linebreak-style
  162:1   error    Expected indentation of 4 spaces but found 2      indent
  162:18  error    Expected linebreaks to be 'LF' but found 'CRLF'   linebreak-style
  163:1   error    Expected indentation of 4 spaces but found 2      indent
  163:20  error    Expected linebreaks to be 'LF' but found 'CRLF'   linebreak-style
  164:1   error    Expected indentation of 4 spaces but found 2      indent
  164:23  error    Expected linebreaks to be 'LF' but found 'CRLF'   linebreak-style
  165:3   error    Expected linebreaks to be 'LF' but found 'CRLF'   linebreak-style
  165:3   error    Missing semicolon                                 semi
  166:1   error    Expected linebreaks to be 'LF' but found 'CRLF'   linebreak-style
  167:10  error    Strings must use doublequote                      quotes
  167:73  error    Expected linebreaks to be 'LF' but found 'CRLF'   linebreak-style
  168:1   error    Expected indentation of 4 spaces but found 2      indent
  168:48  error    Expected linebreaks to be 'LF' but found 'CRLF'   linebreak-style
  168:48  error    Missing semicolon                                 semi
  169:1   error    Expected indentation of 4 spaces but found 2      indent
  169:35  error    Expected linebreaks to be 'LF' but found 'CRLF'   linebreak-style
  170:1   error    Expected indentation of 4 spaces but found 2      indent
  170:36  error    Expected linebreaks to be 'LF' but found 'CRLF'   linebreak-style
  171:1   error    Expected linebreaks to be 'LF' but found 'CRLF'   linebreak-style
  172:1   error    Expected indentation of 4 spaces but found 2      indent
  172:43  error    Expected linebreaks to be 'LF' but found 'CRLF'   linebreak-style
  173:1   error    Expected indentation of 4 spaces but found 2      indent
  173:23  error    Expected linebreaks to be 'LF' but found 'CRLF'   linebreak-style
  174:3   error    Expected linebreaks to be 'LF' but found 'CRLF'   linebreak-style
  174:3   error    Missing semicolon                                 semi
  175:1   error    Expected linebreaks to be 'LF' but found 'CRLF'   linebreak-style
  176:10  error    Strings must use doublequote                      quotes
  176:47  error    Expected linebreaks to be 'LF' but found 'CRLF'   linebreak-style
  177:1   error    Expected indentation of 4 spaces but found 2      indent
  177:35  error    Expected linebreaks to be 'LF' but found 'CRLF'   linebreak-style
  178:1   error    Expected indentation of 4 spaces but found 2      indent
  178:36  error    Expected linebreaks to be 'LF' but found 'CRLF'   linebreak-style
  179:1   error    Expected linebreaks to be 'LF' but found 'CRLF'   linebreak-style
  180:1   error    Expected indentation of 4 spaces but found 2      indent
  180:31  error    Expected linebreaks to be 'LF' but found 'CRLF'   linebreak-style
  181:1   error    Expected indentation of 4 spaces but found 2      indent
  181:23  error    Expected linebreaks to be 'LF' but found 'CRLF'   linebreak-style
  182:3   error    Expected linebreaks to be 'LF' but found 'CRLF'   linebreak-style
  182:3   error    Missing semicolon                                 semi
  183:1   error    Expected linebreaks to be 'LF' but found 'CRLF'   linebreak-style
  184:25  error    Expected linebreaks to be 'LF' but found 'CRLF'   linebreak-style
  185:1   error    Expected indentation of 4 spaces but found 2      indent
  185:63  error    Expected linebreaks to be 'LF' but found 'CRLF'   linebreak-style
  185:63  error    Missing semicolon                                 semi
  186:3   error    Missing semicolon                                 semi

D:\Uni\7.Semester\Bachlorpraktikum\Repo\medienserver\web_app\backend\init.ts
   1:1    error    Expected linebreaks to be 'LF' but found 'CRLF'                               linebreak-style
   2:21   error    Strings must use doublequote                                                  quotes
   2:31   error    Expected linebreaks to be 'LF' but found 'CRLF'                               linebreak-style
   3:20   error    Strings must use doublequote                                                  quotes
   3:29   error    Expected linebreaks to be 'LF' but found 'CRLF'                               linebreak-style
   4:24   error    Strings must use doublequote                                                  quotes
   4:37   error    Expected linebreaks to be 'LF' but found 'CRLF'                               linebreak-style
   4:37   error    Missing semicolon                                                             semi
   5:30   error    Strings must use doublequote                                                  quotes
   5:39   error    Expected linebreaks to be 'LF' but found 'CRLF'                               linebreak-style
   5:39   error    Missing semicolon                                                             semi
   6:18   error    Strings must use doublequote                                                  quotes
   6:25   error    Expected linebreaks to be 'LF' but found 'CRLF'                               linebreak-style
   7:35   error    Strings must use doublequote                                                  quotes
   7:63   error    Expected linebreaks to be 'LF' but found 'CRLF'                               linebreak-style
   8:1    error    Expected linebreaks to be 'LF' but found 'CRLF'                               linebreak-style
   9:52   error    Expected linebreaks to be 'LF' but found 'CRLF'                               linebreak-style
  10:36   error    Expected linebreaks to be 'LF' but found 'CRLF'                               linebreak-style
  11:11   error    Type number trivially inferred from a number literal, remove type annotation  @typescript-eslint/no-inferrable-types
  11:30   error    Expected linebreaks to be 'LF' but found 'CRLF'                               linebreak-style
  11:30   error    Missing semicolon                                                             semi
  12:1    error    Expected linebreaks to be 'LF' but found 'CRLF'                               linebreak-style
  13:40   error    Expected linebreaks to be 'LF' but found 'CRLF'                               linebreak-style
  14:56   error    Expected linebreaks to be 'LF' but found 'CRLF'                               linebreak-style
  15:102  error    Expected linebreaks to be 'LF' but found 'CRLF'                               linebreak-style
  16:16   error    Expected linebreaks to be 'LF' but found 'CRLF'                               linebreak-style
  17:8    error    Expected linebreaks to be 'LF' but found 'CRLF'                               linebreak-style
  18:1    error    Expected linebreaks to be 'LF' but found 'CRLF'                               linebreak-style
  19:10   error    Expected linebreaks to be 'LF' but found 'CRLF'                               linebreak-style
  20:9    error    'whitelist' is never reassigned. Use 'const' instead                          prefer-const
  20:22   error    Strings must use doublequote                                                  quotes
  20:46   error    Expected linebreaks to be 'LF' but found 'CRLF'                               linebreak-style
  20:46   error    Missing semicolon                                                             semi
  21:19   error    Expected linebreaks to be 'LF' but found 'CRLF'                               linebreak-style
  22:46   error    Expected linebreaks to be 'LF' but found 'CRLF'                               linebreak-style
  23:46   error    Expected linebreaks to be 'LF' but found 'CRLF'                               linebreak-style
  24:54   error    Expected linebreaks to be 'LF' but found 'CRLF'                               linebreak-style
  25:52   error    Expected linebreaks to be 'LF' but found 'CRLF'                               linebreak-style
  26:17   error    Unexpected var, use let or const instead                                      no-var
  26:119  error    Expected linebreaks to be 'LF' but found 'CRLF'                               linebreak-style
  27:60   error    Expected linebreaks to be 'LF' but found 'CRLF'                               linebreak-style
  28:14   error    Expected linebreaks to be 'LF' but found 'CRLF'                               linebreak-style
  29:41   error    Expected linebreaks to be 'LF' but found 'CRLF'                               linebreak-style
  30:10   error    Expected linebreaks to be 'LF' but found 'CRLF'                               linebreak-style
  31:9    error    Expected linebreaks to be 'LF' but found 'CRLF'                               linebreak-style
  32:1    error    Expected linebreaks to be 'LF' but found 'CRLF'                               linebreak-style
  33:20   error    Strings must use doublequote                                                  quotes
  33:28   error    Expected linebreaks to be 'LF' but found 'CRLF'                               linebreak-style
  34:1    error    Expected linebreaks to be 'LF' but found 'CRLF'                               linebreak-style
  35:13   error    Expected linebreaks to be 'LF' but found 'CRLF'                               linebreak-style
  36:38   error    Expected linebreaks to be 'LF' but found 'CRLF'                               linebreak-style
  37:22   error    Strings must use doublequote                                                  quotes
  37:39   error    Expected linebreaks to be 'LF' but found 'CRLF'                               linebreak-style
  38:49   error    Expected linebreaks to be 'LF' but found 'CRLF'                               linebreak-style
  39:57   error    Expected linebreaks to be 'LF' but found 'CRLF'                               linebreak-style
  40:12   error    Expected linebreaks to be 'LF' but found 'CRLF'                               linebreak-style
  41:7    error    Expected linebreaks to be 'LF' but found 'CRLF'                               linebreak-style
  42:1    error    Expected linebreaks to be 'LF' but found 'CRLF'                               linebreak-style
  43:19   warning  Unexpected any. Specify a different type                                      @typescript-eslint/no-explicit-any
  43:29   warning  Unexpected any. Specify a different type                                      @typescript-eslint/no-explicit-any
  43:39   warning  Unexpected any. Specify a different type                                      @typescript-eslint/no-explicit-any
  43:44   warning  'next' is defined but never used                                              @typescript-eslint/no-unused-vars
  43:50   warning  Unexpected any. Specify a different type                                      @typescript-eslint/no-explicit-any
  43:59   error    Expected linebreaks to be 'LF' but found 'CRLF'                               linebreak-style
  44:24   error    Expected linebreaks to be 'LF' but found 'CRLF'                               linebreak-style
  45:45   error    Expected linebreaks to be 'LF' but found 'CRLF'                               linebreak-style
  46:34   error    Expected linebreaks to be 'LF' but found 'CRLF'                               linebreak-style
  47:32   error    Expected linebreaks to be 'LF' but found 'CRLF'                               linebreak-style
  48:12   error    Expected linebreaks to be 'LF' but found 'CRLF'                               linebreak-style
  49:8    error    Expected linebreaks to be 'LF' but found 'CRLF'                               linebreak-style
  50:1    error    Expected linebreaks to be 'LF' but found 'CRLF'                               linebreak-style
  51:59   error    Expected linebreaks to be 'LF' but found 'CRLF'                               linebreak-style
  52:31   error    Expected linebreaks to be 'LF' but found 'CRLF'                               linebreak-style
  52:31   error    Missing semicolon                                                             semi
  53:13   error    Strings must use doublequote                                                  quotes
  53:29   error    Strings must use doublequote                                                  quotes
  53:41   error    Strings must use doublequote                                                  quotes
  53:54   error    Strings must use doublequote                                                  quotes
  53:69   error    Expected linebreaks to be 'LF' but found 'CRLF'                               linebreak-style
  53:69   error    Missing semicolon                                                             semi
  54:23   error    Expected linebreaks to be 'LF' but found 'CRLF'                               linebreak-style
  54:23   error    Missing semicolon                                                             semi

✖ 827 problems (814 errors, 13 warnings)
  814 errors and 0 warnings potentially fixable with the `--fix` option.
