<?xml version="1.0" encoding="UTF-8" standalone="no"?>
<!DOCTYPE svg PUBLIC "-//W3C//DTD SVG 1.1//EN"
 "http://www.w3.org/Graphics/SVG/1.1/DTD/svg11.dtd">
<!-- Generated by graphviz version 2.43.0 (0)
 -->
<!-- Title: Graphical Class Hierarchy Pages: 1 -->
<svg width="390pt" height="66pt"
 viewBox="0.00 0.00 390.00 66.00" xmlns="http://www.w3.org/2000/svg" xmlns:xlink="http://www.w3.org/1999/xlink">
<g id="graph0" class="graph" transform="scale(1 1) rotate(0) translate(4 62)">
<title>Graphical Class Hierarchy</title>
<polygon fill="white" stroke="transparent" points="-4,4 -4,-62 386,-62 386,4 -4,4"/>
<!-- Node441 -->
<g id="node1" class="node">
<title>Node441</title>
<g id="a_node1"><a xlink:title=" ">
<polygon fill="white" stroke="#bfbfbf" points="0,-19.5 0,-38.5 146,-38.5 146,-19.5 0,-19.5"/>
<text text-anchor="middle" x="73" y="-26.5" font-family="Helvetica,sans-Serif" font-size="10.00">gmock_test_utils.TestCase</text>
</a>
</g>
</g>
<!-- Node0 -->
<g id="node2" class="node">
<title>Node0</title>
<g id="a_node2"><a xlink:href="classgmock__leak__test_1_1GMockLeakTest.html" target="_top" xlink:title=" ">
<polygon fill="white" stroke="black" points="192.5,-38.5 192.5,-57.5 371.5,-57.5 371.5,-38.5 192.5,-38.5"/>
<text text-anchor="middle" x="282" y="-45.5" font-family="Helvetica,sans-Serif" font-size="10.00">gmock_leak_test.GMockLeakTest</text>
</a>
</g>
</g>
<!-- Node441&#45;&gt;Node0 -->
<g id="edge1" class="edge">
<title>Node441&#45;&gt;Node0</title>
<path fill="none" stroke="midnightblue" d="M156.39,-36.56C168.22,-37.65 180.44,-38.77 192.39,-39.87"/>
<polygon fill="midnightblue" stroke="midnightblue" points="156.39,-33.05 146.11,-35.62 155.75,-40.02 156.39,-33.05"/>
</g>
<!-- Node443 -->
<g id="node3" class="node">
<title>Node443</title>
<g id="a_node3"><a xlink:href="classgmock__output__test_1_1GMockOutputTest.html" target="_top" xlink:title=" ">
<polygon fill="white" stroke="black" points="182,-0.5 182,-19.5 382,-19.5 382,-0.5 182,-0.5"/>
<text text-anchor="middle" x="282" y="-7.5" font-family="Helvetica,sans-Serif" font-size="10.00">gmock_output_test.GMockOutputTest</text>
</a>
</g>
</g>
<!-- Node441&#45;&gt;Node443 -->
<g id="edge2" class="edge">
<title>Node441&#45;&gt;Node443</title>
<path fill="none" stroke="midnightblue" d="M156.25,-21.45C164.66,-20.68 173.27,-19.89 181.84,-19.1"/>
<polygon fill="midnightblue" stroke="midnightblue" points="155.75,-17.98 146.11,-22.38 156.39,-24.95 155.75,-17.98"/>
</g>
</g>
</svg>
