<?xml version="1.0" encoding="UTF-8" standalone="no"?>
<!DOCTYPE svg PUBLIC "-//W3C//DTD SVG 1.1//EN"
 "http://www.w3.org/Graphics/SVG/1.1/DTD/svg11.dtd">
<!-- Generated by graphviz version 2.43.0 (0)
 -->
<!-- Title: test Pages: 1 -->
<svg width="130pt" height="239pt"
 viewBox="0.00 0.00 130.00 239.00" xmlns="http://www.w3.org/2000/svg" xmlns:xlink="http://www.w3.org/1999/xlink">
<g id="graph0" class="graph" transform="scale(1 1) rotate(0) translate(4 235)">
<title>test</title>
<polygon fill="white" stroke="transparent" points="-4,4 -4,-235 126,-235 126,4 -4,4"/>
<g id="clust1" class="cluster">
<title>clusterdir_81b007610a59bc1f4a5ed448a6168bbb</title>
<g id="a_clust1"><a xlink:href="dir_81b007610a59bc1f4a5ed448a6168bbb.html" target="_top" xlink:title="media_framework">
<polygon fill="#ddddee" stroke="black" points="8,-8 8,-223 114,-223 114,-8 8,-8"/>
<text text-anchor="middle" x="61" y="-211" font-family="Helvetica,sans-Serif" font-size="10.00">media_framework</text>
</a>
</g>
</g>
<!-- dir_2216667e0452c61c00f98e2752b3a9f2 -->
<g id="node1" class="node">
<title>dir_2216667e0452c61c00f98e2752b3a9f2</title>
<g id="a_node1"><a xlink:href="dir_2216667e0452c61c00f98e2752b3a9f2.html" target="_top" xlink:title="gstreamer&#45;cpp">
<polygon fill="white" stroke="red" points="105,-52 17,-52 17,-16 105,-16 105,-52"/>
<text text-anchor="middle" x="61" y="-31.5" font-family="Helvetica,sans-Serif" font-size="10.00">gstreamer&#45;cpp</text>
</a>
</g>
</g>
<!-- dir_6663f9701dfef3280c6153a761bfda2e -->
<g id="node2" class="node">
<title>dir_6663f9701dfef3280c6153a761bfda2e</title>
<g id="a_node2"><a xlink:href="dir_6663f9701dfef3280c6153a761bfda2e.html" target="_top" xlink:title="include">
<polygon fill="none" stroke="black" points="98,-124 44,-124 44,-88 98,-88 98,-124"/>
<text text-anchor="middle" x="71" y="-103.5" font-family="Helvetica,sans-Serif" font-size="10.00">include</text>
</a>
</g>
</g>
<!-- dir_6663f9701dfef3280c6153a761bfda2e&#45;&gt;dir_2216667e0452c61c00f98e2752b3a9f2 -->
<g id="edge1" class="edge">
<title>dir_6663f9701dfef3280c6153a761bfda2e&#45;&gt;dir_2216667e0452c61c00f98e2752b3a9f2</title>
<path fill="none" stroke="black" d="M68.53,-87.7C67.43,-79.98 66.1,-70.71 64.87,-62.11"/>
<polygon fill="black" stroke="black" points="68.32,-61.51 63.44,-52.1 61.39,-62.5 68.32,-61.51"/>
<g id="a_edge1&#45;headlabel"><a xlink:href="dir_000046_000010.html" target="_top" xlink:title="1">
<text text-anchor="middle" x="71.64" y="-62.17" font-family="Helvetica,sans-Serif" font-size="10.00">1</text>
</a>
</g>
</g>
<!-- dir_8ea6d30975e2a11f449a41d297a2b829 -->
<g id="node3" class="node">
<title>dir_8ea6d30975e2a11f449a41d297a2b829</title>
<g id="a_node3"><a xlink:href="dir_8ea6d30975e2a11f449a41d297a2b829.html" target="_top" xlink:title="test">
<polygon fill="#eeeeff" stroke="black" points="80,-196 26,-196 26,-160 80,-160 80,-196"/>
<text text-anchor="middle" x="53" y="-175.5" font-family="Helvetica,sans-Serif" font-size="10.00">test</text>
</a>
</g>
</g>
<!-- dir_8ea6d30975e2a11f449a41d297a2b829&#45;&gt;dir_2216667e0452c61c00f98e2752b3a9f2 -->
<g id="edge2" class="edge">
<title>dir_8ea6d30975e2a11f449a41d297a2b829&#45;&gt;dir_2216667e0452c61c00f98e2752b3a9f2</title>
<path fill="none" stroke="black" d="M45.17,-159.88C37.97,-141.91 29.23,-112.88 35,-88 37.1,-78.96 40.97,-69.68 45.09,-61.47"/>
<polygon fill="black" stroke="black" points="48.31,-62.86 49.95,-52.39 42.14,-59.55 48.31,-62.86"/>
<g id="a_edge2&#45;headlabel"><a xlink:href="dir_000047_000010.html" target="_top" xlink:title="1">
<text text-anchor="middle" x="49.12" y="-64.87" font-family="Helvetica,sans-Serif" font-size="10.00">1</text>
</a>
</g>
</g>
<!-- dir_8ea6d30975e2a11f449a41d297a2b829&#45;&gt;dir_6663f9701dfef3280c6153a761bfda2e -->
<g id="edge3" class="edge">
<title>dir_8ea6d30975e2a11f449a41d297a2b829&#45;&gt;dir_6663f9701dfef3280c6153a761bfda2e</title>
<path fill="none" stroke="black" d="M57.45,-159.7C59.45,-151.9 61.87,-142.51 64.1,-133.83"/>
<polygon fill="black" stroke="black" points="67.5,-134.66 66.6,-124.1 60.72,-132.92 67.5,-134.66"/>
<g id="a_edge3&#45;headlabel"><a xlink:href="dir_000047_000046.html" target="_top" xlink:title="4">
<text text-anchor="middle" x="69.36" y="-136.35" font-family="Helvetica,sans-Serif" font-size="10.00">4</text>
</a>
</g>
</g>
</g>
</svg>
