<?xml version="1.0" encoding="UTF-8" standalone="no"?>
<!DOCTYPE svg PUBLIC "-//W3C//DTD SVG 1.1//EN"
 "http://www.w3.org/Graphics/SVG/1.1/DTD/svg11.dtd">
<!-- Generated by graphviz version 2.43.0 (0)
 -->
<!-- Title: media_framework.hpp Pages: 1 -->
<svg width="394pt" height="95pt"
 viewBox="0.00 0.00 393.50 95.00" xmlns="http://www.w3.org/2000/svg" xmlns:xlink="http://www.w3.org/1999/xlink">
<g id="graph0" class="graph" transform="scale(1 1) rotate(0) translate(4 91)">
<title>media_framework.hpp</title>
<polygon fill="white" stroke="transparent" points="-4,4 -4,-91 389.5,-91 389.5,4 -4,4"/>
<!-- Node1 -->
<g id="node1" class="node">
<title>Node1</title>
<g id="a_node1"><a xlink:title=" ">
<polygon fill="#bfbfbf" stroke="black" points="79.5,-67.5 79.5,-86.5 206.5,-86.5 206.5,-67.5 79.5,-67.5"/>
<text text-anchor="middle" x="143" y="-74.5" font-family="Helvetica,sans-Serif" font-size="10.00">media_framework.hpp</text>
</a>
</g>
</g>
<!-- Node2 -->
<g id="node2" class="node">
<title>Node2</title>
<g id="a_node2"><a xlink:href="main_8cpp.html" target="_top" xlink:title="MediaServer Core Executable File.">
<polygon fill="white" stroke="black" points="0,-6 0,-25 62,-25 62,-6 0,-6"/>
<text text-anchor="middle" x="31" y="-13" font-family="Helvetica,sans-Serif" font-size="10.00">main.cpp</text>
</a>
</g>
</g>
<!-- Node1&#45;&gt;Node2 -->
<g id="edge1" class="edge">
<title>Node1&#45;&gt;Node2</title>
<path fill="none" stroke="midnightblue" d="M117.99,-62.71C96.3,-51.19 65.55,-34.86 47.02,-25.01"/>
<polygon fill="midnightblue" stroke="midnightblue" points="116.48,-65.87 126.95,-67.48 119.76,-59.69 116.48,-65.87"/>
</g>
<!-- Node3 -->
<g id="node3" class="node">
<title>Node3</title>
<g id="a_node3"><a xlink:href="media__framework_8cpp.html" target="_top" xlink:title=" ">
<polygon fill="white" stroke="black" points="80,-6 80,-25 206,-25 206,-6 80,-6"/>
<text text-anchor="middle" x="143" y="-13" font-family="Helvetica,sans-Serif" font-size="10.00">media_framework.cpp</text>
</a>
</g>
</g>
<!-- Node1&#45;&gt;Node3 -->
<g id="edge2" class="edge">
<title>Node1&#45;&gt;Node3</title>
<path fill="none" stroke="midnightblue" d="M143,-57.32C143,-46.5 143,-33.4 143,-25.01"/>
<polygon fill="midnightblue" stroke="midnightblue" points="139.5,-57.48 143,-67.48 146.5,-57.48 139.5,-57.48"/>
</g>
<!-- Node4 -->
<g id="node4" class="node">
<title>Node4</title>
<g id="a_node4"><a xlink:href="media__framework__automatic__tests_8cpp.html" target="_top" xlink:title="MediaServer Media framework automatic tests.">
<polygon fill="white" stroke="black" points="224.5,-0.5 224.5,-30.5 385.5,-30.5 385.5,-0.5 224.5,-0.5"/>
<text text-anchor="start" x="232.5" y="-18.5" font-family="Helvetica,sans-Serif" font-size="10.00">media_framework_automatic</text>
<text text-anchor="middle" x="305" y="-7.5" font-family="Helvetica,sans-Serif" font-size="10.00">_tests.cpp</text>
</a>
</g>
</g>
<!-- Node1&#45;&gt;Node4 -->
<g id="edge3" class="edge">
<title>Node1&#45;&gt;Node4</title>
<path fill="none" stroke="midnightblue" d="M175.74,-63.98C202.08,-54.3 239.13,-40.69 266.82,-30.52"/>
<polygon fill="midnightblue" stroke="midnightblue" points="174.39,-60.74 166.21,-67.48 176.8,-67.31 174.39,-60.74"/>
</g>
</g>
</svg>
