{
    "authority": {
        "uri": "http://localhost:8081/"
    },
    "process": {
        "checkLatest": false,
        "location": "/processes/handleBinariesExample",
        "uses": []
    },
    "activity": {
        "location": "/activities/handleBinariesExample"
    }
}
