{
	"JSON": {
		"ID": "1ee83026-7a67-6265-9a3a-9287b8f601a2",
		"label": "",
		"comment": "UUID6 is used"
	},
	"probe": {
		"metadata": "define your own metadata here",
		"info": "think about all necessary things you should write down, that someone else can understand what you were doing"
	}
}