{
    "39790":{
        "item number":39790,
        "item description":"Technic, Liftarm, Modified Frame Thick 11 x 15 Open Center",
        "category":"frame",
        "price [Euro]":2.19,
        "mass [g]":12.96,
        "delivery time [days]":3,
        "data source":"https://www.bricklink.com/v2/catalog/catalogitem.page?P=39790#T=C",
        "dimension [studs]":"11 x 15 x 1"
    },
    "32532":{
        "item number":32532,
        "item description":"Technic, Brick 6 x 8 Open Center",
        "category":"frame",
        "price [Euro]":0.18,
        "mass [g]":8.0,
        "delivery time [days]":3,
        "data source":"https://www.bricklink.com/v2/catalog/catalogitem.page?P=32532#T=C",
        "dimension [studs]":"6 x 8 x 1"
    },
    "32531":{
        "item number":32531,
        "item description":"Technic, Brick 4 x 6 Open Center",
        "category":"frame",
        "price [Euro]":0.1,
        "mass [g]":5.0,
        "delivery time [days]":3,
        "data source":"https://www.bricklink.com/v2/catalog/catalogitem.page?P=32531&idColor=11#T=C&C=11",
        "dimension [studs]":"4 x 6 x 1"
    },
    "3700":{
        "item number":3700,
        "item description":"Technic, Brick 1 x 2 with Hole",
        "category":"frame",
        "price [Euro]":0.01,
        "mass [g]":0.82,
        "delivery time [days]":3,
        "data source":"https://www.bricklink.com/v2/catalog/catalogitem.page?P=3700#T=C",
        "dimension [studs]":"1 x 2"
    },
    "3701":{
        "item number":3701,
        "item description":"Technic, Brick 1 x 4 with Holes",
        "category":"frame",
        "price [Euro]":0.01,
        "mass [g]":1.46,
        "delivery time [days]":3,
        "data source":"https://www.bricklink.com/v2/catalog/catalogitem.page?P=3701#T=C",
        "dimension [studs]":"1 x 4 x 1"
    },
    "3702":{
        "item number":3702,
        "item description":"Technic, Brick 1 x 8 with Holes",
        "category":"frame",
        "price [Euro]":0.01,
        "mass [g]":2.85,
        "delivery time [days]":5,
        "data source":"https://www.bricklink.com/v2/catalog/catalogitem.page?P=3702#T=C",
        "dimension [studs]":"1 x 8 x 1"
    },
    "2730":{
        "item number":2730,
        "item description":"Technic, Brick 1 x 10 with Holes",
        "category":"frame",
        "price [Euro]":0.01,
        "mass [g]":3.67,
        "delivery time [days]":5,
        "data source":"https://www.bricklink.com/v2/catalog/catalogitem.page?P=2730#T=C",
        "dimension [studs]":"1 x 10 x 1"
    },
    "3895":{
        "item number":3895,
        "item description":"Technic, Brick 1 x 12 with Holes",
        "category":"frame",
        "price [Euro]":0.03,
        "mass [g]":4.2,
        "delivery time [days]":5,
        "data source":"https://www.bricklink.com/v2/catalog/catalogitem.page?P=3895#T=C",
        "dimension [studs]":"1 x 12 x 1"
    },
    "32018":{
        "item number":32018,
        "item description":"Technic, Brick 1 x 14 with Holes",
        "category":"frame",
        "price [Euro]":0.03,
        "mass [g]":4.92,
        "delivery time [days]":5,
        "data source":"https://www.bricklink.com/v2/catalog/catalogitem.page?P=32018#T=C",
        "dimension [studs]":"1 x 14 x 1"
    },
    "3703":{
        "item number":3703,
        "item description":"Technic, Brick 1 x 16 with Holes",
        "category":"frame",
        "price [Euro]":0.07,
        "mass [g]":5.87,
        "delivery time [days]":5,
        "data source":"https://www.bricklink.com/v2/catalog/catalogitem.page?P=3703#T=C",
        "dimension [studs]":"1 x 16 x 1"
    },
    "32524":{
        "item number":32524,
        "item description":"Technic, Liftarm Thick 1 x 7",
        "category":"frame",
        "price [Euro]":0.01,
        "mass [g]":1.79,
        "delivery time [days]":3,
        "data source":"https://www.bricklink.com/v2/catalog/catalogitem.page?P=32524&name=Technic,%20Liftarm%20Thick%201%20x%207&category=%5BTechnic,%20Liftarm%5D#T=S&O={%22iconly%22:0}",
        "dimension [studs]":"1 x 7"
    },
    "40490":{
        "item number":40490,
        "item description":"Technic, Liftarm Thick 1 x 9",
        "category":"frame",
        "price [Euro]":0.02,
        "mass [g]":2.59,
        "delivery time [days]":3,
        "data source":"https://www.bricklink.com/v2/catalog/catalogitem.page?P=40490&name=Technic,%20Liftarm%20Thick%201%20x%209&category=%5BTechnic,%20Liftarm%5D#T=S&O={%22iconly%22:0}",
        "dimension [studs]":"1 x 9"
    },
    "32525":{
        "item number":32525,
        "item description":"Technic, Liftarm Thick 1 x 11",
        "category":"frame",
        "price [Euro]":0.02,
        "mass [g]":2.8,
        "delivery time [days]":3,
        "data source":"https://www.bricklink.com/v2/catalog/catalogitem.page?P=32525&name=Technic,%20Liftarm%20Thick%201%20x%2011&category=%5BTechnic,%20Liftarm%5D#T=S&O={%22iconly%22:0}",
        "dimension [studs]":"1 x 11"
    },
    "41239":{
        "item number":41239,
        "item description":"Technic, Liftarm Thick 1 x 13",
        "category":"frame",
        "price [Euro]":0.05,
        "mass [g]":3.3,
        "delivery time [days]":5,
        "data source":"https://www.bricklink.com/v2/catalog/catalogitem.page?P=41239&name=Technic,%20Liftarm%20Thick%201%20x%2013&category=%5BTechnic,%20Liftarm%5D#T=S&O={%22iconly%22:0}",
        "dimension [studs]":"1 x 13"
    },
    "32278":{
        "item number":32278,
        "item description":"Technic, Liftarm Thick 1 x 15",
        "category":"frame",
        "price [Euro]":0.05,
        "mass [g]":4.0,
        "delivery time [days]":3,
        "data source":"https://www.bricklink.com/v2/catalog/catalogitem.page?P=32278&name=Technic,%20Liftarm%20Thick%201%20x%2015&category=%5BTechnic,%20Liftarm%5D#T=S&O={%22iconly%22:0}",
        "dimension [studs]":"1 x 15"
    },
    "3713":{
        "item number":3713,
        "item description":"Technic Bush",
        "category":"frame",
        "price [Euro]":0.01,
        "mass [g]":0.14,
        "delivery time [days]":3,
        "data source":"https://www.bricklink.com/v2/catalog/catalogitem.page?P=3713&name=Technic%20Bush&category=%5BTechnic%5D#T=S&O={%22iconly%22:0}",
        "dimension [studs]":1
    },
    "32123":{
        "item number":32123,
        "item description":"Technic Bush 1/2 Smooth",
        "category":"frame",
        "price [Euro]":0.01,
        "mass [g]":0.01,
        "delivery time [days]":3,
        "data source":"https://www.bricklink.com/v2/catalog/catalogitem.page?P=4265c&name=Technic%20Bush%201/2%20Smooth&category=%5BTechnic%5D#T=S&O={%22iconly%22:0}",
        "dimension [studs]":1
    },
    "3749":{
        "item number":3749,
        "item description":"Technic, Axle 1L with Pin without Friction Ridges",
        "category":"frame",
        "price [Euro]":0.01,
        "mass [g]":0.22,
        "delivery time [days]":5,
        "data source":"https://www.bricklink.com/v2/catalog/catalogitem.page?P=3749&name=Technic,%20Axle%20%201L%20with%20Pin%20without%20Friction%20Ridges&category=%5BTechnic,%20Axle%5D#T=S&O={%22iconly%22:0}",
        "dimension [studs]":"0,75 x 2 x 0,55"
    },
    "6538":{
        "item number":6538,
        "item description":"Technic, Axle Connector 2L (Ridged Undetermined Type)",
        "category":"frame",
        "price [Euro]":0.03,
        "mass [g]":0.4,
        "delivery time [days]":5,
        "data source":"https://www.bricklink.com/v2/catalog/catalogitem.page?P=6538#T=C",
        "dimension [studs]":"?"
    },
    "6536":{
        "item number":6536,
        "item description":"Technic, Axle and Pin Connector Perpendicular",
        "category":"frame",
        "price [Euro]":0.01,
        "mass [g]":0.39,
        "delivery time [days]":7,
        "data source":"https://www.bricklink.com/v2/catalog/catalogitem.page?P=6536&name=Technic,%20Axle%20and%20Pin%20Connector%20Perpendicular&category=%5BTechnic,%20Connector%5D#T=S&O={%22iconly%22:0}",
        "dimension [studs]":"1x 2 x 1"
    },
    "32138":{
        "item number":32138,
        "item description":"Technic, Pin Double with Axle Hole",
        "category":"frame",
        "price [Euro]":0.01,
        "mass [g]":0.96,
        "delivery time [days]":3,
        "data source":"https://www.bricklink.com/v2/catalog/catalogitem.page?P=32138&name=Technic,%20Pin%20Double%20with%20Axle%20Hole&category=%5BTechnic,%20Pin%5D#T=S&O={%22iconly%22:0}",
        "dimension [studs]":"?"
    },
    "14720":{
        "item number":14720,
        "item description":"Technic, Liftarm, Modified H-Shape Thick 3 x 5 Perpendicular",
        "category":"frame",
        "price [Euro]":0.08,
        "mass [g]":2.29,
        "delivery time [days]":3,
        "data source":"https://www.bricklink.com/v2/catalog/catalogitem.page?P=14720&name=Technic,%20Liftarm,%20Modified%20H-Shape%20Thick%203%20x%205%20Perpendicular&category=%5BTechnic,%20Liftarm%5D#T=S&O={%22iconly%22:0}",
        "dimension [studs]":"3 x 5 x 1"
    },
    "48989":{
        "item number":48989,
        "item description":"Technic, Pin Connector Perpendicular 3L with 4 Pins",
        "category":"frame",
        "price [Euro]":0.01,
        "mass [g]":1.22,
        "delivery time [days]":5,
        "data source":"https://www.bricklink.com/v2/catalog/catalogitem.page?P=48989&name=Technic,%20Pin%20Connector%20Perpendicular%203L%20with%204%20Pins&category=%5BTechnic,%20Connector%5D#T=S&O={%22iconly%22:0}",
        "dimension [studs]":"3 x 3 x 1"
    },
    "55615":{
        "item number":55615,
        "item description":"Technic, Pin Connector Perpendicular 3 x 3 Bent with 4 Pins",
        "category":"frame",
        "price [Euro]":0.1,
        "mass [g]":1.9,
        "delivery time [days]":5,
        "data source":"https://www.bricklink.com/v2/catalog/catalogitem.page?P=55615&name=Technic,%20Pin%20Connector%20Perpendicular%203%20x%203%20Bent%20with%204%20Pins&category=%5BTechnic,%20Connector%5D#T=S&O={%22iconly%22:0}",
        "dimension [studs]":"4 x 4 x 1"
    },
    "32556":{
        "item number":32556,
        "item description":"Technic, Pin 3L without Friction Ridges",
        "category":"frame",
        "price [Euro]":0.1,
        "mass [g]":0.25,
        "delivery time [days]":3,
        "data source":"https://www.bricklink.com/v2/catalog/catalogitem.page?P=32556&name=Technic,%20Pin%203L%20without%20Friction%20Ridges&category=%5BTechnic,%20Pin%5D#T=S&O={%22iconly%22:0}",
        "dimension [studs]":1
    },
    "3673":{
        "item number":3673,
        "item description":"Technic, Pin without Friction Ridges",
        "category":"frame",
        "price [Euro]":0.01,
        "mass [g]":0.16,
        "delivery time [days]":3,
        "data source":"https://www.bricklink.com/v2/catalog/catalogitem.page?P=3673&name=Technic,%20Pin%20without%20Friction%20Ridges&category=%5BTechnic,%20Pin%5D#T=S&O={%22iconly%22:0}",
        "dimension [studs]":1
    },
    "32054":{
        "item number":32054,
        "item description":"Technic, Pin 4L with Friction Ridges and Stop Bush",
        "category":"frame",
        "price [Euro]":0.01,
        "mass [g]":0.33,
        "delivery time [days]":3,
        "data source":"https://www.bricklink.com/v2/catalog/catalogitem.page?P=32054&name=Technic,%20Pin%203L%20with%20Friction%20Ridges%20and%20Stop%20Bush&category=%5BTechnic,%20Pin%5D#T=S&O={%22iconly%22:0}",
        "dimension [studs]":1
    }
}