{
    "JSON": {
        "ID": "1ee99c82-3127-62f8-9c08-55322c3d5eaa",
        "label": "",
        "comment": "UUID6 is used"
    },
    "probe": {
            "type": "JBL_Box",
            "name": "JBL Charge 3",
            "manufacturer": "JBL"
     }
}
