{
	"JSON": {
		"ID": "1ee21744-0355-6023-94b4-d5c041dd32cd",
		"label": "",
		"comment": "UUID6 is used"
	},
	"actor": {
		"type": "immersion heater",
		"manufacturer": "Zhuodingsen",
		"power_supply": {
			"voltage": 12,
			"type": "DC voltage",
			"source": {
				"type": "adjustable laboratory power supply",
				"model": "DPPS-32-20",
				"manufacturer": "VOLTCRAFT",
				"power": "640 Watt",
				"technology": "clocked power supply",
				"voltage": "1...32 V",
				"current": "0...20 A",
				"residual ripple": "<5 mV"
			}
		}
	}
}
