<?xml version="1.0" encoding="UTF-8" standalone="no"?>
<!-- Created with Inkscape (http://www.inkscape.org/) -->

<svg
   xmlns:dc="http://purl.org/dc/elements/1.1/"
   xmlns:cc="http://creativecommons.org/ns#"
   xmlns:rdf="http://www.w3.org/1999/02/22-rdf-syntax-ns#"
   xmlns:svg="http://www.w3.org/2000/svg"
   xmlns="http://www.w3.org/2000/svg"
   xmlns:xlink="http://www.w3.org/1999/xlink"
   xmlns:sodipodi="http://sodipodi.sourceforge.net/DTD/sodipodi-0.dtd"
   xmlns:inkscape="http://www.inkscape.org/namespaces/inkscape"
   width="170.75356mm"
   height="124.53457mm"
   viewBox="0 0 170.75356 124.53457"
   version="1.1"
   id="svg8"
   inkscape:version="0.92.4 (5da689c313, 2019-01-14)"
   sodipodi:docname="Hybrid_UAV_with_props.svg">
  <defs
     id="defs2">
    <linearGradient
       inkscape:collect="always"
       id="linearGradient1082">
      <stop
         style="stop-color:#ffffff;stop-opacity:1"
         offset="0"
         id="stop1078" />
      <stop
         style="stop-color:#ffffff;stop-opacity:0"
         offset="1"
         id="stop1080" />
    </linearGradient>
    <inkscape:perspective
       sodipodi:type="inkscape:persp3d"
       inkscape:vp_x="0 : 148.5 : 1"
       inkscape:vp_y="0 : 1000 : 0"
       inkscape:vp_z="210 : 148.5 : 1"
       inkscape:persp3d-origin="105 : 99 : 1"
       id="perspective870" />
    <linearGradient
       inkscape:collect="always"
       xlink:href="#linearGradient1082"
       id="linearGradient1084"
       x1="71.777687"
       y1="39.371349"
       x2="74.561012"
       y2="45.646568"
       gradientUnits="userSpaceOnUse"
       gradientTransform="matrix(2.0547927,0,0,3.0731549,-66.902486,-83.94226)" />
  </defs>
  <sodipodi:namedview
     id="base"
     pagecolor="#ffffff"
     bordercolor="#666666"
     borderopacity="1.0"
     inkscape:pageopacity="0.0"
     inkscape:pageshadow="2"
     inkscape:zoom="0.7"
     inkscape:cx="-333.14913"
     inkscape:cy="682.98941"
     inkscape:document-units="mm"
     inkscape:current-layer="g859"
     showgrid="false"
     inkscape:window-width="2880"
     inkscape:window-height="1706"
     inkscape:window-x="2869"
     inkscape:window-y="-11"
     inkscape:window-maximized="1" />
  <metadata
     id="metadata5">
    <rdf:RDF>
      <cc:Work
         rdf:about="">
        <dc:format>image/svg+xml</dc:format>
        <dc:type
           rdf:resource="http://purl.org/dc/dcmitype/StillImage" />
        <dc:title></dc:title>
      </cc:Work>
    </rdf:RDF>
  </metadata>
  <g
     inkscape:label="Ebene 1"
     inkscape:groupmode="layer"
     id="layer1"
     transform="translate(-20.26895,-79.0435)">
    <g
       id="g859">
      <g
         id="g1168">
        <rect
           y="92.871307"
           x="66.82254"
           height="98.533333"
           width="2.4515092"
           id="rect886"
           style="opacity:1;fill:#000000;fill-opacity:1;stroke:#000000;stroke-width:1.46667075;stroke-linecap:round;stroke-linejoin:round;stroke-miterlimit:4;stroke-dasharray:none;stroke-opacity:1" />
        <rect
           y="92.867172"
           x="142.01999"
           height="98.534874"
           width="2.446316"
           id="rect886-8"
           style="opacity:1;fill:#000000;fill-opacity:1;stroke:#000000;stroke-width:1.46512794;stroke-linecap:round;stroke-linejoin:round;stroke-miterlimit:4;stroke-dasharray:none;stroke-opacity:1" />
        <g
           transform="translate(0.60880481,-11.251507)"
           id="g922">
          <path
             style="fill:#000000;fill-opacity:1;stroke:#000000;stroke-width:0.26458332px;stroke-linecap:butt;stroke-linejoin:miter;stroke-opacity:1"
             d="m 66.216025,202.65386 c 0,0 3.462111,5.40421 8.552626,8.41898 6.882188,4.07586 30.268269,3.60814 30.268269,3.60814 v -9.55488 c 0,0 -13.764378,0.0668 -19.443856,-2.20498 -5.712921,-2.28516 -19.510675,-21.71565 -19.510675,-21.71565 z"
             id="path903"
             inkscape:connector-curvature="0"
             sodipodi:nodetypes="csccscc" />
          <path
             style="fill:#000000;fill-opacity:1;stroke:#000000;stroke-width:0.26458332px;stroke-linecap:butt;stroke-linejoin:miter;stroke-opacity:1"
             d="m 143.85781,202.65386 c 0,0 -3.4621,5.40421 -8.55262,8.41898 -6.88219,4.07586 -30.26827,3.60814 -30.26827,3.60814 v -9.55488 c 0,0 13.76438,0.0668 19.44386,-2.20498 5.71292,-2.28516 19.51067,-21.71565 19.51067,-21.71565 z"
             id="path903-4"
             inkscape:connector-curvature="0"
             sodipodi:nodetypes="csccscc" />
        </g>
        <g
           id="g1005">
          <g
             id="g868"
             transform="translate(-7.2162772,18.824811)">
            <g
               id="g853"
               transform="translate(14.300007,-52.507118)">
              <path
                 sodipodi:nodetypes="cccscsssccc"
                 inkscape:connector-curvature="0"
                 id="path815"
                 d="m 13.266739,164.24329 c 0.826137,-2.09952 2.453356,-4.56972 3.967942,-5.29999 1.514586,-0.73027 1.401953,-0.99858 4.844193,-1.72885 3.442239,-0.73027 5.521095,-1.11101 7.159859,-1.27797 2.479846,-0.25265 7.159859,-0.63898 9.362894,-0.73027 2.203034,-0.0913 8.017974,-0.3596 12.392064,-0.45642 4.128388,-0.0914 16.519153,-0.35842 19.138856,-0.36513 4.984768,-0.0128 12.833203,-0.18257 16.385062,-0.18257 h 11.565927 l 0.478455,9.90752 z"
                 style="fill:#000000;fill-opacity:1;stroke:#000000;stroke-width:0.11098392px;stroke-linecap:butt;stroke-linejoin:miter;stroke-opacity:1" />
              <path
                 sodipodi:nodetypes="cccscsssccc"
                 inkscape:connector-curvature="0"
                 id="path815-9"
                 d="m 183.85725,164.24329 c -0.82614,-2.09952 -2.45336,-4.56972 -3.96794,-5.29999 -1.51459,-0.73027 -1.40195,-0.99858 -4.84419,-1.72885 -3.44224,-0.73027 -5.5211,-1.11101 -7.15986,-1.27797 -2.47985,-0.25265 -7.15986,-0.63898 -9.36289,-0.73027 -2.20304,-0.0913 -8.01799,-0.3596 -12.39208,-0.45642 -4.12839,-0.0914 -16.51915,-0.35842 -19.13885,-0.36513 -4.98477,-0.0128 -12.83321,-0.18257 -16.38507,-0.18257 H 99.040451 l -0.47846,9.90752 z"
                 style="fill:#000000;fill-opacity:1;stroke:#000000;stroke-width:0.11098392px;stroke-linecap:butt;stroke-linejoin:miter;stroke-opacity:1" />
            </g>
            <path
               id="path833"
               transform="scale(0.26458333)"
               d="m 426.56641,273.23242 c 0,0 -8.21168,6.78199 -16.79688,23.21485 -7.38463,14.13488 -12.21105,30.76655 -13.26172,51.42968 -1.32536,26.06538 2.09299,51.54276 4.64258,72.14258 2.65217,21.42856 4.63958,29.28543 8.17578,52.14258 1.19187,7.70388 2.19728,15.79256 3.10547,24.0625 h 28.26758 c 0.9079,-8.26992 1.91361,-16.35864 3.10547,-24.0625 3.53624,-22.85715 5.52556,-30.71402 8.17773,-52.14258 2.5496,-20.59982 5.96599,-46.0772 4.64063,-72.14258 -1.05067,-20.66313 -5.87514,-37.2948 -13.25977,-51.42968 -8.58516,-16.43286 -16.79687,-23.21485 -16.79687,-23.21485 z"
               style="fill:#000000;fill-opacity:1;stroke:#000000;stroke-width:0.78666228px;stroke-linecap:butt;stroke-linejoin:miter;stroke-opacity:1"
               inkscape:connector-curvature="0" />
          </g>
          <rect
             style="opacity:1;fill:#000000;fill-opacity:1;stroke:#000000;stroke-width:0.5;stroke-linecap:round;stroke-linejoin:miter;stroke-miterlimit:4;stroke-dasharray:none;stroke-opacity:1"
             id="rect986"
             width="2.8348215"
             height="3.8742559"
             x="104.22832"
             y="148.97508" />
        </g>
        <g
           transform="translate(12.410418,4.6807432)"
           id="g997">
          <path
             style="fill:#000000;fill-opacity:1;stroke:#000000;stroke-width:0.10251216px;stroke-linecap:butt;stroke-linejoin:miter;stroke-opacity:1"
             d="m 93.594444,146.22659 5.5483,-0.008 13.573976,-0.14231 c 0,0 -10.65016,2.83304 -11.76248,3.06942 -1.479146,0.31434 -4.485606,0.66902 -5.300986,0.074 -0.85284,-0.62246 -1.18103,-1.05214 -1.57909,-1.8861 -0.32196,-0.67453 -0.47972,-1.10647 -0.47972,-1.10647 z"
             id="path930-0"
             inkscape:connector-curvature="0"
             sodipodi:nodetypes="cccssscc" />
          <path
             style="fill:#000000;fill-opacity:1;stroke:#000000;stroke-width:0.10251216px;stroke-linecap:butt;stroke-linejoin:miter;stroke-opacity:1"
             d="m 92.87616,146.22659 -5.548288,-0.008 -13.57398,-0.14231 c 0,0 10.65016,2.83304 11.76248,3.06942 1.47915,0.31434 4.485611,0.66902 5.300978,0.074 0.85284,-0.62246 1.18103,-1.05214 1.57909,-1.8861 0.32196,-0.67453 0.47972,-1.10647 0.47972,-1.10647 z"
             id="path930-0-8"
             inkscape:connector-curvature="0"
             sodipodi:nodetypes="cccssscc" />
          <rect
             style="opacity:1;fill:#000000;fill-opacity:1;stroke:#000000;stroke-width:0.5;stroke-linecap:round;stroke-linejoin:miter;stroke-miterlimit:4;stroke-dasharray:none;stroke-opacity:1"
             id="rect992"
             width="0.71828681"
             height="2.0546346"
             x="92.87616"
             y="144.17195" />
        </g>
        <path
           inkscape:connector-curvature="0"
           id="path1025"
           d="m 68.048284,79.28299 a 12.264645,12.264645 0 0 0 -12.264369,12.264366 12.264645,12.264645 0 0 0 11.03912,12.190994 v 33.18918 a 12.264645,12.264645 0 0 0 -11.03912,12.20287 12.264645,12.264645 0 0 0 11.03912,12.19099 v 30.08344 h 2.451013 V 161.33431 A 12.264645,12.264645 0 0 0 80.313166,149.1304 12.264645,12.264645 0 0 0 69.274048,136.94045 V 103.75126 A 12.264645,12.264645 0 0 0 80.313166,91.547356 12.264645,12.264645 0 0 0 68.048284,79.28299 Z m 0,2.290816 a 9.9735803,9.9735803 0 0 1 9.97355,9.97355 9.9735803,9.9735803 0 0 1 -8.747786,9.885184 v -2.742982 a 7.2536406,7.2536406 0 0 0 6.028055,-7.142202 7.2536406,7.2536406 0 0 0 -7.253819,-7.253819 7.2536406,7.2536406 0 0 0 -7.253306,7.253819 7.2536406,7.2536406 0 0 0 6.028057,7.149436 v 2.739888 a 9.9735803,9.9735803 0 0 1 -8.748305,-9.889324 9.9735803,9.9735803 0 0 1 9.973554,-9.97355 z m 0,6.346899 a 3.6267564,3.6267567 0 0 1 3.627167,3.626651 3.6267564,3.6267567 0 0 1 -2.401403,3.409611 v -2.08566 h -2.451013 v 2.084629 a 3.6267564,3.6267567 0 0 1 -2.401406,-3.40858 3.6267564,3.6267567 0 0 1 3.626655,-3.626651 z m 1.225764,51.320895 a 9.9735803,9.9735803 0 0 1 8.747786,9.8888 9.9735803,9.9735803 0 0 1 -8.747786,9.88519 v -2.7435 a 7.2536406,7.2536406 0 0 0 6.028055,-7.14169 7.2536406,7.2536406 0 0 0 -6.028055,-7.14943 z m -2.451013,0.003 v 2.74402 a 7.2536406,7.2536406 0 0 0 -6.028057,7.14168 7.2536406,7.2536406 0 0 0 6.028057,7.14944 v 2.73988 a 9.9735803,9.9735803 0 0 1 -8.748305,-9.88932 9.9735803,9.9735803 0 0 1 8.748305,-9.8857 z m 0,6.47609 v 6.81819 a 3.6267564,3.6267567 0 0 1 -2.401406,-3.40858 3.6267564,3.6267567 0 0 1 2.401406,-3.40961 z m 2.451013,0.001 a 3.6267564,3.6267567 0 0 1 2.401403,3.40857 3.6267564,3.6267567 0 0 1 -2.401403,3.40962 z"
           style="opacity:1;fill:#000000;fill-opacity:1;stroke:#000000;stroke-width:0.47070876;stroke-linecap:round;stroke-linejoin:miter;stroke-miterlimit:4;stroke-dasharray:none;stroke-opacity:1" />
        <path
           inkscape:connector-curvature="0"
           id="path1025-7"
           d="m 143.24055,79.278854 a 12.264645,12.264645 0 0 0 -12.26437,12.264366 12.264645,12.264645 0 0 0 11.03912,12.191 v 33.18918 a 12.264645,12.264645 0 0 0 -11.03912,12.20287 12.264645,12.264645 0 0 0 11.03912,12.19099 v 30.08344 h 2.45101 v -30.07052 a 12.264645,12.264645 0 0 0 11.03912,-12.20391 12.264645,12.264645 0 0 0 -11.03912,-12.18995 V 103.74713 A 12.264645,12.264645 0 0 0 155.50543,91.54322 12.264645,12.264645 0 0 0 143.24055,79.278854 Z m 0,2.290816 a 9.9735804,9.9735804 0 0 1 9.97355,9.97355 9.9735804,9.9735804 0 0 1 -8.74779,9.88519 v -2.742987 a 7.2536407,7.2536407 0 0 0 6.02805,-7.142203 7.2536407,7.2536407 0 0 0 -7.25381,-7.253819 7.2536407,7.2536407 0 0 0 -7.25331,7.253819 7.2536407,7.2536407 0 0 0 6.02806,7.149437 v 2.739893 a 9.9735804,9.9735804 0 0 1 -8.74831,-9.88933 9.9735804,9.9735804 0 0 1 9.97356,-9.97355 z m 0,6.346899 a 3.6267565,3.6267567 0 0 1 3.62716,3.626651 3.6267565,3.6267567 0 0 1 -2.4014,3.409612 v -2.08566 H 142.0153 V 94.9518 a 3.6267565,3.6267567 0 0 1 -2.40141,-3.40858 3.6267565,3.6267567 0 0 1 3.62666,-3.626651 z m 1.22576,51.320901 a 9.9735804,9.9735804 0 0 1 8.74779,9.8888 9.9735804,9.9735804 0 0 1 -8.74779,9.88519 v -2.7435 a 7.2536407,7.2536407 0 0 0 6.02805,-7.14169 7.2536407,7.2536407 0 0 0 -6.02805,-7.14944 z m -2.45101,0.003 v 2.74402 a 7.2536407,7.2536407 0 0 0 -6.02806,7.14167 7.2536407,7.2536407 0 0 0 6.02806,7.14945 v 2.73987 a 9.9735804,9.9735804 0 0 1 -8.74831,-9.88931 9.9735804,9.9735804 0 0 1 8.74831,-9.88569 z m 0,6.47609 v 6.81819 a 3.6267565,3.6267567 0 0 1 -2.40141,-3.4086 3.6267565,3.6267567 0 0 1 2.40141,-3.4096 z m 2.45101,0.001 a 3.6267565,3.6267567 0 0 1 2.4014,3.40856 3.6267565,3.6267567 0 0 1 -2.4014,3.40963 z"
           style="opacity:1;fill:#000000;fill-opacity:1;stroke:#000000;stroke-width:0.47070879;stroke-linecap:round;stroke-linejoin:miter;stroke-miterlimit:4;stroke-dasharray:none;stroke-opacity:1" />
      </g>
    </g>
  </g>
</svg>
