<?xml version="1.0" encoding="UTF-8" standalone="no"?>
<!-- Created with Inkscape (http://www.inkscape.org/) -->

<svg
   xmlns:dc="http://purl.org/dc/elements/1.1/"
   xmlns:cc="http://creativecommons.org/ns#"
   xmlns:rdf="http://www.w3.org/1999/02/22-rdf-syntax-ns#"
   xmlns:svg="http://www.w3.org/2000/svg"
   xmlns="http://www.w3.org/2000/svg"
   xmlns:sodipodi="http://sodipodi.sourceforge.net/DTD/sodipodi-0.dtd"
   xmlns:inkscape="http://www.inkscape.org/namespaces/inkscape"
   width="170.75356mm"
   height="112.59548mm"
   viewBox="0 0 170.75356 112.59548"
   version="1.1"
   id="svg8"
   inkscape:version="0.92.4 (5da689c313, 2019-01-14)"
   sodipodi:docname="Hybrid_UAV_without_props.svg">
  <defs
     id="defs2">
    <inkscape:perspective
       sodipodi:type="inkscape:persp3d"
       inkscape:vp_x="0 : 148.49999 : 1"
       inkscape:vp_y="0 : 999.99993 : 0"
       inkscape:vp_z="210 : 148.49999 : 1"
       inkscape:persp3d-origin="105 : 98.999993 : 1"
       id="perspective870" />
  </defs>
  <sodipodi:namedview
     id="base"
     pagecolor="#ffffff"
     bordercolor="#666666"
     borderopacity="1.0"
     inkscape:pageopacity="0.0"
     inkscape:pageshadow="2"
     inkscape:zoom="0.98994949"
     inkscape:cx="173.17068"
     inkscape:cy="496.54104"
     inkscape:document-units="mm"
     inkscape:current-layer="g859"
     showgrid="false"
     inkscape:window-width="2880"
     inkscape:window-height="1706"
     inkscape:window-x="2869"
     inkscape:window-y="-11"
     inkscape:window-maximized="1" />
  <metadata
     id="metadata5">
    <rdf:RDF>
      <cc:Work
         rdf:about="">
        <dc:format>image/svg+xml</dc:format>
        <dc:type
           rdf:resource="http://purl.org/dc/dcmitype/StillImage" />
        <dc:title />
      </cc:Work>
    </rdf:RDF>
  </metadata>
  <g
     inkscape:label="Ebene 1"
     inkscape:groupmode="layer"
     id="layer1"
     transform="translate(-20.26895,-90.982582)">
    <g
       id="g859">
      <g
         id="g1023">
        <rect
           y="92.871307"
           x="66.82254"
           height="98.533333"
           width="2.4515092"
           id="rect886"
           style="opacity:1;fill:#000000;fill-opacity:1;stroke:#000000;stroke-width:1.46667075;stroke-linecap:round;stroke-linejoin:round;stroke-miterlimit:4;stroke-dasharray:none;stroke-opacity:1" />
        <rect
           y="92.867172"
           x="142.01999"
           height="98.534874"
           width="2.446316"
           id="rect886-8"
           style="opacity:1;fill:#000000;fill-opacity:1;stroke:#000000;stroke-width:1.46512794;stroke-linecap:round;stroke-linejoin:round;stroke-miterlimit:4;stroke-dasharray:none;stroke-opacity:1" />
        <g
           transform="translate(0.60880481,-11.251507)"
           id="g922">
          <path
             style="fill:#000000;fill-opacity:1;stroke:#000000;stroke-width:0.26458332px;stroke-linecap:butt;stroke-linejoin:miter;stroke-opacity:1"
             d="m 66.216025,202.65386 c 0,0 3.462111,5.40421 8.552626,8.41898 6.882188,4.07586 30.268269,3.60814 30.268269,3.60814 v -9.55488 c 0,0 -13.764378,0.0668 -19.443856,-2.20498 -5.712921,-2.28516 -19.510675,-21.71565 -19.510675,-21.71565 z"
             id="path903"
             inkscape:connector-curvature="0"
             sodipodi:nodetypes="csccscc" />
          <path
             style="fill:#000000;fill-opacity:1;stroke:#000000;stroke-width:0.26458332px;stroke-linecap:butt;stroke-linejoin:miter;stroke-opacity:1"
             d="m 143.85781,202.65386 c 0,0 -3.4621,5.40421 -8.55262,8.41898 -6.88219,4.07586 -30.26827,3.60814 -30.26827,3.60814 v -9.55488 c 0,0 13.76438,0.0668 19.44386,-2.20498 5.71292,-2.28516 19.51067,-21.71565 19.51067,-21.71565 z"
             id="path903-4"
             inkscape:connector-curvature="0"
             sodipodi:nodetypes="csccscc" />
        </g>
        <g
           id="g1005">
          <g
             id="g868"
             transform="translate(-7.2162772,18.824811)">
            <g
               id="g853"
               transform="translate(14.300007,-52.507118)">
              <path
                 sodipodi:nodetypes="cccscsssccc"
                 inkscape:connector-curvature="0"
                 id="path815"
                 d="m 13.266739,164.24329 c 0.826137,-2.09952 2.453356,-4.56972 3.967942,-5.29999 1.514586,-0.73027 1.401953,-0.99858 4.844193,-1.72885 3.442239,-0.73027 5.521095,-1.11101 7.159859,-1.27797 2.479846,-0.25265 7.159859,-0.63898 9.362894,-0.73027 2.203034,-0.0913 8.017974,-0.3596 12.392064,-0.45642 4.128388,-0.0914 16.519153,-0.35842 19.138856,-0.36513 4.984768,-0.0128 12.833203,-0.18257 16.385062,-0.18257 h 11.565927 l 0.478455,9.90752 z"
                 style="fill:#000000;fill-opacity:1;stroke:#000000;stroke-width:0.11098392px;stroke-linecap:butt;stroke-linejoin:miter;stroke-opacity:1" />
              <path
                 sodipodi:nodetypes="cccscsssccc"
                 inkscape:connector-curvature="0"
                 id="path815-9"
                 d="m 183.85725,164.24329 c -0.82614,-2.09952 -2.45336,-4.56972 -3.96794,-5.29999 -1.51459,-0.73027 -1.40195,-0.99858 -4.84419,-1.72885 -3.44224,-0.73027 -5.5211,-1.11101 -7.15986,-1.27797 -2.47985,-0.25265 -7.15986,-0.63898 -9.36289,-0.73027 -2.20304,-0.0913 -8.01799,-0.3596 -12.39208,-0.45642 -4.12839,-0.0914 -16.51915,-0.35842 -19.13885,-0.36513 -4.98477,-0.0128 -12.83321,-0.18257 -16.38507,-0.18257 H 99.040451 l -0.47846,9.90752 z"
                 style="fill:#000000;fill-opacity:1;stroke:#000000;stroke-width:0.11098392px;stroke-linecap:butt;stroke-linejoin:miter;stroke-opacity:1" />
            </g>
            <path
               id="path833"
               transform="scale(0.26458333)"
               d="m 426.56641,273.23242 c 0,0 -8.21168,6.78199 -16.79688,23.21485 -7.38463,14.13488 -12.21105,30.76655 -13.26172,51.42968 -1.32536,26.06538 2.09299,51.54276 4.64258,72.14258 2.65217,21.42856 4.63958,29.28543 8.17578,52.14258 1.19187,7.70388 2.19728,15.79256 3.10547,24.0625 h 28.26758 c 0.9079,-8.26992 1.91361,-16.35864 3.10547,-24.0625 3.53624,-22.85715 5.52556,-30.71402 8.17773,-52.14258 2.5496,-20.59982 5.96599,-46.0772 4.64063,-72.14258 -1.05067,-20.66313 -5.87514,-37.2948 -13.25977,-51.42968 -8.58516,-16.43286 -16.79687,-23.21485 -16.79687,-23.21485 z"
               style="fill:#000000;fill-opacity:1;stroke:#000000;stroke-width:0.78666228px;stroke-linecap:butt;stroke-linejoin:miter;stroke-opacity:1"
               inkscape:connector-curvature="0" />
          </g>
          <rect
             style="opacity:1;fill:#000000;fill-opacity:1;stroke:#000000;stroke-width:0.5;stroke-linecap:round;stroke-linejoin:miter;stroke-miterlimit:4;stroke-dasharray:none;stroke-opacity:1"
             id="rect986"
             width="2.8348215"
             height="3.8742559"
             x="104.22832"
             y="148.97508" />
        </g>
        <g
           transform="translate(12.410418,4.6807432)"
           id="g997">
          <path
             style="fill:#000000;fill-opacity:1;stroke:#000000;stroke-width:0.10251216px;stroke-linecap:butt;stroke-linejoin:miter;stroke-opacity:1"
             d="m 93.594444,146.22659 5.5483,-0.008 13.573976,-0.14231 c 0,0 -10.65016,2.83304 -11.76248,3.06942 -1.479146,0.31434 -4.485606,0.66902 -5.300986,0.074 -0.85284,-0.62246 -1.18103,-1.05214 -1.57909,-1.8861 -0.32196,-0.67453 -0.47972,-1.10647 -0.47972,-1.10647 z"
             id="path930-0"
             inkscape:connector-curvature="0"
             sodipodi:nodetypes="cccssscc" />
          <path
             style="fill:#000000;fill-opacity:1;stroke:#000000;stroke-width:0.10251216px;stroke-linecap:butt;stroke-linejoin:miter;stroke-opacity:1"
             d="m 92.87616,146.22659 -5.548288,-0.008 -13.57398,-0.14231 c 0,0 10.65016,2.83304 11.76248,3.06942 1.47915,0.31434 4.485611,0.66902 5.300978,0.074 0.85284,-0.62246 1.18103,-1.05214 1.57909,-1.8861 0.32196,-0.67453 0.47972,-1.10647 0.47972,-1.10647 z"
             id="path930-0-8"
             inkscape:connector-curvature="0"
             sodipodi:nodetypes="cccssscc" />
          <rect
             style="opacity:1;fill:#000000;fill-opacity:1;stroke:#000000;stroke-width:0.5;stroke-linecap:round;stroke-linejoin:miter;stroke-miterlimit:4;stroke-dasharray:none;stroke-opacity:1"
             id="rect992"
             width="0.71828681"
             height="2.0546346"
             x="92.87616"
             y="144.17195" />
        </g>
      </g>
    </g>
  </g>
</svg>
