   0.00000
 231.98948
 436.26234
 616.43095
 775.54678
 916.20711
1040.63714
1150.75404
1248.21755
1334.47053
1410.77187
1478.22340
1537.79220
1590.32917
1636.58474
1677.22203
1712.82819
1743.92397
1770.97205
1794.38413
1814.52713
1831.72851
1846.28092
1858.44628
1868.45926
1876.53042
1882.84890
1887.58476
1890.89116
1892.90609
1893.75409
1893.54762
1892.38835
1890.36826
1887.57070
1884.07118
1879.93823
1875.23406
1870.01520
1864.33306
1858.23441
1851.76182
1844.95410
1837.84660
1830.47159
1822.85849
1815.03416
1807.02314
1798.84785
1790.52876
1782.08461
1773.53251
1764.88812
1756.16576
1747.37852
1738.53838
1729.65631
1720.74231
1711.80556
1702.85442
1693.89657
1684.93898
1675.98806
1667.04962
1658.12898
1649.23099
1640.36007
1631.52021
1622.71508
1613.94797
1605.22189
1596.53954
1587.90337
1579.31559
1570.77818
1562.29290
1553.86135
1545.48492
1537.16486
1528.90227
1520.69811
1512.55320
1504.46826
1496.44390
1488.48062
1480.57883
1472.73888
1464.96101
1457.24540
1449.59217
1442.00138
1434.47303
1427.00705
1419.60337
1412.26183
1404.98226
1397.76443
1390.60811
1383.51301
1376.47882
1369.50522
