   0.81376
   0.79254
   0.77177
   0.75151
   0.73179
   0.71264
   0.69408
   0.67613
   0.65877
   0.64203
   0.62587
   0.61031
   0.59532
   0.58089
   0.56701
   0.55365
   0.54079
   0.52843
   0.51653
   0.50508
   0.49407
   0.48346
   0.47325
   0.46341
   0.45394
   0.44481
   0.43600
   0.42751
   0.41932
   0.41141
   0.40378
   0.39640
   0.38927
   0.38238
   0.37572
   0.36927
   0.36303
   0.35698
   0.35113
   0.34545
   0.33995
   0.33461
   0.32944
   0.32441
   0.31953
   0.31479
   0.31019
   0.30571
   0.30136
   0.29713
   0.29301
   0.28900
   0.28509
   0.28129
   0.27759
   0.27398
   0.27046
   0.26703
   0.26368
   0.26042
   0.25723
   0.25412
   0.25108
   0.24811
   0.24522
   0.24238
   0.23961
   0.23691
   0.23426
   0.23167
   0.22914
   0.22666
   0.22423
   0.22185
   0.21953
   0.21725
   0.21502
   0.21283
   0.21069
   0.20859
   0.20653
   0.20451
   0.20253
   0.20058
   0.19868
   0.19680
   0.19497
   0.19317
   0.19140
   0.18966
   0.18795
