  67.37000
  69.03174
  70.81014
  72.70684
  74.72148
  76.85223
  79.09619
  81.44981
  83.90909
  86.47260
  89.14139
  91.90399
  94.76578
  97.71702
 100.76123
 103.88799
 107.10468
 110.40087
 113.77461
 117.22888
 120.75812
 124.35945
 128.03132
 131.77222
 135.58077
 139.45673
 143.39665
 147.39915
 151.46288
 155.58653
 159.76883
 164.00856
 168.30456
 172.65601
 177.06269
 181.52258
 186.03465
 190.59794
 195.21154
 199.87458
 204.58675
 209.34877
 214.15785
 219.01328
 223.91435
 228.86252
 233.85584
 238.89287
 243.97310
 249.09898
 254.26683
 259.47616
 264.72899
 270.02303
 275.35706
 280.73333
 286.14935
 291.60417
 297.10052
 302.63471
 308.20789
 313.82007
 319.46900
 325.15759
 330.88236
 336.64486
 342.44417
 348.27957
 354.15216
 360.05950
 366.00420
 371.98283
 377.99821
 384.04727
 390.13223
 396.25068
 402.40435
 408.59119
 414.81276
 421.06704
 427.35570
 433.67652
 440.03150
 446.41799
 452.83854
 459.29025
 465.77528
 472.29154
 478.84021
 485.42034
 492.03191
