  67.37000
  69.03179
  70.81026
  72.70701
  74.72172
  76.85252
  79.09656
  81.45024
  83.90960
  86.47318
  89.14204
  91.90472
  94.76658
  97.71790
 100.76218
 103.88903
 107.10579
 110.40207
 113.77589
 117.23024
 120.75956
 124.36097
 128.03293
 131.77391
 135.58255
 139.45859
 143.39860
 147.40119
 151.46500
 155.58874
 159.77113
 164.01095
 168.30704
 172.65858
 177.06536
 181.52534
 186.03750
 190.60089
 195.21458
 199.87772
 204.58998
 209.35210
 214.16128
 219.01680
 223.91798
 228.86624
 233.85966
 238.89679
 243.97712
 249.10310
 254.27106
 259.48049
 264.73343
 270.02757
 275.36170
 280.73808
 286.15420
 291.60913
 297.10560
 302.63989
 308.21318
 313.82547
 319.47451
 325.16321
 330.88810
 336.65070
 342.45013
 348.28564
 354.15835
 360.06581
 366.01062
 371.98936
 378.00487
 384.05405
 390.13912
 396.25769
 402.41148
 408.59844
 414.82013
 421.07453
 427.36331
 433.68426
 440.03936
 446.42598
 452.84665
 459.29849
 465.78364
 472.30004
 478.84883
 485.42909
 492.04079
