   0.00000
 209.32139
 394.61662
 558.94511
 704.88892
 834.64580
 950.10027
1052.87887
1144.39334
1225.87502
1298.40244
1362.92379
1420.27530
1471.19658
1516.34335
1556.29825
1591.58002
1622.65131
1649.92544
1673.77221
1694.52295
1712.47491
1727.89511
1741.02369
1752.07688
1761.24957
1768.71762
1774.63987
1779.15994
1782.40779
1784.50116
1785.54677
1785.64148
1784.87326
1783.32204
1781.06054
1778.15497
1774.66561
1770.64743
1766.15058
1761.22081
1755.89991
1750.22608
1744.23424
1737.95633
1731.42158
1724.65675
1717.68636
1710.53289
1703.21690
1695.75730
1688.17138
1680.47504
1672.68286
1664.80819
1656.86333
1648.85952
1640.80712
1632.71560
1624.59367
1616.44933
1608.28990
1600.12211
1591.95210
1583.78554
1575.62759
1567.48298
1559.35604
1551.25075
1543.17070
1535.11919
1527.09924
1519.11358
1511.16470
1503.25484
1495.38606
1487.56020
1479.77892
1472.04371
1464.35592
1456.71674
1449.12724
1441.58835
1434.10089
1426.66560
1419.28308
1411.95389
1404.67845
1397.45715
1390.29030
1383.17812
1376.12079
1369.11843
1362.17112
1355.27887
1348.44166
1341.65943
1334.93208
1328.25947
1321.64144
1315.07779
