   0.00000
 214.59556
 404.40418
 572.59300
 721.83462
 854.40416
 972.25272
1077.06402
1170.29888
1253.23064
1326.97544
1392.51272
1450.70551
1502.31792
1548.02515
1588.42806
1624.06050
1655.39795
1682.86555
1706.84290
1727.66960
1745.65046
1761.05898
1774.14090
1785.11727
1794.18714
1801.53006
1807.30806
1811.66755
1814.74093
1816.64805
1817.49750
1817.38773
1816.40813
1814.63988
1812.15679
1809.02601
1805.30864
1801.06038
1796.33198
1791.16976
1785.61601
1779.70937
1773.48509
1766.97543
1760.20989
1753.21552
1746.01703
1738.63703
1731.09629
1723.41384
1715.60707
1707.69197
1699.68322
1691.59423
1683.43732
1675.22382
1666.96409
1658.66764
1650.34320
1641.99876
1633.64167
1625.27863
1616.91581
1608.55885
1600.21289
1591.88268
1583.57250
1575.28631
1567.02770
1558.79994
1550.60602
1542.44864
1534.33027
1526.25312
1518.21923
1510.23039
1502.28825
1494.39428
1486.54977
1478.75590
1471.01370
1463.32408
1455.68783
1448.10565
1440.57812
1433.10576
1425.68898
1418.32812
1411.02346
1403.77522
