   0.98463
   0.95787
   0.93177
   0.90639
   0.88176
   0.85792
   0.83488
   0.81265
   0.79122
   0.77059
   0.75073
   0.73164
   0.71329
   0.69566
   0.67872
   0.66245
   0.64681
   0.63180
   0.61737
   0.60350
   0.59017
   0.57735
   0.56501
   0.55315
   0.54173
   0.53073
   0.52013
   0.50991
   0.50007
   0.49057
   0.48140
   0.47254
   0.46399
   0.45573
   0.44774
   0.44002
   0.43254
   0.42530
   0.41830
   0.41151
   0.40493
   0.39854
   0.39236
   0.38635
   0.38052
   0.37486
   0.36936
   0.36401
   0.35881
   0.35376
   0.34884
   0.34406
   0.33940
   0.33486
   0.33045
   0.32614
   0.32194
   0.31785
   0.31386
   0.30997
   0.30617
   0.30246
   0.29884
   0.29530
   0.29185
   0.28847
   0.28517
   0.28195
   0.27879
   0.27571
   0.27269
   0.26974
   0.26685
   0.26402
   0.26124
   0.25853
   0.25587
   0.25327
   0.25071
   0.24821
   0.24576
   0.24335
   0.24100
   0.23868
   0.23641
   0.23418
   0.23200
   0.22985
   0.22775
   0.22568
   0.22365
   0.22165
   0.21969
   0.21776
   0.21587
   0.21401
   0.21218
   0.21039
   0.20862
   0.20688
   0.20517
