   0.98280
   0.95716
   0.93208
   0.90762
   0.88381
   0.86069
   0.83828
   0.81660
   0.79564
   0.77542
   0.75592
   0.73713
   0.71903
   0.70161
   0.68484
   0.66871
   0.65319
   0.63826
   0.62389
   0.61007
   0.59677
   0.58396
   0.57163
   0.55975
   0.54831
   0.53729
   0.52666
   0.51640
   0.50651
   0.49696
   0.48774
   0.47883
   0.47023
   0.46190
   0.45386
   0.44607
   0.43853
   0.43123
   0.42416
   0.41731
   0.41066
   0.40422
   0.39797
   0.39190
   0.38601
   0.38028
   0.37472
   0.36932
   0.36406
   0.35895
   0.35397
   0.34913
   0.34442
   0.33983
   0.33535
   0.33099
   0.32674
   0.32260
   0.31856
   0.31462
   0.31077
   0.30701
   0.30334
   0.29976
   0.29626
   0.29284
   0.28949
   0.28622
   0.28302
   0.27990
   0.27684
   0.27384
   0.27091
   0.26804
   0.26523
   0.26248
   0.25978
   0.25714
   0.25455
   0.25202
   0.24953
   0.24709
   0.24470
   0.24235
   0.24005
   0.23779
   0.23557
   0.23339
   0.23125
   0.22916
   0.22709
   0.22507
   0.22308
   0.22113
   0.21921
   0.21732
   0.21546
   0.21364
   0.21184
   0.21008
   0.20835
