   0.00000
 217.32100
 409.40807
 579.49367
 730.30708
 864.17184
 983.08027
1088.75140
1182.67649
1266.15521
1340.32489
1406.18422
1464.61290
1516.38784
1562.19685
1602.65015
1638.29017
1669.59990
1697.01017
1720.90581
1741.63108
1759.49435
1774.77220
1787.71302
1798.54011
1807.45449
1814.63727
1820.25183
1824.44570
1827.35222
1829.09203
1829.77437
1829.49825
1828.35351
1826.42169
1823.77689
1820.48649
1816.61183
1812.20873
1807.32808
1802.01629
1796.31569
1790.26494
1783.89935
1777.25118
1770.34994
1763.22262
1755.89392
1748.38645
1740.72092
1732.91630
1724.98998
1716.95787
1708.83459
1700.63352
1692.36693
1684.04608
1675.68128
1667.28200
1658.85689
1650.41391
1641.96033
1633.50283
1625.04750
1616.59994
1608.16526
1599.74813
1591.35280
1582.98318
1574.64282
1566.33493
1558.06247
1549.82810
1541.63423
1533.48307
1525.37657
1517.31653
1509.30453
1501.34202
1493.43025
1485.57038
1477.76339
1470.01017
1462.31147
1454.66797
1447.08023
1439.54871
1432.07382
1424.65588
1417.29513
1409.99175
1402.74588
1395.55757
1388.42686
1381.35370
1374.33804
1367.37976
1360.47872
1353.63474
1346.84761
1340.11709
