   0.99703
   0.96921
   0.94192
   0.91525
   0.88924
   0.86395
   0.83941
   0.81564
   0.79267
   0.77049
   0.74910
   0.72850
   0.70867
   0.68960
   0.67126
   0.65364
   0.63671
   0.62045
   0.60483
   0.58982
   0.57541
   0.56156
   0.54825
   0.53546
   0.52316
   0.51133
   0.49995
   0.48900
   0.47845
   0.46830
   0.45851
   0.44908
   0.43999
   0.43122
   0.42275
   0.41458
   0.40668
   0.39905
   0.39168
   0.38455
   0.37765
   0.37097
   0.36451
   0.35825
   0.35218
   0.34630
   0.34060
   0.33506
   0.32970
   0.32448
   0.31942
   0.31451
   0.30973
   0.30509
   0.30057
   0.29618
   0.29191
   0.28775
   0.28370
   0.27975
   0.27591
   0.27216
   0.26851
   0.26495
   0.26148
   0.25810
   0.25479
   0.25157
   0.24842
   0.24534
   0.24234
   0.23941
   0.23654
   0.23374
   0.23100
   0.22832
   0.22569
   0.22313
   0.22062
   0.21816
   0.21576
   0.21340
   0.21110
   0.20884
   0.20663
   0.20446
   0.20233
   0.20025
   0.19821
   0.19620
   0.19424
   0.19231
   0.19042
   0.18857
   0.18675
   0.18496
   0.18321
   0.18148
   0.17979
   0.17813
   0.17650
