   0.83002
   0.80837
   0.78718
   0.76652
   0.74640
   0.72687
   0.70795
   0.68963
   0.67193
   0.65485
   0.63838
   0.62250
   0.60722
   0.59250
   0.57834
   0.56471
   0.55160
   0.53899
   0.52685
   0.51517
   0.50394
   0.49312
   0.48271
   0.47267
   0.46301
   0.45370
   0.44472
   0.43606
   0.42770
   0.41963
   0.41185
   0.40432
   0.39705
   0.39002
   0.38323
   0.37665
   0.37028
   0.36412
   0.35814
   0.35236
   0.34674
   0.34130
   0.33602
   0.33089
   0.32592
   0.32108
   0.31639
   0.31182
   0.30738
   0.30306
   0.29886
   0.29477
   0.29079
   0.28691
   0.28314
   0.27946
   0.27587
   0.27237
   0.26895
   0.26562
   0.26237
   0.25920
   0.25610
   0.25307
   0.25012
   0.24723
   0.24440
   0.24164
   0.23894
   0.23630
   0.23372
   0.23119
   0.22871
   0.22629
   0.22392
   0.22159
   0.21932
   0.21709
   0.21490
   0.21276
   0.21066
   0.20860
   0.20657
   0.20459
   0.20265
   0.20074
   0.19887
   0.19703
   0.19522
   0.19345
   0.19171
