   0.98437
   0.95888
   0.93391
   0.90955
   0.88582
   0.86278
   0.84043
   0.81880
   0.79789
   0.77770
   0.75822
   0.73944
   0.72135
   0.70393
   0.68716
   0.67102
   0.65549
   0.64055
   0.62617
   0.61233
   0.59900
   0.58618
   0.57382
   0.56193
   0.55046
   0.53941
   0.52875
   0.51847
   0.50856
   0.49898
   0.48974
   0.48080
   0.47217
   0.46382
   0.45575
   0.44794
   0.44038
   0.43305
   0.42596
   0.41908
   0.41242
   0.40595
   0.39968
   0.39358
   0.38767
   0.38193
   0.37635
   0.37092
   0.36564
   0.36051
   0.35552
   0.35066
   0.34593
   0.34132
   0.33683
   0.33245
   0.32818
   0.32402
   0.31996
   0.31600
   0.31214
   0.30837
   0.30468
   0.30109
   0.29757
   0.29414
   0.29078
   0.28749
   0.28428
   0.28114
   0.27807
   0.27506
   0.27212
   0.26924
   0.26642
   0.26365
   0.26095
   0.25829
   0.25569
   0.25315
   0.25065
   0.24820
   0.24579
   0.24344
   0.24112
   0.23885
   0.23663
   0.23444
   0.23229
   0.23019
   0.22812
   0.22608
   0.22409
   0.22212
   0.22019
   0.21830
   0.21643
   0.21460
   0.21280
   0.21103
   0.20929
