  67.37000
  69.02791
  70.80670
  72.70489
  74.72059
  76.85157
  79.09530
  81.44909
  83.91010
  86.47538
  89.14199
  91.90697
  94.76739
  97.72037
 100.76314
 103.89298
 107.10729
 110.40357
 113.77944
 117.23262
 120.76093
 124.36232
 128.03482
 131.77659
 135.58585
 139.46096
 143.40031
 147.40244
 151.46590
 155.58937
 159.77158
 164.01131
 168.30743
 172.65884
 177.06452
 181.52349
 186.03481
 190.59759
 195.21099
 199.87421
 204.58647
 209.34704
 214.15521
 219.01032
 223.91172
 228.85879
 233.85094
 238.88761
 243.96824
 249.09232
 254.25935
 259.46883
 264.72029
 270.01330
 275.34740
 280.72219
 286.13726
 291.59221
 297.08666
 302.62025
 308.19262
 313.80343
 319.45234
 325.13902
 330.86316
 336.62446
 342.42261
 348.25733
 354.12834
 360.03535
 365.97810
 371.95634
 377.96980
 384.01824
 390.10141
 396.21909
 402.37104
 408.55704
 414.77685
 421.03028
 427.31711
 433.63713
 439.99014
 446.37594
 452.79434
 459.24516
 465.72819
 472.24327
 478.79022
 485.36885
 491.97900
 498.62049
 505.29317
 511.99686
 518.73141
 525.49667
 532.29247
 539.11867
 545.97512
 552.86166
 559.77817
