   0.00000
 209.70265
 396.02735
 561.85679
 709.62805
 841.42188
 959.02964
1064.00444
1157.70099
1241.30696
1315.87031
1382.31627
1441.46538
1494.04921
1540.71789
1582.05388
1618.57763
1650.75519
1679.00566
1703.70502
1725.19112
1743.76863
1759.71197
1773.26861
1784.66191
1794.09364
1801.74627
1807.78497
1812.35929
1815.60477
1817.64436
1818.58962
1818.54190
1817.59331
1815.82766
1813.32119
1810.14336
1806.35743
1802.02111
1797.18702
1791.90322
1786.21361
1780.15832
1773.77398
1767.09411
1760.14939
1752.96794
1745.57546
1737.99547
1730.24957
1722.35755
1714.33752
1706.20609
1697.97852
1689.66877
1681.28964
1672.85291
1664.36932
1655.84878
1647.30034
1638.73228
1630.15225
1621.56718
1612.98346
1604.40694
1595.84295
1587.29638
1578.77167
1570.27291
1561.80380
1553.36771
1544.96772
1536.60661
1528.28692
1520.01092
1511.78069
1503.59807
1495.46474
1487.38219
1479.35176
1471.37462
1463.45183
1455.58428
1447.77280
1440.01805
1432.32064
1424.68106
1417.09972
1409.57695
1402.11300
1394.70808
1387.36231
1380.07576
1372.84845
1365.68035
1358.57140
1351.52146
1344.53040
1337.59802
1330.72410
1323.90841
