   0.96692
   0.94013
   0.91384
   0.88811
   0.86302
   0.83861
   0.81492
   0.79196
   0.76975
   0.74831
   0.72762
   0.70769
   0.68849
   0.67003
   0.65227
   0.63520
   0.61879
   0.60303
   0.58789
   0.57333
   0.55935
   0.54592
   0.53300
   0.52059
   0.50865
   0.49717
   0.48612
   0.47549
   0.46525
   0.45539
   0.44589
   0.43672
   0.42789
   0.41937
   0.41114
   0.40320
   0.39553
   0.38812
   0.38095
   0.37402
   0.36732
   0.36083
   0.35454
   0.34846
   0.34256
   0.33684
   0.33130
   0.32592
   0.32070
   0.31564
   0.31072
   0.30594
   0.30129
   0.29678
   0.29239
   0.28812
   0.28396
   0.27992
   0.27598
   0.27214
   0.26841
   0.26476
   0.26121
   0.25775
   0.25438
   0.25109
   0.24787
   0.24474
   0.24167
   0.23868
   0.23576
   0.23291
   0.23012
   0.22739
   0.22473
   0.22212
   0.21957
   0.21708
   0.21464
   0.21225
   0.20991
   0.20762
   0.20537
   0.20318
   0.20103
   0.19892
   0.19685
   0.19482
   0.19284
   0.19089
   0.18898
   0.18710
   0.18526
   0.18346
   0.18169
   0.17995
   0.17824
   0.17657
   0.17492
   0.17331
   0.17172
