   0.00000
 209.66898
 395.90459
 561.60535
 709.22121
 840.84323
 958.27100
1063.06403
1156.58193
1240.01607
1314.41699
1380.71175
1439.72204
1492.18002
1538.73605
1579.97247
1616.40938
1648.51237
1676.69990
1701.34725
1722.79159
1741.33681
1757.25661
1770.79773
1782.18283
1791.61302
1799.27016
1805.31879
1809.90794
1813.17263
1815.23532
1816.20716
1816.18909
1815.27286
1813.54192
1811.07224
1807.93298
1804.18716
1799.89224
1795.10065
1789.86025
1784.21479
1778.20423
1771.86508
1765.23071
1758.33171
1751.19610
1743.84947
1736.31528
1728.61506
1720.76853
1712.79374
1704.70725
1696.52428
1688.25875
1679.92343
1671.53006
1663.08938
1654.61125
1646.10471
1637.57803
1629.03883
1620.49404
1611.95005
1603.41270
1594.88729
1586.37874
1577.89147
1569.42958
1560.99675
1552.59637
1544.23151
1535.90497
1527.61926
1519.37669
1511.17932
1503.02901
1494.92744
1486.87611
1478.87635
1470.92936
1463.03618
1455.19774
1447.41485
1439.68819
1432.01837
1424.40589
1416.85116
1409.35453
1401.91627
1394.53656
1387.21555
1379.95332
1372.74990
1365.60525
1358.51932
1351.49200
1344.52314
1337.61257
1330.76007
1323.96540
