   1.02814
   0.99835
   0.96923
   0.94084
   0.91324
   0.88647
   0.86056
   0.83554
   0.81141
   0.78816
   0.76579
   0.74429
   0.72364
   0.70381
   0.68477
   0.66651
   0.64899
   0.63218
   0.61605
   0.60058
   0.58573
   0.57148
   0.55780
   0.54466
   0.53203
   0.51990
   0.50824
   0.49702
   0.48623
   0.47584
   0.46583
   0.45619
   0.44690
   0.43795
   0.42930
   0.42096
   0.41291
   0.40513
   0.39762
   0.39035
   0.38332
   0.37652
   0.36994
   0.36356
   0.35738
   0.35140
   0.34560
   0.33997
   0.33451
   0.32921
   0.32406
   0.31906
   0.31420
   0.30948
   0.30489
   0.30043
   0.29609
   0.29186
   0.28774
   0.28374
   0.27983
   0.27603
   0.27232
   0.26871
   0.26518
   0.26174
   0.25839
   0.25511
   0.25192
   0.24880
   0.24575
   0.24277
   0.23986
   0.23701
   0.23423
   0.23151
   0.22885
   0.22625
   0.22370
   0.22121
   0.21877
   0.21638
   0.21404
   0.21174
   0.20950
   0.20730
   0.20514
   0.20303
   0.20096
   0.19892
   0.19693
   0.19498
   0.19306
   0.19118
   0.18933
   0.18752
   0.18574
   0.18399
   0.18227
   0.18059
   0.17893
