   0.00000
 209.70274
 396.02768
 561.85749
 709.62922
 841.42360
 959.03198
1064.00744
1157.70467
1241.31135
1315.87542
1382.32209
1441.47191
1494.05643
1540.72579
1582.06244
1618.58681
1650.76497
1679.01603
1703.71593
1725.20255
1743.78055
1759.72436
1773.28143
1784.67514
1794.10725
1801.76025
1807.79928
1812.37391
1815.61969
1817.65954
1818.60505
1818.55756
1817.60919
1815.84373
1813.33745
1810.15978
1806.37401
1802.03782
1797.20386
1791.92017
1786.23067
1780.17547
1773.79121
1767.11142
1760.16676
1752.98537
1745.59294
1738.01299
1730.26713
1722.37515
1714.35514
1706.22372
1697.99617
1689.68642
1681.30729
1672.87056
1664.38697
1655.86642
1647.31797
1638.74990
1630.16984
1621.58475
1613.00101
1604.42446
1595.86044
1587.31384
1578.78910
1570.29030
1561.82115
1553.38503
1544.98500
1536.62385
1528.30411
1520.02807
1511.79779
1503.61512
1495.48175
1487.39915
1479.36867
1471.39148
1463.46863
1455.60103
1447.78949
1440.03470
1432.33723
1424.69760
1417.11620
1409.59338
1402.12938
1394.72440
1387.37857
1380.09197
1372.86460
1365.69645
1358.58743
1351.53744
1344.54632
1337.61388
1330.73991
1323.92416
