   0.00000
 209.30602
 394.55899
 558.82357
 704.68636
 834.34902
 949.69948
1052.36713
1143.76615
1225.12990
1297.53861
1361.94183
1419.17690
1469.98428
1515.02037
1554.86833
1590.04726
1621.02006
1648.20022
1671.95759
1692.62354
1710.49529
1725.83976
1738.89702
1749.88315
1758.99291
1766.40199
1772.26909
1776.73766
1779.93748
1781.98614
1782.99019
1783.04634
1782.24238
1780.65811
1778.36611
1775.43242
1771.91722
1767.87534
1763.35680
1758.40725
1753.06836
1747.37823
1741.37168
1735.08055
1728.53400
1721.75870
1714.77909
1707.61756
1700.29463
1692.82912
1685.23828
1677.53793
1669.74260
1661.86561
1653.91917
1645.91452
1637.86194
1629.77088
1621.65002
1613.50729
1605.35000
1597.18484
1589.01793
1580.85490
1572.70088
1564.56059
1556.43833
1548.33804
1540.26331
1532.21743
1524.20337
1516.22386
1508.28136
1500.37812
1492.51616
1484.69731
1476.92322
1469.19538
1461.51511
1453.88360
1446.30189
1438.77092
1431.29151
1423.86436
1416.49009
1409.16922
1401.90220
1394.68939
1387.53109
1380.42753
1373.37887
1366.38524
1359.44669
1352.56324
1345.73487
1338.96151
1332.24305
1325.57935
1318.97025
1312.41555
