   1.04347
   1.01626
   0.98963
   0.96365
   0.93837
   0.91382
   0.89003
   0.86701
   0.84477
   0.82330
   0.80259
   0.78264
   0.76342
   0.74493
   0.72712
   0.71000
   0.69352
   0.67766
   0.66241
   0.64774
   0.63361
   0.62001
   0.60692
   0.59432
   0.58217
   0.57046
   0.55917
   0.54829
   0.53778
   0.52764
   0.51786
   0.50840
   0.49926
   0.49043
   0.48188
   0.47361
   0.46561
   0.45786
   0.45035
   0.44307
   0.43602
   0.42918
   0.42254
   0.41610
   0.40984
   0.40376
   0.39786
   0.39212
   0.38654
   0.38111
   0.37583
   0.37069
   0.36568
   0.36081
   0.35606
   0.35143
   0.34692
   0.34252
   0.33823
   0.33404
   0.32996
   0.32597
   0.32207
   0.31827
   0.31455
   0.31092
   0.30737
   0.30389
   0.30050
   0.29718
   0.29393
   0.29075
   0.28764
   0.28459
   0.28161
   0.27869
   0.27583
   0.27302
   0.27027
   0.26758
   0.26494
   0.26235
   0.25980
   0.25731
   0.25487
   0.25247
   0.25011
   0.24780
   0.24553
   0.24330
   0.24112
   0.23897
   0.23685
   0.23478
   0.23274
   0.23074
   0.22877
   0.22683
   0.22492
   0.22305
   0.22121
