   0.00000
 209.39832
 394.90526
 559.55440
 705.90527
 836.13607
 952.11450
1055.45269
1147.55017
1229.62806
1302.75640
1367.87643
1425.81875
1477.31850
1523.02793
1563.52705
1599.33267
1630.90611
1658.65982
1682.96316
1704.14732
1722.50968
1738.31759
1751.81167
1763.20875
1772.70443
1780.47530
1786.68102
1791.46602
1794.96108
1797.28478
1798.54466
1798.83839
1798.25471
1796.87433
1794.77069
1792.01069
1788.65532
1784.76018
1780.37602
1775.54919
1770.32205
1764.73331
1758.81838
1752.60969
1746.13692
1739.42725
1732.50559
1725.39480
1718.11582
1710.68785
1703.12855
1695.45408
1687.67930
1679.81786
1671.88227
1663.88404
1655.83372
1647.74102
1639.61483
1631.46334
1623.29405
1615.11384
1606.92902
1598.74540
1590.56829
1582.40254
1574.25261
1566.12257
1558.01616
1549.93677
1541.88751
1533.87120
1525.89042
1517.94751
1510.04458
1502.18355
1494.36616
1486.59397
1478.86837
1471.19063
1463.56185
1455.98304
1448.45505
1440.97868
1433.55457
1426.18330
1418.86537
1411.60118
1404.39106
1397.23530
1390.13410
1383.08761
1376.09591
1369.15907
1362.27709
1355.44992
1348.67749
1341.95969
1335.29637
1328.68735
