   0.00000
 209.36754
 394.78970
 559.31036
 705.49803
 835.53868
 951.30675
1054.42013
1146.28325
1228.12132
1301.00780
1365.88674
1423.59101
1474.85756
1520.34004
1560.61954
1596.21367
1627.58427
1655.14419
1679.26295
1700.27182
1718.46813
1734.11910
1747.46518
1758.72296
1768.08775
1775.73587
1781.82663
1786.50415
1789.89888
1792.12906
1793.30191
1793.51478
1792.85608
1791.40622
1789.23835
1786.41910
1783.00916
1779.06388
1774.63377
1769.76495
1764.49952
1758.87602
1752.92964
1746.69261
1740.19444
1733.46213
1726.52045
1719.39209
1712.09784
1704.65678
1697.08643
1689.40283
1681.62075
1673.75369
1665.81409
1657.81336
1649.76195
1641.66949
1633.54480
1625.39598
1617.23046
1609.05506
1600.87603
1592.69911
1584.52955
1576.37216
1568.23135
1560.11115
1552.01523
1543.94695
1535.90938
1527.90531
1519.93728
1512.00759
1504.11832
1496.27138
1488.46846
1480.71109
1473.00066
1465.33838
1457.72537
1450.16258
1442.65088
1435.19101
1427.78361
1420.42925
1413.12841
1405.88146
1398.68875
1391.55052
1384.46697
1377.43824
1370.46441
1363.54552
1356.68157
1349.87249
1343.11822
1336.41862
1329.77354
1323.18280
