   0.81618
   0.79489
   0.77406
   0.75374
   0.73396
   0.71475
   0.69614
   0.67813
   0.66073
   0.64393
   0.62773
   0.61212
   0.59709
   0.58262
   0.56869
   0.55529
   0.54240
   0.53000
   0.51807
   0.50658
   0.49553
   0.48490
   0.47466
   0.46479
   0.45529
   0.44613
   0.43730
   0.42878
   0.42057
   0.41264
   0.40498
   0.39758
   0.39043
   0.38352
   0.37683
   0.37037
   0.36411
   0.35804
   0.35217
   0.34648
   0.34096
   0.33561
   0.33042
   0.32538
   0.32048
   0.31573
   0.31111
   0.30662
   0.30226
   0.29801
   0.29388
   0.28986
   0.28594
   0.28213
   0.27841
   0.27479
   0.27127
   0.26782
   0.26447
   0.26119
   0.25800
   0.25488
   0.25183
   0.24885
   0.24595
   0.24310
   0.24033
   0.23761
   0.23496
   0.23236
   0.22982
   0.22733
   0.22490
   0.22252
   0.22018
   0.21790
   0.21566
   0.21347
   0.21132
   0.20921
   0.20714
   0.20512
   0.20313
   0.20118
   0.19927
   0.19739
   0.19555
   0.19374
   0.19197
   0.19022
   0.18851
