   0.81075
   0.78960
   0.76891
   0.74872
   0.72908
   0.71000
   0.69151
   0.67362
   0.65633
   0.63965
   0.62356
   0.60805
   0.59312
   0.57874
   0.56491
   0.55160
   0.53879
   0.52647
   0.51462
   0.50321
   0.49224
   0.48167
   0.47150
   0.46170
   0.45226
   0.44316
   0.43439
   0.42593
   0.41777
   0.40989
   0.40228
   0.39493
   0.38783
   0.38097
   0.37433
   0.36790
   0.36168
   0.35566
   0.34983
   0.34417
   0.33869
   0.33338
   0.32822
   0.32321
   0.31835
   0.31363
   0.30904
   0.30458
   0.30025
   0.29603
   0.29192
   0.28793
   0.28404
   0.28025
   0.27656
   0.27297
   0.26946
   0.26604
   0.26271
   0.25945
   0.25628
   0.25318
   0.25015
   0.24720
   0.24431
   0.24149
   0.23873
   0.23603
   0.23339
   0.23081
   0.22829
   0.22582
   0.22340
   0.22104
   0.21872
   0.21645
   0.21422
   0.21205
   0.20991
   0.20782
   0.20576
   0.20375
   0.20178
   0.19984
   0.19794
   0.19608
   0.19425
   0.19245
   0.19069
   0.18896
   0.18726
