  67.37000
  68.80669
  70.37178
  72.06784
  73.89517
  75.85227
  77.93637
  80.14387
  82.47060
  84.91527
  87.47928
  90.14986
  92.93326
  95.81862
  98.80996
 101.89571
 105.08410
 108.36357
 111.73198
 115.19261
 118.73931
 122.36892
 126.07976
 129.87014
 133.73856
 137.68470
 141.70484
 145.79748
 149.96114
 154.19442
 158.49595
 162.86443
 167.29859
 171.79757
 176.36108
 180.98700
 185.67426
 190.42186
 195.22884
 200.09429
 205.01785
 210.00019
 215.03851
 220.13207
 225.28016
 230.48412
 235.74203
 241.05246
 246.41491
 251.83161
 257.29905
 262.81674
 268.38650
 274.00613
 279.67451
 285.39361
 291.16110
 296.97611
 302.84099
 308.75242
 314.71134
 320.71771
 326.76952
 332.86922
 339.01375
 345.20437
 351.44024
 357.72070
 364.04660
 370.41586
 376.83053
 383.28779
 389.78982
 396.33410
 402.92233
 409.55254
 416.22601
 422.94109
 429.69889
 436.49784
 443.33907
 450.22091
 457.14471
 464.10853
 471.11403
 478.15918
 485.24534
 492.37105
 499.53698
 506.74245
 513.98736
 521.27181
 528.59494
 535.95762
 543.35850
 550.79838
 558.27645
 565.79270
 573.34724
 580.93926
 588.56950
