   0.98703
   0.96128
   0.93610
   0.91152
   0.88761
   0.86439
   0.84189
   0.82011
   0.79907
   0.77876
   0.75918
   0.74030
   0.72213
   0.70463
   0.68779
   0.67159
   0.65600
   0.64101
   0.62658
   0.61270
   0.59934
   0.58648
   0.57409
   0.56217
   0.55068
   0.53960
   0.52892
   0.51863
   0.50869
   0.49910
   0.48984
   0.48090
   0.47225
   0.46390
   0.45581
   0.44799
   0.44042
   0.43309
   0.42599
   0.41911
   0.41243
   0.40596
   0.39968
   0.39359
   0.38767
   0.38192
   0.37634
   0.37091
   0.36563
   0.36050
   0.35550
   0.35064
   0.34590
   0.34129
   0.33680
   0.33242
   0.32815
   0.32399
   0.31993
   0.31597
   0.31211
   0.30833
   0.30465
   0.30105
   0.29753
   0.29410
   0.29074
   0.28746
   0.28424
   0.28110
   0.27803
   0.27502
   0.27208
   0.26920
   0.26638
   0.26361
   0.26090
   0.25825
   0.25565
   0.25310
   0.25060
   0.24815
   0.24575
   0.24339
   0.24108
   0.23881
   0.23658
   0.23440
   0.23225
   0.23014
   0.22807
   0.22604
   0.22404
   0.22208
   0.22015
   0.21825
   0.21639
   0.21456
   0.21276
   0.21099
   0.20924
