   1.03176
   1.00485
   0.97852
   0.95283
   0.92784
   0.90357
   0.88004
   0.85728
   0.83529
   0.81406
   0.79358
   0.77386
   0.75486
   0.73657
   0.71897
   0.70203
   0.68574
   0.67006
   0.65498
   0.64047
   0.62650
   0.61306
   0.60012
   0.58765
   0.57564
   0.56406
   0.55290
   0.54214
   0.53175
   0.52173
   0.51205
   0.50270
   0.49366
   0.48492
   0.47648
   0.46830
   0.46039
   0.45272
   0.44530
   0.43811
   0.43113
   0.42437
   0.41780
   0.41143
   0.40525
   0.39924
   0.39340
   0.38772
   0.38221
   0.37684
   0.37162
   0.36653
   0.36158
   0.35676
   0.35207
   0.34749
   0.34303
   0.33868
   0.33444
   0.33030
   0.32626
   0.32231
   0.31846
   0.31470
   0.31102
   0.30743
   0.30392
   0.30049
   0.29713
   0.29385
   0.29064
   0.28749
   0.28442
   0.28140
   0.27845
   0.27556
   0.27273
   0.26996
   0.26724
   0.26458
   0.26197
   0.25940
   0.25689
   0.25443
   0.25201
   0.24964
   0.24731
   0.24502
   0.24278
   0.24058
   0.23841
   0.23629
   0.23420
   0.23215
   0.23013
   0.22815
   0.22620
   0.22429
   0.22240
   0.22055
   0.21873
