   0.99766
   0.96947
   0.94185
   0.91487
   0.88859
   0.86306
   0.83831
   0.81436
   0.79122
   0.76890
   0.74740
   0.72670
   0.70679
   0.68765
   0.66926
   0.65160
   0.63463
   0.61835
   0.60271
   0.58769
   0.57327
   0.55943
   0.54612
   0.53334
   0.52105
   0.50923
   0.49787
   0.48693
   0.47641
   0.46627
   0.45651
   0.44710
   0.43803
   0.42928
   0.42084
   0.41269
   0.40482
   0.39721
   0.38986
   0.38276
   0.37588
   0.36923
   0.36279
   0.35655
   0.35050
   0.34465
   0.33897
   0.33345
   0.32811
   0.32292
   0.31788
   0.31298
   0.30822
   0.30360
   0.29910
   0.29473
   0.29047
   0.28633
   0.28230
   0.27837
   0.27455
   0.27082
   0.26719
   0.26364
   0.26019
   0.25682
   0.25353
   0.25032
   0.24718
   0.24412
   0.24113
   0.23821
   0.23536
   0.23257
   0.22984
   0.22717
   0.22456
   0.22201
   0.21951
   0.21707
   0.21468
   0.21233
   0.21004
   0.20779
   0.20559
   0.20343
   0.20131
   0.19924
   0.19721
   0.19522
   0.19326
   0.19134
   0.18946
   0.18762
   0.18580
   0.18403
   0.18228
   0.18057
   0.17888
   0.17723
   0.17560
