   0.81562
   0.79457
   0.77396
   0.75384
   0.73424
   0.71519
   0.69672
   0.67884
   0.66154
   0.64484
   0.62872
   0.61318
   0.59821
   0.58379
   0.56990
   0.55654
   0.54367
   0.53129
   0.51938
   0.50791
   0.49687
   0.48624
   0.47600
   0.46614
   0.45663
   0.44747
   0.43864
   0.43012
   0.42189
   0.41395
   0.40629
   0.39888
   0.39172
   0.38480
   0.37810
   0.37162
   0.36535
   0.35927
   0.35339
   0.34768
   0.34215
   0.33679
   0.33158
   0.32653
   0.32162
   0.31686
   0.31223
   0.30773
   0.30335
   0.29909
   0.29495
   0.29092
   0.28699
   0.28316
   0.27944
   0.27581
   0.27227
   0.26882
   0.26545
   0.26216
   0.25896
   0.25583
   0.25277
   0.24978
   0.24687
   0.24402
   0.24123
   0.23851
   0.23584
   0.23324
   0.23069
   0.22819
   0.22575
   0.22336
   0.22102
   0.21872
   0.21648
   0.21428
   0.21212
   0.21000
   0.20793
   0.20590
   0.20390
   0.20195
   0.20003
   0.19815
   0.19630
   0.19448
   0.19270
   0.19095
   0.18924
