  65.68575
  67.38873
  69.20937
  71.14884
  73.20642
  75.38000
  77.66648
  80.06213
  82.56286
  85.16702
  87.87530
  90.67664
  93.57586
  96.56360
  99.64294
 102.80394
 106.05334
 109.38122
 112.78562
 116.26921
 119.82665
 123.45516
 127.15321
 130.91927
 134.75200
 138.65108
 142.61324
 146.63712
 150.72139
 154.86479
 159.06609
 163.32409
 167.63767
 172.00601
 176.42890
 180.90437
 185.43146
 190.00924
 194.63682
 199.31336
 204.03853
 208.81299
 213.63412
 218.50121
 223.41359
 228.37257
 233.37634
 238.42353
 243.51363
 248.64891
 253.82593
 259.04419
 264.30557
 269.60791
 274.95007
 280.33411
 285.75769
 291.21992
 296.72333
 302.26446
 307.84435
 313.46302
 319.11835
 324.81303
 330.54380
 336.31210
 342.11705
 347.95797
 353.83588
 359.74848
 365.69819
 371.68181
 377.70195
 383.75573
 389.84521
 395.96813
 402.12611
 408.31721
 414.54287
 420.80121
 427.09376
 433.41846
 439.77713
 446.16734
 452.59140
 459.04664
 465.53504
 472.05465
 478.60656
 485.18988
 491.80457
