   0.00000
 199.61727
 376.81617
 534.42414
 674.82470
 800.04499
 911.82263
1011.65744
1100.85191
1180.54319
1251.72875
1315.28702
1371.99439
1422.53913
1467.53303
1507.52123
1542.99046
1574.37613
1602.06838
1626.41736
1647.73774
1666.31267
1682.39728
1696.22169
1707.99370
1717.90113
1726.11393
1732.78602
1738.05692
1742.05323
1744.88989
1746.67136
1747.49268
1747.44032
1746.59307
1745.02275
1742.79486
1739.96922
1736.60043
1732.73842
1728.42886
1723.71350
1718.63061
1713.21522
1707.49944
1701.51269
1695.28200
1688.83214
1682.18585
1675.36402
1668.38585
1661.26896
1654.02956
1646.68254
1639.24160
1631.71933
1624.12731
1616.47618
1608.77576
1601.03504
1593.26230
1585.46517
1577.65064
1569.82515
1561.99462
1554.16446
1546.33967
1538.52483
1530.72411
1522.94138
1515.18014
1507.44363
1499.73477
1492.05627
1484.41056
1476.79987
1469.22624
1461.69150
1454.19732
1446.74519
1439.33648
1431.97239
1424.65401
1417.38231
1410.15815
1402.98228
1395.85536
1388.77797
1381.75060
1374.77367
1367.84752
1360.97244
1354.14866
1347.37634
1340.65560
1333.98652
1327.36912
1320.80339
1314.28928
1307.82672
1301.41558
