  68.21212
  69.62792
  71.17149
  72.84566
  74.65090
  76.58587
  78.64792
  80.83351
  83.13857
  85.56190
  88.10513
  90.75527
  93.51887
  96.38488
  99.35755
 102.42508
 105.59603
 108.85857
 112.21057
 115.65548
 119.18703
 122.80201
 126.49873
 130.27549
 134.13080
 138.06435
 142.07235
 146.15327
 150.30562
 154.52798
 158.81895
 163.17721
 167.60150
 172.09090
 176.64518
 181.26215
 185.94071
 190.67985
 195.47859
 200.33601
 205.25175
 210.22651
 215.25742
 220.34372
 225.48470
 230.68174
 235.93287
 241.23664
 246.59250
 252.00282
 257.46396
 262.97540
 268.53906
 274.15268
 279.81508
 285.52833
 291.29002
 297.09926
 302.95851
 308.86430
 314.81764
 320.81851
 326.86481
 332.95909
 339.09820
 345.28346
 351.51398
 357.78911
 364.10973
 370.47369
 376.88313
 383.33511
 389.83193
 396.37098
 402.95400
 409.57899
 416.24727
 422.95713
 429.70974
 436.50347
 443.33951
 450.21611
 457.13471
 464.09327
 471.09357
 478.13345
 485.21437
 492.33480
 499.49545
 506.69562
 513.93521
 521.21434
 528.53210
 535.88943
 543.28491
 550.71939
 558.19204
 565.70283
 573.25191
 580.83842
 588.46316
