   0.00000
 209.36762
 394.79003
 559.31106
 705.49918
 835.54038
 951.30905
1054.42306
1146.28685
1228.12560
1301.01277
1365.89239
1423.59734
1474.86455
1520.34767
1560.62780
1596.22252
1627.59370
1655.15416
1679.27345
1700.28281
1718.47959
1734.13101
1747.47751
1758.73568
1768.10084
1775.74930
1781.84039
1786.51821
1789.91323
1792.14367
1793.31677
1793.52986
1792.87137
1791.42171
1789.25402
1786.43494
1783.02515
1779.08001
1774.65003
1769.78133
1764.51601
1758.89260
1752.94631
1746.70936
1740.21126
1733.47902
1726.53740
1719.40908
1712.11487
1704.67385
1697.10353
1689.41996
1681.63789
1673.77085
1665.83127
1657.83054
1649.77914
1641.68668
1633.56198
1625.41315
1617.24762
1609.07220
1600.89316
1592.71622
1584.54664
1576.38923
1568.24839
1560.12816
1552.03221
1543.96390
1535.92629
1527.92219
1519.95412
1512.02439
1504.13509
1496.28810
1488.48514
1480.72773
1473.01725
1465.35494
1457.74188
1450.17905
1442.66730
1435.20738
1427.79994
1420.44553
1413.14463
1405.89764
1398.70488
1391.56660
1384.48300
1377.45422
1370.48034
1363.56140
1356.69739
1349.88827
1343.13394
1336.43429
1329.78916
1323.19837
