   0.91959
   0.89496
   0.87073
   0.84697
   0.82374
   0.80108
   0.77904
   0.75763
   0.73688
   0.71680
   0.69740
   0.67866
   0.66059
   0.64318
   0.62641
   0.61026
   0.59473
   0.57978
   0.56540
   0.55157
   0.53827
   0.52547
   0.51317
   0.50133
   0.48993
   0.47896
   0.46840
   0.45823
   0.44843
   0.43899
   0.42988
   0.42110
   0.41263
   0.40446
   0.39656
   0.38894
   0.38157
   0.37445
   0.36757
   0.36091
   0.35446
   0.34822
   0.34218
   0.33632
   0.33065
   0.32515
   0.31981
   0.31463
   0.30961
   0.30473
   0.29999
   0.29539
   0.29091
   0.28656
   0.28233
   0.27822
   0.27421
   0.27031
   0.26651
   0.26282
   0.25921
   0.25570
   0.25228
   0.24894
   0.24569
   0.24251
   0.23941
   0.23639
   0.23343
   0.23055
   0.22773
   0.22498
   0.22229
   0.21965
   0.21708
   0.21457
   0.21211
   0.20970
   0.20734
   0.20504
   0.20278
   0.20057
   0.19841
   0.19629
   0.19421
   0.19217
   0.19018
   0.18822
   0.18630
   0.18442
   0.18258
   0.18077
   0.17899
   0.17725
   0.17554
   0.17386
   0.17221
   0.17060
   0.16901
   0.16745
   0.16591
