  67.37000
  68.80806
  70.37443
  72.07170
  73.90015
  75.85828
  77.94333
  80.15167
  82.47917
  84.92452
  87.48912
  90.16021
  92.94404
  95.82974
  98.82134
 101.90728
 105.09577
 108.37528
 111.74365
 115.20417
 118.75069
 122.38005
 126.09058
 129.88058
 133.74856
 137.69419
 141.71377
 145.80578
 149.96875
 154.20128
 158.50201
 162.86961
 167.30286
 171.80085
 176.36332
 180.98814
 185.67425
 190.42065
 195.22636
 200.09049
 205.01268
 209.99358
 215.03042
 220.12244
 225.26894
 230.47125
 235.72746
 241.03614
 246.39678
 251.81162
 257.27714
 262.79286
 268.36060
 273.97816
 279.64441
 285.36133
 291.12658
 296.93930
 302.80185
 308.71088
 314.66736
 320.67123
 326.72050
 332.81759
 338.95947
 345.14738
 351.38050
 357.65815
 363.98119
 370.34754
 376.75925
 383.21349
 389.71246
 396.25363
 402.83868
 409.46568
 416.13588
 422.84765
 429.60208
 436.39760
 443.23536
 450.11369
 457.03391
 463.99411
 470.99595
 478.03738
 485.11977
 492.24166
 499.40372
 506.60527
 513.84622
 521.12666
 528.44572
 535.80428
 543.20100
 550.63668
 558.11049
 565.62244
 573.17262
 580.76024
 588.38604
