  67.37000
  68.99536
  70.74004
  72.60271
  74.58161
  76.67461
  78.87932
  81.19315
  83.61335
  86.13709
  88.76147
  91.48360
  94.30063
  97.20973
 100.20815
 103.29323
 106.46238
 109.71315
 113.04316
 116.45015
 119.93195
 123.48653
 127.11193
 130.80630
 134.56788
 138.39502
 142.28614
 146.23973
 150.25439
 154.32878
 158.46162
 162.65170
 166.89789
 171.19909
 175.55427
 179.96245
 184.42269
 188.93411
 193.49586
 198.10713
 202.76715
 207.47518
 212.23052
 217.03249
 221.88046
 226.77380
 231.71192
 236.69425
 241.72025
 246.78940
 251.90118
 257.05511
 262.25073
 267.48759
 272.76524
 278.08327
 283.44127
 288.83885
 294.27564
 299.75125
 305.26535
 310.81757
 316.40759
 322.03509
 327.69974
 333.40125
 339.13931
 344.91363
 350.72394
 356.56996
 362.45142
 368.36806
 374.31964
 380.30589
 386.32659
 392.38148
 398.47036
 404.59298
 410.74914
 416.93861
 423.16119
 429.41667
 435.70485
 442.02554
 448.37853
 454.76365
 461.18070
 467.62951
 474.10990
 480.62169
 487.16471
 493.73880
 500.34379
 506.97951
 513.64580
 520.34252
 527.06952
 533.82662
 540.61370
 547.43061
 554.27719
