   0.98654
   0.95994
   0.93399
   0.90874
   0.88423
   0.86048
   0.83751
   0.81534
   0.79396
   0.77336
   0.75353
   0.73445
   0.71611
   0.69848
   0.68153
   0.66525
   0.64961
   0.63457
   0.62012
   0.60623
   0.59287
   0.58002
   0.56766
   0.55577
   0.54431
   0.53328
   0.52265
   0.51241
   0.50253
   0.49299
   0.48379
   0.47491
   0.46633
   0.45803
   0.45001
   0.44226
   0.43475
   0.42748
   0.42045
   0.41363
   0.40702
   0.40061
   0.39439
   0.38836
   0.38251
   0.37682
   0.37129
   0.36592
   0.36070
   0.35562
   0.35068
   0.34588
   0.34120
   0.33664
   0.33220
   0.32787
   0.32366
   0.31954
   0.31553
   0.31162
   0.30780
   0.30408
   0.30044
   0.29688
   0.29341
   0.29002
   0.28670
   0.28346
   0.28029
   0.27719
   0.27416
   0.27119
   0.26828
   0.26544
   0.26265
   0.25992
   0.25725
   0.25463
   0.25207
   0.24955
   0.24709
   0.24467
   0.24230
   0.23997
   0.23769
   0.23545
   0.23325
   0.23110
   0.22898
   0.22690
   0.22486
   0.22285
   0.22088
   0.21894
   0.21704
   0.21517
   0.21333
   0.21153
   0.20975
   0.20800
   0.20628
