  67.37000
  68.80812
  70.37455
  72.07188
  73.90039
  75.85859
  77.94371
  80.15213
  82.47970
  84.92512
  87.48980
  90.16097
  92.94487
  95.83065
  98.82233
 101.90835
 105.09693
 108.37651
 111.74498
 115.20557
 118.75218
 122.38163
 126.09224
 129.88233
 133.75039
 137.69611
 141.71577
 145.80787
 149.97094
 154.20356
 158.50437
 162.87207
 167.30540
 171.80348
 176.36605
 180.99096
 185.67717
 190.42365
 195.22946
 200.09369
 205.01597
 209.99697
 215.03391
 220.12603
 225.27263
 230.47504
 235.73135
 241.04013
 246.40087
 251.81581
 257.28144
 262.79726
 268.36510
 273.98277
 279.64912
 285.36615
 291.13151
 296.94434
 302.80699
 308.71613
 314.67272
 320.67671
 326.72608
 332.82329
 338.96528
 345.15330
 351.38653
 357.66430
 363.98746
 370.35392
 376.76575
 383.22011
 389.71919
 396.26048
 402.84566
 409.47277
 416.14309
 422.85498
 429.60953
 436.40518
 443.24307
 450.12151
 457.04186
 464.00218
 471.00415
 478.04571
 485.12822
 492.25024
 499.41244
 506.61412
 513.85519
 521.13576
 528.45495
 535.81365
 543.21050
 550.64631
 558.12026
 565.63234
 573.18266
 580.77042
 588.39635
