  66.69630
  68.15252
  69.73746
  71.45351
  73.30081
  75.27773
  77.38141
  79.60816
  81.95380
  84.41690
  86.99873
  89.68669
  92.48678
  95.38830
  98.39509
 101.49580
 104.69835
 107.99143
 111.37291
 114.84590
 118.40438
 122.04523
 125.76678
 129.56734
 133.44542
 137.40067
 141.42947
 145.53030
 149.70173
 153.94236
 158.25084
 162.62587
 167.06624
 171.57105
 176.14003
 180.77109
 185.46320
 190.21535
 195.02660
 199.89605
 204.82336
 209.80914
 214.85067
 219.94723
 225.09812
 230.30461
 235.56484
 240.87742
 246.24184
 251.66026
 257.12927
 262.64838
 268.21934
 273.84002
 279.50932
 285.22915
 290.99722
 296.81271
 302.67787
 308.58946
 314.54842
 320.55468
 326.60629
 332.70561
 338.84968
 345.03970
 351.27486
 357.55452
 363.87947
 370.24772
 376.66122
 383.11726
 389.61792
 396.16077
 402.74744
 409.37602
 416.04775
 422.76102
 429.51688
 436.31384
 443.15296
 450.03264
 456.95416
 463.91565
 470.91871
 477.96136
 485.04491
 492.16796
 499.33114
 506.53379
 513.77581
 521.05728
 528.37737
 535.73692
 543.13462
 550.57123
 558.04598
 565.55883
 573.10990
 580.69840
 588.32502
