  67.37000
  69.03173
  70.81014
  72.70683
  74.72147
  76.85221
  79.09617
  81.44979
  83.90907
  86.47258
  89.14137
  91.90396
  94.76575
  97.71699
 100.76120
 103.88796
 107.10465
 110.40084
 113.77458
 117.22885
 120.75809
 124.35941
 128.03129
 131.77218
 135.58074
 139.45669
 143.39662
 147.39912
 151.46285
 155.58650
 159.76880
 164.00854
 168.30454
 172.65599
 177.06268
 181.52256
 186.03463
 190.59793
 195.21154
 199.87458
 204.58675
 209.34877
 214.15786
 219.01329
 223.91437
 228.86253
 233.85586
 238.89290
 243.97313
 249.09901
 254.26687
 259.47621
 264.72904
 270.02308
 275.35712
 280.73340
 286.14941
 291.60424
 297.10060
 302.63480
 308.20798
 313.82017
 319.46910
 325.15770
 330.88248
 336.64498
 342.44430
 348.27970
 354.15231
 360.05965
 366.00436
 371.98299
 377.99839
 384.04745
 390.13242
 396.25087
 402.40456
 408.59140
 414.81298
 421.06727
 427.35593
 433.67677
 440.03175
 446.41826
 452.83881
 459.29053
 465.77557
 472.29184
 478.84052
 485.42066
 492.03224
