  67.37000
  68.88865
  70.53974
  72.32545
  74.24567
  76.29858
  78.48110
  80.78935
  83.21897
  85.76837
  88.43860
  91.21704
  94.10945
  97.10512
 100.20771
 103.40590
 106.70740
 110.10096
 113.58437
 117.16063
 120.82374
 124.57055
 128.39937
 132.30846
 136.29632
 140.36256
 144.50356
 148.71782
 153.00385
 157.36027
 161.78572
 166.27889
 170.83855
 175.46381
 180.15437
 184.90815
 189.72412
 194.60127
 199.53865
 204.53536
 209.59105
 214.70629
 219.87841
 225.10668
 230.39039
 235.73077
 241.12599
 246.57466
 252.07628
 257.63293
 263.24128
 268.90082
 274.61326
 280.37649
 286.18943
 292.05391
 297.96772
 303.93001
 309.94299
 316.00347
 322.11235
 328.26956
 334.47317
 340.72549
 347.02360
 353.36869
 359.75992
 366.19668
 372.67972
 379.20709
 385.78068
 392.39783
 399.06057
 405.76652
 412.51725
 419.31090
 426.14864
 433.02892
 439.95276
 446.91867
 453.92768
 460.97824
 468.07156
 475.20584
 482.38261
 489.59994
 496.85909
 504.15869
 511.49935
 518.88040
 526.30176
 533.76349
 541.26478
 548.80641
 556.38713
 564.00765
 571.66723
 579.36582
 587.10351
 594.87955
 602.69458
