   0.79849
   0.77766
   0.75728
   0.73740
   0.71805
   0.69926
   0.68105
   0.66343
   0.64641
   0.62997
   0.61413
   0.59885
   0.58415
   0.56999
   0.55636
   0.54326
   0.53064
   0.51851
   0.50684
   0.49560
   0.48479
   0.47439
   0.46437
   0.45472
   0.44542
   0.43646
   0.42782
   0.41949
   0.41145
   0.40369
   0.39620
   0.38896
   0.38197
   0.37521
   0.36867
   0.36234
   0.35621
   0.35028
   0.34454
   0.33897
   0.33357
   0.32833
   0.32325
   0.31832
   0.31354
   0.30889
   0.30437
   0.29998
   0.29571
   0.29155
   0.28751
   0.28358
   0.27975
   0.27601
   0.27238
   0.26884
   0.26539
   0.26202
   0.25874
   0.25553
   0.25240
   0.24935
   0.24637
   0.24346
   0.24062
   0.23784
   0.23512
   0.23246
   0.22987
   0.22732
   0.22484
   0.22241
   0.22002
   0.21769
   0.21541
   0.21317
   0.21098
   0.20884
   0.20674
   0.20467
   0.20265
   0.20067
   0.19873
   0.19682
   0.19495
   0.19311
   0.19131
   0.18954
   0.18781
   0.18610
   0.18443
