   1.02257
   0.99368
   0.96537
   0.93771
   0.91078
   0.88461
   0.85923
   0.83469
   0.81097
   0.78810
   0.76606
   0.74484
   0.72443
   0.70482
   0.68597
   0.66786
   0.65048
   0.63378
   0.61775
   0.60236
   0.58758
   0.57339
   0.55975
   0.54665
   0.53405
   0.52194
   0.51030
   0.49909
   0.48830
   0.47791
   0.46791
   0.45826
   0.44897
   0.44000
   0.43134
   0.42299
   0.41492
   0.40713
   0.39960
   0.39231
   0.38526
   0.37845
   0.37184
   0.36545
   0.35925
   0.35325
   0.34743
   0.34178
   0.33630
   0.33098
   0.32581
   0.32079
   0.31592
   0.31118
   0.30657
   0.30209
   0.29773
   0.29348
   0.28935
   0.28532
   0.28140
   0.27758
   0.27386
   0.27022
   0.26668
   0.26323
   0.25986
   0.25657
   0.25335
   0.25022
   0.24715
   0.24416
   0.24123
   0.23837
   0.23558
   0.23284
   0.23017
   0.22755
   0.22499
   0.22249
   0.22003
   0.21763
   0.21528
   0.21298
   0.21072
   0.20851
   0.20634
   0.20422
   0.20213
   0.20009
   0.19809
   0.19612
   0.19419
   0.19230
   0.19044
   0.18862
   0.18683
   0.18507
   0.18335
   0.18165
   0.17999
