  66.02260
  67.71717
  69.52921
  71.45998
  73.50884
  75.67373
  77.95160
  80.33875
  82.83111
  85.42707
  88.12739
  90.92093
  93.81263
  96.79303
  99.86532
 103.01945
 106.26230
 109.58383
 112.98210
 116.45982
 120.01163
 123.63471
 127.32753
 131.08857
 134.91647
 138.81094
 142.76867
 146.78829
 150.86847
 155.00794
 159.20545
 163.45982
 167.76990
 172.13489
 176.55455
 181.02692
 185.55103
 190.12593
 194.75073
 199.42459
 204.14718
 208.91917
 213.73791
 218.60268
 223.51282
 228.46965
 233.47135
 238.51652
 243.60467
 248.73809
 253.91329
 259.12978
 264.38946
 269.69016
 275.03070
 280.41320
 285.83528
 291.29605
 296.79806
 302.33781
 307.91638
 313.53376
 319.18782
 324.88129
 330.61088
 336.37803
 342.18186
 348.02169
 353.89855
 359.81011
 365.75882
 371.74145
 377.76065
 383.81350
 389.90208
 396.02412
 402.18125
 408.37151
 414.59636
 420.85390
 427.14568
 433.46961
 439.82755
 446.21702
 452.64039
 459.09493
 465.58266
 472.10162
 478.65289
 485.23557
 491.84965
