   1.00372
   0.97754
   0.95193
   0.92694
   0.90262
   0.87901
   0.85613
   0.83398
   0.81259
   0.79193
   0.77202
   0.75282
   0.73434
   0.71655
   0.69942
   0.68295
   0.66710
   0.65185
   0.63718
   0.62306
   0.60947
   0.59640
   0.58380
   0.57167
   0.55999
   0.54873
   0.53787
   0.52740
   0.51730
   0.50754
   0.49813
   0.48903
   0.48024
   0.47174
   0.46352
   0.45557
   0.44787
   0.44042
   0.43319
   0.42620
   0.41941
   0.41283
   0.40644
   0.40025
   0.39423
   0.38838
   0.38270
   0.37718
   0.37181
   0.36659
   0.36151
   0.35657
   0.35175
   0.34706
   0.34250
   0.33804
   0.33370
   0.32947
   0.32534
   0.32132
   0.31739
   0.31355
   0.30980
   0.30614
   0.30257
   0.29907
   0.29566
   0.29232
   0.28905
   0.28586
   0.28273
   0.27968
   0.27668
   0.27375
   0.27088
   0.26807
   0.26532
   0.26262
   0.25998
   0.25738
   0.25484
   0.25235
   0.24991
   0.24751
   0.24516
   0.24285
   0.24059
   0.23836
   0.23618
   0.23404
   0.23193
   0.22986
   0.22783
   0.22584
   0.22387
   0.22195
   0.22005
   0.21819
   0.21636
   0.21455
   0.21278
