   0.81379
   0.79256
   0.77179
   0.75152
   0.73181
   0.71266
   0.69410
   0.67614
   0.65879
   0.64204
   0.62589
   0.61033
   0.59534
   0.58091
   0.56702
   0.55366
   0.54081
   0.52844
   0.51654
   0.50509
   0.49408
   0.48347
   0.47326
   0.46342
   0.45395
   0.44482
   0.43601
   0.42752
   0.41933
   0.41142
   0.40378
   0.39641
   0.38928
   0.38239
   0.37572
   0.36927
   0.36303
   0.35699
   0.35113
   0.34546
   0.33995
   0.33462
   0.32944
   0.32442
   0.31954
   0.31480
   0.31019
   0.30571
   0.30136
   0.29713
   0.29301
   0.28900
   0.28510
   0.28129
   0.27759
   0.27398
   0.27046
   0.26703
   0.26368
   0.26042
   0.25723
   0.25412
   0.25108
   0.24812
   0.24522
   0.24238
   0.23962
   0.23691
   0.23426
   0.23167
   0.22914
   0.22666
   0.22423
   0.22186
   0.21953
   0.21725
   0.21502
   0.21283
   0.21069
   0.20859
   0.20653
   0.20451
   0.20253
   0.20058
   0.19868
   0.19681
   0.19497
   0.19317
   0.19140
   0.18966
   0.18795
