   0.99830
   0.97282
   0.94784
   0.92344
   0.89965
   0.87652
   0.85407
   0.83232
   0.81127
   0.79093
   0.77130
   0.75235
   0.73409
   0.71649
   0.69954
   0.68322
   0.66750
   0.65237
   0.63780
   0.62378
   0.61027
   0.59726
   0.58473
   0.57265
   0.56101
   0.54979
   0.53896
   0.52852
   0.51844
   0.50871
   0.49931
   0.49022
   0.48144
   0.47295
   0.46474
   0.45679
   0.44909
   0.44164
   0.43441
   0.42741
   0.42063
   0.41404
   0.40765
   0.40145
   0.39542
   0.38957
   0.38389
   0.37836
   0.37298
   0.36775
   0.36267
   0.35771
   0.35289
   0.34819
   0.34361
   0.33915
   0.33480
   0.33056
   0.32643
   0.32239
   0.31845
   0.31460
   0.31085
   0.30718
   0.30360
   0.30009
   0.29667
   0.29332
   0.29005
   0.28684
   0.28371
   0.28065
   0.27764
   0.27470
   0.27183
   0.26901
   0.26625
   0.26354
   0.26089
   0.25829
   0.25574
   0.25324
   0.25079
   0.24839
   0.24603
   0.24371
   0.24144
   0.23921
   0.23702
   0.23487
   0.23276
   0.23068
   0.22865
   0.22664
   0.22468
   0.22274
   0.22084
   0.21897
   0.21713
   0.21533
   0.21355
