   0.00000
 205.93107
 389.07104
 552.22224
 697.75246
 827.68234
 943.75099
1047.46604
1140.14257
1222.93380
1296.85779
1362.81379
1421.59990
1473.92832
1520.43247
1561.68047
1598.18043
1630.38786
1658.71286
1683.52367
1705.15162
1723.89575
1740.02578
1753.78512
1765.39374
1775.05051
1782.93548
1789.21174
1794.02713
1797.51574
1799.79930
1800.98836
1801.18345
1800.47598
1798.94918
1796.67884
1793.73404
1790.17775
1786.06744
1781.45556
1776.39002
1770.91465
1765.06949
1758.89117
1752.41318
1745.66621
1738.67840
1731.47550
1724.08106
1716.51675
1708.80242
1700.95624
1692.99491
1684.93375
1676.78681
1668.56696
1660.28608
1651.95497
1643.58363
1635.18120
1626.75603
1618.31584
1609.86766
1601.41795
1592.97264
1584.53711
1576.11635
1567.71486
1559.33681
1550.98594
1542.66572
1534.37927
1526.12945
1517.91884
1509.74978
1501.62440
1493.54461
1485.51214
1477.52852
1469.59515
1461.71325
1453.88391
1446.10810
1438.38666
1430.72033
1423.10972
1415.55539
1408.05778
1400.61726
1393.23412
1385.90860
1378.64085
1371.43099
1364.27906
1357.18507
1350.14897
1343.17068
1336.25009
1329.38702
1322.58128
1315.83267
