 0.0001000
 0.0001017
 0.0001033
 0.0001051
 0.0001068
 0.0001086
 0.0001104
 0.0001122
 0.0001140
 0.0001159
 0.0001178
 0.0001198
 0.0001218
 0.0001238
 0.0001259
 0.0001279
 0.0001301
 0.0001322
 0.0001344
 0.0001366
 0.0001389
 0.0001412
 0.0001435
 0.0001459
 0.0001483
 0.0001508
 0.0001533
 0.0001558
 0.0001584
 0.0001610
 0.0001637
 0.0001664
 0.0001691
 0.0001719
 0.0001748
 0.0001777
 0.0001806
 0.0001836
 0.0001867
 0.0001897
 0.0001929
 0.0001961
 0.0001993
 0.0002026
 0.0002060
 0.0002094
 0.0002129
 0.0002164
 0.0002200
 0.0002236
 0.0002273
 0.0002311
 0.0002349
 0.0002388
 0.0002428
 0.0002468
 0.0002509
 0.0002550
 0.0002592
 0.0002635
 0.0002679
 0.0002723
 0.0002768
 0.0002814
 0.0002861
 0.0002908
 0.0002956
 0.0003005
 0.0003055
 0.0003106
 0.0003157
 0.0003209
 0.0003262
 0.0003317
 0.0003371
 0.0003427
 0.0003484
 0.0003542
 0.0003600
 0.0003660
 0.0003721
 0.0003782
 0.0003845
 0.0003908
 0.0003973
 0.0004039
 0.0004106
 0.0004174
 0.0004243
 0.0004313
 0.0004385
 0.0004457
 0.0004531
 0.0004606
 0.0004682
 0.0004760
 0.0004839
 0.0004919
 0.0005000
 0.0005083
 0.0005167
 0.0005253
 0.0005340
 0.0005428
 0.0005518
 0.0005610
 0.0005702
 0.0005797
 0.0005893
 0.0005990
 0.0006090
 0.0006190
 0.0006293
 0.0006397
 0.0006503
 0.0006611
 0.0006720
 0.0006832
 0.0006945
 0.0007060
 0.0007177
 0.0007295
 0.0007416
 0.0007539
 0.0007664
 0.0007791
 0.0007920
 0.0008051
 0.0008184
 0.0008320
 0.0008457
 0.0008598
 0.0008740
 0.0008885
 0.0009032
 0.0009181
 0.0009333
 0.0009488
 0.0009645
 0.0009805
 0.0009967
 0.0010132
 0.0010300
 0.0010470
 0.0010644
 0.0010820
 0.0010999
 0.0011181
 0.0011367
 0.0011555
 0.0011746
 0.0011941
 0.0012138
 0.0012339
 0.0012544
 0.0012751
 0.0012963
 0.0013177
 0.0013395
 0.0013617
 0.0013843
 0.0014072
 0.0014305
 0.0014542
 0.0014783
 0.0015027
 0.0015276
 0.0015529
 0.0015786
 0.0016048
 0.0016313
 0.0016584
 0.0016858
 0.0017137
 0.0017421
 0.0017710
 0.0018003
 0.0018301
 0.0018604
 0.0018912
 0.0019225
 0.0019544
 0.0019867
 0.0020196
 0.0020531
 0.0020871
 0.0021216
 0.0021568
 0.0021925
 0.0022288
 0.0022657
 0.0023032
 0.0023413
 0.0023801
 0.0024195
 0.0024596
 0.0025003
 0.0025417
 0.0025838
 0.0026266
 0.0026701
 0.0027143
 0.0027592
 0.0028049
 0.0028514
 0.0028986
 0.0029466
 0.0029954
 0.0030450
 0.0030954
 0.0031467
 0.0031988
 0.0032518
 0.0033056
 0.0033603
 0.0034160
 0.0034725
 0.0035300
 0.0035885
 0.0036479
 0.0037083
 0.0037697
 0.0038322
 0.0038956
 0.0039601
 0.0040257
 0.0040924
 0.0041601
 0.0042290
 0.0042990
 0.0043702
 0.0044426
 0.0045162
 0.0045909
 0.0046670
 0.0047443
 0.0048228
 0.0049027
 0.0049839
 0.0050664
 0.0051503
 0.0052356
 0.0053223
 0.0054104
 0.0055000
 0.0055911
 0.0056836
 0.0057778
 0.0058734
 0.0059707
 0.0060696
 0.0061701
 0.0062722
 0.0063761
 0.0064817
 0.0065890
 0.0066981
 0.0068090
 0.0069218
 0.0070364
 0.0071529
 0.0072714
 0.0073918
 0.0075142
 0.0076386
 0.0077651
 0.0078937
 0.0080244
 0.0081573
 0.0082923
 0.0084297
 0.0085692
 0.0087111
 0.0088554
 0.0090020
 0.0091511
 0.0093026
 0.0094567
 0.0096133
 0.0097724
 0.0099343
 0.0100988
 0.0102660
 0.0104360
 0.0106088
 0.0107845
 0.0109631
 0.0111446
 0.0113291
 0.0115167
 0.0117074
 0.0119013
 0.0120984
 0.0122987
 0.0125024
 0.0127094
 0.0129199
 0.0131338
 0.0133513
 0.0135724
 0.0137971
 0.0140256
 0.0142578
 0.0144939
 0.0147339
 0.0149779
 0.0152259
 0.0154781
 0.0157344
 0.0159949
 0.0162598
 0.0165290
 0.0168027
 0.0170810
 0.0173638
 0.0176513
 0.0179436
 0.0182408
 0.0185428
 0.0188499
 0.0191620
 0.0194793
 0.0198019
 0.0201298
 0.0204631
 0.0208020
 0.0211464
 0.0214966
 0.0218525
 0.0222144
 0.0225823
 0.0229562
 0.0233363
 0.0237228
 0.0241156
 0.0245149
 0.0249209
 0.0253335
 0.0257530
 0.0261795
 0.0266130
 0.0270537
 0.0275017
 0.0279571
 0.0284200
 0.0288906
 0.0293690
 0.0298553
 0.0303497
 0.0308523
 0.0313632
 0.0318825
 0.0324105
 0.0329471
 0.0334927
 0.0340473
 0.0346111
 0.0351843
 0.0357669
 0.0363591
 0.0369612
 0.0375733
 0.0381954
 0.0388279
 0.0394709
 0.0401245
 0.0407889
 0.0414643
 0.0421509
 0.0428489
 0.0435585
 0.0442797
 0.0450130
 0.0457583
 0.0465161
 0.0472863
 0.0480693
 0.0488653
 0.0496745
 0.0504971
 0.0513332
 0.0521833
 0.0530474
 0.0539258
 0.0548188
 0.0557265
 0.0566493
 0.0575874
 0.0585410
 0.0595103
 0.0604958
 0.0614975
 0.0625159
 0.0635511
 0.0646034
 0.0656732
 0.0667607
 0.0678662
 0.0689900
 0.0701324
 0.0712937
 0.0724743
 0.0736744
 0.0748944
 0.0761346
 0.0773953
 0.0786769
 0.0799797
 0.0813041
 0.0826504
 0.0840190
 0.0854103
 0.0868246
 0.0882623
 0.0897239
 0.0912096
 0.0927200
 0.0942553
 0.0958161
 0.0974028
 0.0990157
 0.1006553
 0.1023220
 0.1040164
 0.1057388
 0.1074897
 0.1092697
 0.1110791
 0.1129185
 0.1147883
 0.1166891
 0.1186213
 0.1205856
 0.1225824
 0.1246122
 0.1266757
 0.1287733
 0.1309057
 0.1330734
 0.1352770
 0.1375170
 0.1397942
 0.1421090
 0.1444622
 0.1468544
 0.1492862
 0.1517582
 0.1542712
 0.1568258
 0.1594227
 0.1620626
 0.1647462
 0.1674742
 0.1702475
 0.1730666
 0.1759324
 0.1788457
 0.1818072
 0.1848178
 0.1878782
 0.1909893
 0.1941519
 0.1973669
 0.2006351
 0.2039574
 0.2073348
 0.2107681
 0.2142582
 0.2178061
 0.2214128
 0.2250792
 0.2288063
 0.2325951
 0.2364467
 0.2403620
 0.2443422
 0.2483883
 0.2525013
 0.2566825
 0.2609330
 0.2652538
 0.2696461
 0.2741112
 0.2786503
 0.2832645
 0.2879551
 0.2927233
 0.2975706
 0.3024981
 0.3075072
 0.3125992
 0.3177756
 0.3230376
 0.3283868
 0.3338246
 0.3393525
 0.3449718
 0.3506842
 0.3564913
 0.3623944
 0.3683954
 0.3744956
 0.3806970
 0.3870009
 0.3934093
 0.3999238
 0.4065462
 0.4132782
 0.4201218
 0.4270786
 0.4341506
 0.4413398
 0.4486479
 0.4560771
 0.4636294
 0.4713067
 0.4791111
 0.4870447
 0.4951097
 0.5033083
 0.5116426
 0.5201150
 0.5287276
 0.5374828
 0.5463831
 0.5554307
 0.5646281
 0.5739778
 0.5834824
 0.5931443
 0.6029662
 0.6129508
 0.6231007
 0.6334187
 0.6439075
 0.6545701
 0.6654091
 0.6764277
 0.6876287
 0.6990152
 0.7105903
 0.7223570
 0.7343186
 0.7464783
 0.7588393
 0.7714049
 0.7841787
 0.7971640
 0.8103643
 0.8237832
 0.8374243
 0.8512913
 0.8653879
 0.8797179
 0.8942853
 0.9090938
 0.9241476
 0.9394506
 0.9550071
 0.9708211
 0.9868970
 1.0032391
 1.0198519
 1.0367397
 1.0539072
 1.0713589
 1.0890996
 1.1071341
 1.1254673
 1.1441040
 1.1630493
 1.1823083
 1.2018863
 1.2217884
 1.2420201
 1.2625869
 1.2834942
 1.3047477
 1.3263531
 1.3483163
 1.3706432
 1.3933398
 1.4164122
 1.4398667
 1.4637096
 1.4879473
 1.5125864
 1.5376334
 1.5630952
 1.5889787
 1.6152907
 1.6420384
 1.6692291
 1.6968700
 1.7249686
 1.7535326
 1.7825695
 1.8120872
 1.8420937
 1.8725971
 1.9036056
 1.9351276
 1.9671715
 1.9997461
 2.0328601
 2.0665224
 2.1007421
 2.1355285
 2.1708909
 2.2068389
 2.2433821
 2.2805305
 2.3182940
 2.3566829
 2.3957074
 2.4353781
 2.4757058
 2.5167012
 2.5583755
 2.6007398
 2.6438057
 2.6875848
 2.7320887
 2.7773296
 2.8233197
 2.8700713
 2.9175970
 2.9659098
 3.0150226
 3.0649486
 3.1157014
 3.1672945
 3.2197421
 3.2730581
 3.3272569
 3.3823533
 3.4383620
 3.4952981
 3.5531771
 3.6120144
 3.6718261
 3.7326282
 3.7944371
 3.8572696
 3.9211424
 3.9860730
 4.0520787
 4.1191775
 4.1873873
 4.2567266
 4.3272142
 4.3988689
 4.4717102
 4.5457576
 4.6210312
 4.6975513
 4.7753385
 4.8544137
 4.9347984
 5.0165142
 5.0995831
 5.1840275
 5.2698703
 5.3571346
 5.4458439
 5.5360221
 5.6276936
 5.7208831
 5.8156157
 5.9119170
 6.0098129
 6.1093300
 6.2104949
 6.3133351
 6.4178782
 6.5241524
 6.6321864
 6.7420094
 6.8536509
 6.9671412
 7.0825107
 7.1997906
 7.3190126
 7.4402088
 7.5634119
 7.6886551
 7.8159722
 7.9453976
 8.0769662
 8.2107134
 8.3466753
 8.4848887
 8.6253907
 8.7682193
 8.9134131
 9.0610111
 9.2110532
 9.3635799
 9.5186322
 9.6762521
 9.8364820
 9.9993652
10.1649456
10.3332679
10.5043774
10.6783203
10.8551436
11.0348949
11.2176227
11.4033764
11.5922059
11.7841623
11.9792973
12.1776636
12.3793146
12.5843048
12.7926894
13.0045247
13.2198678
13.4387768
13.6613107
13.8875296
14.1174945
14.3512673
14.5889113
14.8304904
15.0760698
15.3257158
15.5794957
15.8374780
16.0997322
16.3663291
16.6373406
16.9128399
17.1929011
17.4775999
17.7670131
18.0612187
18.3602960
18.6643258
18.9733901
19.2875721
19.6069568
19.9316302
20.2616798
20.5971948
20.9382656
21.2849843
21.6374442
21.9957406
22.3599701
22.7302308
23.1066228
23.4892474
23.8782080
24.2736094
24.6755583
25.0841631
25.4995340
25.9217831
26.3510243
26.7873733
27.2309478
27.6818675
28.1402541
28.6062311
29.0799242
29.5614613
30.0509722
30.5485890
31.0544459
31.5686792
32.0914278
32.6228327
33.1630371
33.7121869
34.2704300
34.8379171
35.4148014
36.0012383
36.5973860
37.2034054
37.8194600
38.4457158
39.0823419
39.7295100
40.3873945
41.0561730
41.7360259
42.4271365
43.1296913
43.8438798
44.5698945
45.3079314
46.0581896
46.8208713
47.5961823
48.3843318
49.1855323
50.0000000
