   0.82103
   0.79961
   0.77866
   0.75821
   0.73832
   0.71900
   0.70028
   0.68216
   0.66465
   0.64776
   0.63146
   0.61576
   0.60064
   0.58608
   0.57207
   0.55859
   0.54562
   0.53315
   0.52114
   0.50959
   0.49848
   0.48778
   0.47747
   0.46755
   0.45799
   0.44878
   0.43990
   0.43133
   0.42306
   0.41509
   0.40738
   0.39994
   0.39275
   0.38580
   0.37907
   0.37257
   0.36627
   0.36017
   0.35426
   0.34854
   0.34299
   0.33760
   0.33238
   0.32731
   0.32239
   0.31760
   0.31296
   0.30844
   0.30405
   0.29978
   0.29562
   0.29158
   0.28764
   0.28380
   0.28007
   0.27643
   0.27288
   0.26941
   0.26604
   0.26274
   0.25953
   0.25639
   0.25332
   0.25033
   0.24741
   0.24455
   0.24176
   0.23902
   0.23635
   0.23374
   0.23118
   0.22868
   0.22623
   0.22384
   0.22149
   0.21919
   0.21694
   0.21473
   0.21257
   0.21045
   0.20837
   0.20633
   0.20434
   0.20238
   0.20045
   0.19856
   0.19671
   0.19489
   0.19311
   0.19135
   0.18963
