   0.95904
   0.93403
   0.90955
   0.88568
   0.86244
   0.83988
   0.81801
   0.79686
   0.77641
   0.75668
   0.73765
   0.71931
   0.70165
   0.68465
   0.66828
   0.65254
   0.63740
   0.62283
   0.60881
   0.59532
   0.58234
   0.56984
   0.55781
   0.54622
   0.53506
   0.52430
   0.51392
   0.50392
   0.49426
   0.48494
   0.47595
   0.46726
   0.45886
   0.45074
   0.44288
   0.43528
   0.42793
   0.42080
   0.41390
   0.40722
   0.40073
   0.39445
   0.38834
   0.38242
   0.37667
   0.37109
   0.36566
   0.36039
   0.35526
   0.35027
   0.34541
   0.34069
   0.33609
   0.33161
   0.32724
   0.32299
   0.31884
   0.31480
   0.31086
   0.30701
   0.30325
   0.29959
   0.29600
   0.29251
   0.28909
   0.28575
   0.28249
   0.27930
   0.27618
   0.27313
   0.27014
   0.26722
   0.26436
   0.26156
   0.25882
   0.25613
   0.25350
   0.25092
   0.24840
   0.24592
   0.24349
   0.24111
   0.23878
   0.23649
   0.23424
   0.23204
   0.22987
   0.22775
   0.22566
   0.22361
   0.22160
   0.21963
   0.21768
   0.21578
   0.21390
   0.21206
   0.21025
   0.20847
   0.20672
   0.20500
   0.20331
