   0.81226
   0.79107
   0.77034
   0.75011
   0.73043
   0.71132
   0.69280
   0.67487
   0.65755
   0.64084
   0.62472
   0.60918
   0.59422
   0.57982
   0.56596
   0.55262
   0.53979
   0.52745
   0.51557
   0.50415
   0.49315
   0.48257
   0.47237
   0.46256
   0.45310
   0.44398
   0.43520
   0.42672
   0.41854
   0.41065
   0.40303
   0.39567
   0.38855
   0.38168
   0.37502
   0.36859
   0.36236
   0.35632
   0.35048
   0.34481
   0.33932
   0.33400
   0.32883
   0.32381
   0.31894
   0.31421
   0.30961
   0.30515
   0.30080
   0.29658
   0.29247
   0.28846
   0.28457
   0.28077
   0.27708
   0.27347
   0.26996
   0.26654
   0.26320
   0.25994
   0.25676
   0.25365
   0.25062
   0.24766
   0.24476
   0.24194
   0.23917
   0.23647
   0.23383
   0.23124
   0.22871
   0.22624
   0.22382
   0.22145
   0.21912
   0.21685
   0.21462
   0.21244
   0.21030
   0.20820
   0.20615
   0.20413
   0.20215
   0.20021
   0.19831
   0.19644
   0.19461
   0.19281
   0.19104
   0.18931
   0.18761
