  67.37000
  69.07248
  70.89358
  72.83471
  74.89535
  77.07350
  79.36613
  81.76955
  84.27967
  86.89493
  89.61622
  92.43211
  95.34780
  98.35358
 101.45283
 104.63521
 107.90789
 111.26055
 114.69122
 118.20275
 121.78964
 125.44900
 129.17929
 132.97895
 136.84662
 140.78201
 144.78172
 148.84436
 152.96857
 157.15304
 161.39652
 165.69779
 170.05567
 174.46935
 178.93860
 183.46141
 188.03677
 192.66371
 197.34134
 202.06878
 206.84570
 211.67281
 216.54737
 221.46866
 226.43598
 231.45073
 236.51101
 241.61539
 246.76337
 251.95732
 257.19365
 262.47185
 267.79390
 273.15754
 278.56158
 284.00820
 289.49496
 295.02092
 300.58876
 306.19483
 311.84026
 317.52507
 323.24703
 329.00899
 334.80753
 340.64416
 346.51798
 352.42828
 358.37612
 364.35911
 370.37979
 376.43482
 382.52693
 388.65312
 394.81555
 401.01186
 407.24374
 413.50918
 419.80968
 426.14329
 432.51162
 438.91249
 445.34786
 451.81513
 458.31678
 464.84998
 471.41684
 478.01530
 484.64651
 491.30954
 498.00437
