   0.99741
   0.96923
   0.94161
   0.91464
   0.88836
   0.86284
   0.83809
   0.81415
   0.79102
   0.76871
   0.74721
   0.72651
   0.70661
   0.68747
   0.66909
   0.65143
   0.63447
   0.61819
   0.60255
   0.58754
   0.57313
   0.55928
   0.54598
   0.53320
   0.52091
   0.50910
   0.49774
   0.48681
   0.47629
   0.46615
   0.45639
   0.44699
   0.43792
   0.42917
   0.42073
   0.41258
   0.40471
   0.39711
   0.38976
   0.38266
   0.37578
   0.36913
   0.36269
   0.35646
   0.35041
   0.34456
   0.33888
   0.33337
   0.32802
   0.32283
   0.31779
   0.31290
   0.30814
   0.30352
   0.29903
   0.29465
   0.29040
   0.28626
   0.28223
   0.27830
   0.27448
   0.27075
   0.26712
   0.26357
   0.26012
   0.25675
   0.25346
   0.25025
   0.24712
   0.24406
   0.24107
   0.23815
   0.23530
   0.23251
   0.22978
   0.22711
   0.22451
   0.22195
   0.21946
   0.21701
   0.21462
   0.21228
   0.20998
   0.20774
   0.20553
   0.20338
   0.20126
   0.19919
   0.19716
   0.19516
   0.19321
   0.19129
   0.18941
   0.18757
   0.18576
   0.18398
   0.18223
   0.18052
   0.17884
   0.17718
   0.17556
