   0.00000
 209.35876
 394.77461
 559.29180
 705.47813
 835.51898
 951.28847
1054.40422
1146.27025
1228.11108
1301.00103
1365.88362
1423.59112
1474.86135
1520.34699
1560.62969
1596.22692
1627.60018
1655.16273
1679.28402
1700.29503
1718.49325
1734.14599
1747.49368
1758.75292
1768.11898
1775.76817
1781.85985
1786.53813
1789.93350
1792.16418
1793.33743
1793.55057
1792.89204
1791.44226
1789.27441
1786.45510
1783.04504
1779.09958
1774.66922
1769.80006
1764.53428
1758.91038
1752.96358
1746.72607
1740.22738
1733.49455
1726.55232
1719.42336
1712.12850
1704.68684
1697.11584
1689.43159
1681.64885
1673.78113
1665.84084
1657.83943
1649.78733
1641.69418
1633.56880
1625.41927
1617.25305
1609.07695
1600.89722
1592.71961
1584.54935
1576.39127
1568.24977
1560.12888
1552.03227
1543.96332
1535.92508
1527.92034
1519.95164
1512.02129
1504.13138
1496.28379
1488.48023
1480.72223
1473.01117
1465.34828
1457.73466
1450.17127
1442.65896
1435.19850
1427.79052
1420.43559
1413.13417
1405.88667
1398.69339
1391.55462
