   0.00000
 209.34292
 394.69736
 559.11544
 705.17291
 835.06200
 950.66253
1053.59700
1145.27374
1226.92124
1299.61567
1364.30329
1421.81879
1472.90053
1518.20327
1558.30894
1593.73575
1624.94599
1652.35276
1676.32574
1697.19623
1715.26153
1730.78874
1744.01816
1755.16619
1764.42790
1771.97938
1777.97970
1782.57268
1785.88855
1788.04525
1789.14976
1789.29915
1788.58160
1787.07726
1784.85906
1781.99339
1778.54074
1774.55625
1770.09022
1765.18859
1759.89330
1754.24268
1748.27181
1742.01274
1735.49483
1728.74498
1721.78779
1714.64585
1707.33984
1699.88873
1692.30993
1684.61940
1676.83180
1668.96057
1661.01805
1653.01558
1644.96355
1636.87151
1628.74822
1620.60172
1612.43938
1604.26798
1596.09372
1587.92228
1579.75887
1571.60826
1563.47482
1555.36255
1547.27507
1539.21572
1531.18754
1523.19328
1515.23546
1507.31635
1499.43801
1491.60232
1483.81095
1476.06541
1468.36707
1460.71713
1453.11668
1445.56666
1438.06791
1430.62117
1423.22708
1415.88617
1408.59891
1401.36567
1394.18679
1387.06249
1379.99296
1372.97834
1366.01869
1359.11405
1352.26440
1345.46969
1338.72982
1332.04466
1325.41405
1318.83781
