   0.00000
 209.24458
 394.32882
 558.33847
 703.87843
 833.16614
 948.10307
1050.33009
1141.27108
1222.16748
1294.10615
1358.04206
1414.81688
1465.17450
1509.77393
1549.20029
1583.97409
1614.55921
1641.36969
1664.77569
1685.10857
1702.66541
1717.71283
1730.49043
1741.21381
1750.07714
1757.25549
1762.90691
1767.17417
1770.18642
1772.06056
1772.90249
1772.80829
1771.86514
1770.15222
1767.74155
1764.69861
1761.08305
1756.94921
1752.34661
1747.32046
1741.91200
1736.15892
1730.09564
1723.75365
1717.16175
1710.34630
1703.33142
1696.13921
1688.78993
1681.30212
1673.69280
1665.97757
1658.17073
1650.28539
1642.33360
1634.32638
1626.27386
1618.18534
1610.06932
1601.93363
1593.78541
1585.63123
1577.47711
1569.32855
1561.19059
1553.06783
1544.96450
1536.88443
1528.83114
1520.80783
1512.81742
1504.86254
1496.94561
1489.06879
1481.23406
1473.44320
1465.69780
1457.99929
1450.34896
1442.74795
1435.19725
1427.69778
1420.25030
1412.85549
1405.51393
1398.22611
1390.99246
1383.81330
1376.68890
1369.61948
1362.60517
1355.64607
1348.74222
1341.89362
1335.10023
1328.36195
1321.67866
1315.05022
1308.47643
1301.95709
