   0.00000
 209.60497
 395.70156
 561.25401
 708.75981
 840.34294
 957.82414
1062.77496
1156.56000
1240.37032
1315.25231
1382.12624
1441.80530
1495.01213
1542.38715
1584.50274
1621.86932
1654.94323
1684.13439
1709.81017
1732.30056
1751.90301
1768.88552
1783.48977
1795.93405
1806.41564
1815.11313
1822.18832
1827.78787
1832.04490
1835.08027
1837.00387
1837.91563
1837.90655
1837.05952
1835.45015
1833.14738
1830.21414
1826.70794
1822.68132
1818.18235
1813.25508
1807.93978
1802.27336
1796.28961
1790.01955
1783.49169
1776.73212
1769.76478
1762.61173
1755.29321
1747.82777
1740.23250
1732.52314
1724.71412
1716.81871
1708.84915
1700.81666
1692.73158
1684.60343
1676.44093
1668.25215
1660.04445
1651.82465
1643.59899
1635.37318
1627.15253
1618.94184
1610.74556
1602.56774
1594.41212
1586.28208
1578.18076
1570.11098
1562.07535
1554.07622
1546.11573
1538.19584
1530.31831
1522.48474
1514.69654
1506.95503
1499.26135
1491.61652
1484.02147
1476.47699
1468.98379
1461.54248
1454.15359
1446.81756
1439.53478
