   0.00000
 209.35877
 394.77465
 559.29188
 705.47826
 835.51917
 951.28872
1054.40453
1146.27061
1228.11151
1301.00151
1365.88415
1423.59170
1474.86197
1520.34764
1560.63038
1596.22765
1627.60093
1655.16350
1679.28481
1700.29584
1718.49408
1734.14682
1747.49452
1758.75377
1768.11983
1775.76902
1781.86070
1786.53898
1789.93435
1792.16503
1793.33827
1793.55140
1792.89286
1791.44308
1789.27522
1786.45590
1783.04583
1779.10036
1774.66998
1769.80081
1764.53501
1758.91111
1752.96429
1746.72677
1740.22806
1733.49521
1726.55297
1719.42400
1712.12913
1704.68745
1697.11644
1689.43218
1681.64942
1673.78168
1665.84139
1657.83996
1649.78785
1641.69468
1633.56929
1625.41974
1617.25352
1609.07740
1600.89766
1592.72003
1584.54976
1576.39167
1568.25015
1560.12925
1552.03263
1543.96367
1535.92542
1527.92067
1519.95196
1512.02160
1504.13168
1496.28407
1488.48050
1480.72249
1473.01142
1465.34852
1457.73489
1450.17149
1442.65917
1435.19870
1427.79071
1420.43577
1413.13434
1405.88683
1398.69355
1391.55477
