   0.84484
   0.82281
   0.80124
   0.78021
   0.75974
   0.73986
   0.72059
   0.70195
   0.68394
   0.66655
   0.64978
   0.63362
   0.61806
   0.60308
   0.58867
   0.57480
   0.56145
   0.54862
   0.53627
   0.52438
   0.51294
   0.50193
   0.49133
   0.48112
   0.47128
   0.46180
   0.45266
   0.44385
   0.43534
   0.42713
   0.41921
   0.41155
   0.40415
   0.39699
   0.39007
   0.38338
   0.37690
   0.37062
   0.36454
   0.35865
   0.35294
   0.34740
   0.34203
   0.33681
   0.33174
   0.32682
   0.32204
   0.31740
   0.31288
   0.30848
   0.30421
   0.30004
   0.29599
   0.29204
   0.28820
   0.28445
   0.28080
   0.27724
   0.27376
   0.27037
   0.26706
   0.26383
   0.26068
   0.25760
   0.25459
   0.25165
   0.24877
   0.24596
   0.24321
   0.24053
   0.23790
   0.23532
   0.23280
   0.23034
   0.22792
   0.22556
   0.22324
   0.22097
   0.21874
   0.21656
   0.21442
   0.21232
   0.21027
   0.20825
   0.20627
   0.20433
   0.20242
   0.20055
   0.19871
   0.19691
   0.19514
