   1.00624
   0.97781
   0.94995
   0.92273
   0.89623
   0.87048
   0.84551
   0.82136
   0.79802
   0.77551
   0.75382
   0.73294
   0.71286
   0.69356
   0.67501
   0.65720
   0.64009
   0.62366
   0.60789
   0.59274
   0.57820
   0.56423
   0.55081
   0.53792
   0.52553
   0.51361
   0.50215
   0.49112
   0.48050
   0.47028
   0.46044
   0.45095
   0.44180
   0.43297
   0.42446
   0.41624
   0.40830
   0.40063
   0.39321
   0.38605
   0.37911
   0.37240
   0.36591
   0.35961
   0.35352
   0.34761
   0.34188
   0.33632
   0.33093
   0.32569
   0.32061
   0.31567
   0.31087
   0.30621
   0.30167
   0.29726
   0.29297
   0.28879
   0.28473
   0.28077
   0.27691
   0.27315
   0.26948
   0.26591
   0.26242
   0.25902
   0.25571
   0.25247
   0.24931
   0.24622
   0.24321
   0.24026
   0.23738
   0.23457
   0.23182
   0.22913
   0.22649
   0.22392
   0.22140
   0.21893
   0.21652
   0.21416
   0.21184
   0.20958
   0.20735
   0.20518
   0.20304
   0.20095
   0.19890
   0.19689
   0.19492
   0.19299
   0.19109
   0.18923
   0.18740
   0.18561
   0.18385
   0.18212
   0.18042
   0.17875
   0.17711
