   0.99152
   0.96566
   0.94036
   0.91567
   0.89165
   0.86832
   0.84572
   0.82384
   0.80271
   0.78231
   0.76263
   0.74367
   0.72541
   0.70784
   0.69092
   0.67465
   0.65899
   0.64392
   0.62943
   0.61549
   0.60206
   0.58914
   0.57671
   0.56472
   0.55318
   0.54206
   0.53133
   0.52099
   0.51101
   0.50137
   0.49207
   0.48309
   0.47440
   0.46601
   0.45789
   0.45003
   0.44243
   0.43506
   0.42793
   0.42101
   0.41431
   0.40781
   0.40150
   0.39538
   0.38944
   0.38366
   0.37805
   0.37260
   0.36729
   0.36214
   0.35712
   0.35223
   0.34748
   0.34284
   0.33833
   0.33393
   0.32965
   0.32547
   0.32139
   0.31741
   0.31353
   0.30974
   0.30603
   0.30242
   0.29889
   0.29544
   0.29206
   0.28876
   0.28554
   0.28238
   0.27930
   0.27627
   0.27332
   0.27042
   0.26759
   0.26481
   0.26209
   0.25943
   0.25681
   0.25425
   0.25174
   0.24928
   0.24687
   0.24450
   0.24218
   0.23990
   0.23766
   0.23546
   0.23331
   0.23119
   0.22911
   0.22707
   0.22506
   0.22309
   0.22115
   0.21925
   0.21738
   0.21554
   0.21373
   0.21195
   0.21020
