  67.37000
  68.80533
  70.36912
  72.06398
  73.89019
  75.84626
  77.92943
  80.13606
  82.46203
  84.90602
  87.46944
  90.13952
  92.92250
  95.80751
  98.79859
 101.88415
 105.07244
 108.35187
 111.72033
 115.18106
 118.72794
 122.35780
 126.06895
 129.85971
 133.72858
 137.67522
 141.69593
 145.78920
 149.95355
 154.18758
 158.48992
 162.85927
 167.29436
 171.79431
 176.35887
 180.98588
 185.67430
 190.42311
 195.23135
 200.09812
 205.02306
 210.00682
 215.04662
 220.14172
 225.29141
 230.49702
 235.75663
 241.06882
 246.43307
 251.85164
 257.32100
 262.84066
 268.41243
 274.03415
 279.70465
 285.42593
 291.19566
 297.01295
 302.88018
 308.79399
 314.75536
 320.76423
 326.81859
 332.92089
 339.06807
 345.26140
 351.50002
 357.78330
 364.11205
 370.48422
 376.90186
 383.36213
 389.86722
 396.41463
 403.00602
 409.63945
 416.31619
 423.03459
 429.79576
 436.59813
 443.44283
 450.32819
 457.25556
 464.22299
 471.23217
 478.28104
 485.37097
 492.50050
 499.67030
 506.87968
 514.12856
 521.41702
 528.74421
 536.11100
 543.51604
 550.96013
 558.44246
 565.96302
 573.52191
 581.11833
 588.75302
