   0.00000
 209.35876
 394.77459
 559.29176
 705.47806
 835.51888
 951.28835
1054.40407
1146.27006
1228.11087
1301.00079
1365.88336
1423.59084
1474.86104
1520.34666
1560.62934
1596.22656
1627.59981
1655.16234
1679.28362
1700.29462
1718.49284
1734.14557
1747.49326
1758.75250
1768.11855
1775.76774
1781.85942
1786.53770
1789.93307
1792.16376
1793.33701
1793.55015
1792.89163
1791.44186
1789.27401
1786.45471
1783.04465
1779.09920
1774.66884
1769.79969
1764.53391
1758.91002
1752.96322
1746.72573
1740.22704
1733.49421
1726.55199
1719.42304
1712.12819
1704.68653
1697.11555
1689.43130
1681.64857
1673.78085
1665.84057
1657.83917
1649.78707
1641.69393
1633.56855
1625.41903
1617.25282
1609.07673
1600.89700
1592.71940
1584.54914
1576.39107
1568.24957
1560.12869
1552.03209
1543.96314
1535.92491
1527.92017
1519.95149
1512.02114
1504.13123
1496.28365
1488.48010
1480.72210
1473.01105
1465.34816
1457.73454
1450.17115
1442.65886
1435.19840
1427.79042
1420.43550
1413.13408
1405.88658
1398.69332
1391.55455
