   0.00000
 209.38939
 394.88970
 559.53493
 705.88392
 836.11431
 952.09351
1055.43338
1147.53306
1229.61300
1302.74408
1367.86706
1425.81192
1477.31468
1523.02661
1563.52831
1599.33645
1630.91196
1658.66777
1682.97312
1704.15894
1722.52276
1738.33199
1751.82728
1763.22544
1772.72203
1780.49365
1786.69998
1791.48545
1794.98088
1797.30483
1798.56488
1798.85867
1798.27496
1796.89447
1794.79068
1792.03047
1788.67484
1784.77938
1780.39485
1775.56759
1770.33998
1764.75076
1758.83533
1752.62610
1746.15273
1739.44248
1732.52023
1725.40880
1718.12917
1710.70057
1703.14060
1695.46545
1687.69001
1679.82789
1671.89161
1663.89270
1655.84169
1647.74830
1639.62144
1631.46925
1623.29928
1615.11838
1606.93289
1598.74860
1590.57080
1582.40439
1574.25380
1566.12311
1558.01605
1549.93602
1541.88612
1533.86918
1525.88778
1517.94425
1510.04071
1502.17908
1494.36110
1486.58831
1478.86214
1471.18382
1463.55448
1455.97511
1448.44658
1440.96966
1433.54501
1426.17322
1418.85477
1411.59007
1404.37945
1397.22319
