  67.79106
  69.43892
  71.20744
  73.09523
  75.10046
  77.22095
  79.45425
  81.79771
  84.24853
  86.80382
  89.46064
  92.21607
  95.06718
  98.01114
 101.04514
 104.16651
 107.37263
 110.66102
 114.02926
 117.47510
 120.99634
 124.59092
 128.25688
 131.99235
 135.79556
 139.66485
 143.59861
 147.59536
 151.65365
 155.77216
 159.94958
 164.18472
 168.47641
 172.82357
 177.22516
 181.68018
 186.18770
 190.74683
 195.35671
 200.01653
 204.72551
 209.48292
 214.28805
 219.14021
 224.03876
 228.98309
 233.97259
 239.00669
 244.08485
 249.20653
 254.37124
 259.57847
 264.82776
 270.11866
 275.45073
 280.82354
 286.23669
 291.68978
 297.18243
 302.71427
 308.28494
 313.89410
 319.54140
 325.22653
 330.94916
 336.70898
 342.50571
 348.33903
 354.20868
 360.11437
 366.05584
 372.03283
 378.04507
 384.09233
 390.17435
 396.29090
 402.44176
 408.62668
 414.84545
 421.09786
 427.38369
 433.70274
 440.05481
 446.43968
 452.85718
 459.30711
 465.78929
 472.30353
 478.84965
 485.42747
 492.03683
 498.67756
 505.34948
 512.05244
 518.78626
 525.55081
 532.34593
 539.17145
 546.02723
 552.91313
 559.82900
