   0.95770
   0.93133
   0.90545
   0.88012
   0.85539
   0.83133
   0.80796
   0.78531
   0.76339
   0.74221
   0.72178
   0.70208
   0.68310
   0.66484
   0.64728
   0.63039
   0.61415
   0.59854
   0.58355
   0.56914
   0.55529
   0.54198
   0.52918
   0.51688
   0.50505
   0.49366
   0.48271
   0.47216
   0.46201
   0.45223
   0.44280
   0.43372
   0.42495
   0.41650
   0.40834
   0.40046
   0.39284
   0.38549
   0.37838
   0.37150
   0.36484
   0.35840
   0.35216
   0.34612
   0.34027
   0.33459
   0.32909
   0.32375
   0.31857
   0.31354
   0.30865
   0.30391
   0.29930
   0.29481
   0.29045
   0.28621
   0.28208
   0.27807
   0.27416
   0.27035
   0.26664
   0.26302
   0.25950
   0.25606
   0.25271
   0.24944
   0.24624
   0.24313
   0.24009
   0.23712
   0.23422
   0.23138
   0.22861
   0.22590
   0.22326
   0.22067
   0.21814
   0.21566
   0.21323
   0.21086
   0.20854
   0.20626
   0.20403
   0.20185
   0.19971
   0.19762
   0.19557
   0.19355
   0.19158
   0.18964
   0.18775
   0.18588
   0.18406
   0.18226
   0.18051
   0.17878
   0.17708
   0.17542
   0.17378
   0.17218
   0.17060
