   0.00000
 209.31832
 394.60509
 558.92079
 704.84839
 834.58641
 950.02006
1052.77645
1144.26779
1225.72585
1298.22949
1362.72717
1420.05535
1470.95380
1516.07839
1556.01185
1591.27300
1622.32454
1649.57982
1673.40866
1694.14240
1712.07826
1727.48327
1740.59754
1751.63728
1760.79734
1768.25355
1774.16474
1778.67446
1781.91267
1783.99706
1785.03433
1785.12129
1784.34589
1782.78803
1780.52041
1777.60919
1774.11463
1770.09170
1765.59048
1760.65673
1755.33222
1749.65511
1743.66031
1737.37974
1730.84261
1724.07567
1717.10343
1709.94833
1702.63094
1695.17015
1687.58324
1679.88609
1672.09326
1664.21813
1656.27294
1648.26896
1640.21651
1632.12508
1624.00336
1615.85934
1607.70033
1599.53306
1591.36367
1583.19781
1575.04064
1566.89689
1558.77089
1550.66660
1542.58761
1534.53723
1526.51846
1518.53403
1510.58642
1502.67789
1494.81047
1486.98601
1479.20617
1471.47244
1463.78615
1456.14851
1448.56056
1441.02326
1433.53741
1426.10375
1418.72289
1411.39536
1404.12161
1396.90201
1389.73687
1382.62641
1375.57082
1368.57021
1361.62466
1354.73417
1347.89873
1341.11828
1334.39270
1327.72188
1321.10564
1314.54379
