   0.00000
 209.37403
 394.83196
 559.41294
 705.68029
 835.81553
 951.68944
1054.91675
1146.89906
1228.85887
1301.86878
1366.87093
1424.69647
1476.08232
1521.68046
1562.07201
1597.77406
1629.24782
1656.90638
1681.11911
1702.21695
1720.49741
1736.22785
1749.64883
1760.97704
1770.40788
1778.11784
1784.26641
1788.99788
1792.44290
1794.71985
1795.93615
1796.18929
1795.56786
1794.15244
1792.01634
1789.22633
1785.84325
1781.92256
1777.51491
1772.66650
1767.41962
1761.81289
1755.88162
1749.65810
1743.17194
1736.45027
1729.51791
1722.39761
1715.11027
1707.67505
1700.10949
1692.42971
1684.65056
1676.78557
1668.84724
1660.84703
1652.79544
1644.70213
1636.57597
1628.42509
1620.25698
1612.07846
1603.89584
1595.71488
1587.54084
1579.37860
1571.23255
1563.10677
1555.00495
1546.93047
1538.88641
1530.87559
1522.90056
1514.96364
1507.06694
1499.21235
1491.40161
1483.63624
1475.91766
1468.24708
1460.62564
1453.05429
1445.53391
1438.06526
1430.64898
1423.28566
1415.97576
1408.71970
1401.51780
1394.37033
