   0.00000
 191.02746
 361.49881
 513.92015
 650.40353
 772.74730
 882.49662
 980.98939
1069.39203
1148.72755
1219.90015
1283.70954
1340.86692
1392.00903
1437.70354
1478.46174
1514.74252
1546.95882
1575.48419
1600.65538
1622.77660
1642.12376
1658.94671
1673.47193
1685.90490
1696.43215
1705.22325
1712.43239
1718.19986
1722.65339
1725.90933
1728.07372
1729.24329
1729.50629
1728.94335
1727.62809
1725.62781
1723.00406
1719.81313
1716.10657
1711.93158
1707.33147
1702.34590
1697.01122
1691.36078
1685.42521
1679.23267
1672.80895
1666.17776
1659.36093
1652.37851
1645.24890
1637.98904
1630.61455
1623.13975
1615.57781
1607.94090
1600.24015
1592.48585
1584.68747
1576.85366
1568.99245
1561.11118
1553.21661
1545.31497
1537.41193
1529.51278
1521.62228
1513.74489
1505.88462
1498.04520
1490.23001
1482.44215
1474.68445
1466.95949
1459.26963
1451.61700
1444.00355
1436.43102
1428.90101
1421.41495
1413.97413
1406.57969
1399.23266
1391.93394
1384.68435
1377.48459
1370.33526
1363.23690
1356.18995
1349.19478
1342.25171
1335.36097
1328.52276
1321.73721
1315.00439
1308.32436
1301.69711
1295.12258
1288.60072
1282.13140
