   0.00000
 209.35867
 394.77426
 559.29107
 705.47690
 835.51718
 951.28605
1054.40113
1146.26646
1228.10659
1300.99582
1365.87771
1423.58451
1474.85406
1520.33903
1560.62109
1596.21771
1627.59038
1655.15237
1679.27312
1700.28363
1718.48138
1734.13366
1747.48094
1758.73978
1768.10546
1775.75431
1781.84566
1786.52364
1789.91873
1792.14915
1793.32215
1793.53507
1792.87633
1791.42637
1789.25834
1786.43887
1783.02866
1779.08306
1774.65258
1769.78331
1764.51742
1758.89344
1752.94655
1746.70897
1740.21021
1733.47732
1726.53505
1719.40605
1712.11115
1704.66946
1697.09844
1689.41417
1681.63142
1673.76368
1665.82340
1657.82198
1649.76989
1641.67674
1633.55137
1625.40186
1617.23566
1609.05958
1600.87987
1592.70229
1584.53205
1576.37401
1568.23254
1560.11168
1552.01511
1543.94620
1535.90799
1527.90330
1519.93464
1512.00434
1504.11447
1496.26692
1488.46341
1480.70546
1472.99445
1465.33161
1457.71803
1450.15469
1442.64244
1435.18203
1427.77410
1420.41922
1413.11785
1405.87041
1398.67719
1391.53847
