   0.80785
   0.78677
   0.76615
   0.74604
   0.72646
   0.70746
   0.68903
   0.67121
   0.65398
   0.63736
   0.62132
   0.60587
   0.59099
   0.57667
   0.56289
   0.54962
   0.53686
   0.52459
   0.51278
   0.50141
   0.49047
   0.47995
   0.46981
   0.46005
   0.45064
   0.44158
   0.43284
   0.42441
   0.41627
   0.40842
   0.40084
   0.39352
   0.38645
   0.37960
   0.37299
   0.36659
   0.36039
   0.35439
   0.34858
   0.34294
   0.33748
   0.33218
   0.32704
   0.32205
   0.31721
   0.31251
   0.30793
   0.30349
   0.29917
   0.29497
   0.29088
   0.28690
   0.28302
   0.27925
   0.27557
   0.27199
   0.26850
   0.26509
   0.26177
   0.25853
   0.25536
   0.25227
   0.24926
   0.24631
   0.24344
   0.24062
   0.23787
   0.23519
   0.23256
   0.22999
   0.22747
   0.22501
   0.22260
   0.22024
   0.21794
   0.21567
   0.21346
   0.21129
   0.20916
   0.20707
   0.20503
   0.20302
   0.20106
   0.19913
   0.19723
   0.19538
   0.19355
   0.19176
   0.19001
   0.18828
   0.18659
