  67.37000
  69.06871
  70.89020
  72.83282
  74.89452
  77.07290
  79.36532
  81.76891
  84.28074
  86.89775
  89.61690
  92.43514
  95.34948
  98.35698
 101.45481
 104.64022
 107.91056
 111.26332
 114.69608
 118.20653
 121.79251
 125.45193
 129.18282
 132.98334
 136.85170
 140.78625
 144.78539
 148.84765
 152.97159
 157.15589
 161.39926
 165.70052
 170.05850
 174.47213
 178.94039
 183.46228
 188.03689
 192.66332
 197.34073
 202.06832
 206.84531
 211.67099
 216.54463
 221.46558
 226.43320
 231.44685
 236.50597
 241.60997
 246.75831
 251.95048
 257.18597
 262.46428
 267.78497
 273.14757
 278.55165
 283.99679
 289.48258
 295.00864
 300.57457
 306.18003
 311.82464
 317.50806
 323.22996
 328.99001
 334.78790
 340.62331
 346.49596
 352.40554
 358.35179
 364.33441
 370.35315
 376.40774
 382.49792
 388.62346
 394.78410
 400.97960
 407.20975
 413.47430
 419.77305
 426.10577
 432.47225
 438.87228
 445.30567
 451.77220
 458.27170
 464.80397
 471.36881
 477.96606
 484.59552
 491.25703
 497.95040
 504.67547
 511.43208
 518.22005
 525.03922
 531.88945
 538.77058
 545.68244
 552.62490
 559.59780
 566.60100
