   0.00000
 209.45090
 395.12098
 560.02393
 706.70081
 837.31374
 953.71674
1057.51012
1150.08324
1232.64822
1306.26908
1371.88087
1430.30891
1482.28556
1528.45914
1569.40803
1605.64727
1637.63659
1665.78815
1690.47077
1712.01518
1730.71897
1746.84977
1760.64856
1772.33263
1782.09806
1790.12203
1796.56484
1801.57159
1805.27374
1807.79053
1809.23018
1809.69099
1809.26236
1808.02562
1806.05483
1803.41748
1800.17508
1796.38378
1792.09482
1787.35503
1782.20725
1776.69064
1770.84103
1764.69120
1758.27120
1751.60862
1744.72868
1737.65452
1730.40739
1723.00682
1715.47066
1707.81535
1700.05602
1692.20650
1684.27950
1676.28677
1668.23902
1660.14613
1652.01718
1643.86047
1635.68369
1627.49384
1619.29738
1611.10022
1602.90778
1594.72505
1586.55656
1578.40652
1570.27872
1562.17666
1554.10352
1546.06221
1538.05537
1530.08541
1522.15452
1514.26467
1506.41766
1498.61510
1490.85845
1483.14900
1475.48793
1467.87626
1460.31491
1452.80469
1445.34630
1437.94036
1430.58738
1423.28781
1416.04201
1408.85028
