  67.37000
  68.82996
  70.41701
  72.13365
  73.98009
  75.95480
  78.05502
  80.27712
  82.61700
  85.07332
  87.64746
  90.32681
  93.11750
  96.00881
  99.00470
 102.09374
 105.28405
 108.56422
 111.93212
 115.39099
 118.93476
 122.56029
 126.26594
 130.05001
 133.91103
 137.84867
 141.85927
 145.94132
 150.09337
 154.31402
 158.60192
 162.95576
 167.37431
 171.85669
 176.40263
 181.01001
 185.67778
 190.40494
 195.19053
 200.03365
 204.93394
 209.89207
 214.90525
 219.97274
 225.09385
 230.26990
 235.49898
 240.77966
 246.11145
 251.49657
 256.93153
 262.41583
 267.95128
 273.53572
 279.16799
 284.85008
 290.57967
 296.35587
 302.18107
 308.05190
 313.96934
 319.93334
 325.94188
 331.99744
 338.09693
 344.24164
 350.43071
 356.66350
 362.94085
 369.26067
 375.62504
 382.03112
 388.48111
 394.97247
 401.50692
 408.08248
 414.70045
 421.35916
 428.05973
 434.80058
 441.58288
 448.40492
 455.26808
 462.17039
 469.11358
 476.09553
 483.11768
 490.17851
 497.27874
 504.41767
 511.59520
 518.81145
 526.06552
 533.35835
 540.68853
 548.05691
 555.46265
 562.90574
 570.38633
 577.90354
 585.45821
