   0.00000
 202.29123
 382.34935
 542.90133
 686.24990
 814.35923
 928.91926
1031.39468
1123.06314
1205.04517
1278.33037
1343.79322
1402.21032
1454.27527
1500.60537
1541.75488
1578.21996
1610.44583
1638.83381
1663.74461
1685.50307
1704.40279
1720.70875
1734.66041
1746.47433
1756.34652
1764.45458
1770.95956
1776.00755
1779.73120
1782.25099
1783.67648
1784.10731
1783.63419
1782.33978
1780.29939
1777.58171
1774.24940
1770.35968
1765.96480
1761.11254
1755.84662
1750.20702
1744.23029
1737.94993
1731.39662
1724.59853
1717.58140
1710.36886
1702.98262
1695.44258
1687.76697
1679.97255
1672.07474
1664.08763
1656.02419
1647.89636
1639.71504
1631.49029
1623.23132
1614.94657
1606.64384
1598.33023
1590.01226
1581.69595
1573.38676
1565.08973
1556.80945
1548.55012
1540.31559
1532.10936
1523.93464
1515.79432
1507.69105
1499.62725
1491.60508
1483.62650
1475.69331
1467.80709
1459.96928
1452.18114
1444.44383
1436.75835
1429.12558
1421.54631
1414.02120
1406.55083
1399.13568
1391.77617
1384.47263
1377.22532
1370.03444
1362.90012
1355.82246
1348.80148
1341.83717
1334.92948
1328.07832
1321.28354
1314.54499
1307.86247
