<?xml version="1.0" encoding="UTF-8" standalone="no"?>
<!-- Created with Inkscape (http://www.inkscape.org/) -->

<svg
   width="179.37584mm"
   height="15.006388mm"
   viewBox="0 0 179.37584 15.006388"
   version="1.1"
   id="svg1"
   inkscape:version="1.3 (0e150ed6c4, 2023-07-21)"
   sodipodi:docname="logos.svg"
   inkscape:export-filename="logos.png"
   inkscape:export-xdpi="600"
   inkscape:export-ydpi="600"
   xml:space="preserve"
   xmlns:inkscape="http://www.inkscape.org/namespaces/inkscape"
   xmlns:sodipodi="http://sodipodi.sourceforge.net/DTD/sodipodi-0.dtd"
   xmlns="http://www.w3.org/2000/svg"
   xmlns:svg="http://www.w3.org/2000/svg"><sodipodi:namedview
     id="namedview1"
     pagecolor="#ffffff"
     bordercolor="#000000"
     borderopacity="0.25"
     inkscape:showpageshadow="2"
     inkscape:pageopacity="0.0"
     inkscape:pagecheckerboard="false"
     inkscape:deskcolor="#d1d1d1"
     inkscape:document-units="mm"
     inkscape:zoom="2.0060301"
     inkscape:cx="338.97796"
     inkscape:cy="28.414329"
     inkscape:window-width="1920"
     inkscape:window-height="1010"
     inkscape:window-x="2873"
     inkscape:window-y="-6"
     inkscape:window-maximized="1"
     inkscape:current-layer="svg1"
     showgrid="true"
     inkscape:clip-to-page="true"><inkscape:grid
       id="grid10"
       units="mm"
       originx="-2.1807731"
       originy="-170.07874"
       spacingx="0.99999997"
       spacingy="1"
       empcolor="#0099e5"
       empopacity="0.30196078"
       color="#0099e5"
       opacity="0.14901961"
       empspacing="5"
       dotted="false"
       gridanglex="30"
       gridanglez="30"
       visible="true"
       enabled="true" /></sodipodi:namedview><defs
     id="defs1"><clipPath
       clipPathUnits="userSpaceOnUse"
       id="clipPath1"><rect
         style="fill:#000000;fill-opacity:0.5;stroke:#ff0000;stroke-width:0.4;stroke-linejoin:round;stroke-dasharray:2.4, 2.4"
         id="rect2"
         width="45"
         height="13"
         x="9.999999"
         y="45.999992" /></clipPath></defs><g
     id="g1"
     transform="matrix(0.32691981,0,0,0.32691981,62.076757,-0.22347974)"><path
       fill-rule="nonzero"
       fill="#8fbae5"
       fill-opacity="1"
       d="m 302.50391,27.796875 h 2.05078 c 1.96093,0 3.01562,0.996094 3.01562,2.988281 0,2.320313 -1.17578,3.226563 -3.25781,3.226563 h -1.80859 z m -4.34766,18.34375 h 4.34766 V 37.03125 h 2.32031 c 1.75,0 2.5039,1.023438 2.5664,2.714844 l 0.1211,4.132812 c 0.0273,0.84375 0.12109,1.660157 0.54297,2.261719 h 4.70703 v -0.179687 c -0.81641,-0.421875 -0.9375,-1.597657 -0.96485,-3.859375 -0.0625,-4.558594 -0.51562,-6.1875 -3.47265,-6.582032 v -0.05859 c 2.44531,-0.515625 3.59375,-2.445313 3.59375,-5.3125 0,-3.679688 -2.17578,-5.550782 -5.73438,-5.550782 h -8.02734 v 21.542969"
       id="path1" /><path
       fill-rule="nonzero"
       fill="#8fbae5"
       fill-opacity="1"
       d="M 234.09375,24.597656 V 39.625 c 0,5.761719 3.34766,6.941406 6.87891,6.941406 3.53125,0 6.88281,-1.449218 6.88281,-6.941406 V 24.597656 h -4.34766 V 39.625 c 0,2.140625 -0.51172,3.742188 -2.53515,3.742188 -2.01954,0 -2.53516,-1.601563 -2.53516,-3.742188 V 24.597656 h -4.34375"
       id="path2" /><path
       fill-rule="nonzero"
       fill="#8fbae5"
       fill-opacity="1"
       d="m 248.91797,24.597656 v 21.542969 h 3.98047 V 31.054688 h 0.0625 l 5.30859,15.085937 h 4.95313 V 24.597656 h -3.98438 v 14.753907 h -0.0586 l -5.25391,-14.753907 h -5.00781"
       id="path3" /><path
       fill-rule="nonzero"
       fill="#8fbae5"
       fill-opacity="1"
       d="m 264.33984,46.140625 h 4.34375 V 24.597656 h -4.34375 z m 0,0"
       id="path4" /><path
       fill-rule="nonzero"
       fill="#8fbae5"
       fill-opacity="1"
       d="m 268.98047,24.597656 4.94922,21.542969 h 5.58203 l 4.94922,-21.542969 h -4.4961 l -3.19922,15.933594 h -0.0898 l -3.04687,-15.933594 h -4.64844"
       id="path5" /><path
       fill-rule="nonzero"
       fill="#8fbae5"
       fill-opacity="1"
       d="m 284.84766,24.597656 v 21.542969 h 12.34375 v -3.558594 h -8 v -5.792968 h 7.24609 v -3.5625 h -7.24609 v -5.066407 h 7.69531 v -3.5625 h -12.03906"
       id="path6" /><path
       fill-rule="nonzero"
       fill="#8fbae5"
       fill-opacity="1"
       d="m 312.27734,39.414063 v 0.875 c 0,3.984375 1.9336,6.277343 6.85157,6.277343 4.70703,0 7.48046,-2.054687 7.48046,-6.609375 0,-2.625 -0.84375,-4.285156 -4.10156,-5.703125 l -3.35156,-1.449218 c -1.83984,-0.785157 -2.23047,-1.597657 -2.23047,-2.925782 0,-1.269531 0.51172,-2.507812 2.47266,-2.507812 1.66015,0 2.35547,1.179687 2.35547,3.199219 h 4.16406 V 29.96875 c 0,-4.136719 -2.8086,-5.792969 -6.67188,-5.792969 -4.10156,0 -6.66797,2.140625 -6.66797,6.335938 0,3.589844 1.78125,5.191406 5.64454,6.519531 2.86718,0.996094 3.86328,1.71875 3.86328,3.679688 0,1.808593 -1.26953,2.65625 -2.59766,2.65625 -2.29297,0 -2.86719,-1.296875 -2.86719,-3.320313 v -0.632812 h -4.34375"
       id="path7" /><path
       fill-rule="nonzero"
       fill="#8fbae5"
       fill-opacity="1"
       d="m 327.17969,46.140625 h 4.34375 V 24.597656 h -4.34375 z m 0,0"
       id="path8" /><path
       fill-rule="nonzero"
       fill="#8fbae5"
       fill-opacity="1"
       d="m 354.09375,24.597656 -3.01953,8.328125 h -0.0586 l -2.83593,-8.328125 h -16.08594 v 3.5625 h 4.70703 v 17.980469 h 4.34375 V 28.160156 h 3.66797 l 4.05859,9.503907 v 8.476562 h 4.34766 v -8.476562 l 5.58203,-13.066407 h -4.70703"
       id="path9" /><path
       fill-rule="nonzero"
       fill="#00539f"
       fill-opacity="1"
       d="m 195.92187,22.636719 h -7.19921 V 0.996094 h 11.80859 c 3.19922,0 5.96094,2.070312 6.86328,4.820312 0.83203,2.546875 0.12109,5.3125 -1.76172,7.28125 0.25,0.679688 0.4961,1.207032 0.72656,1.816407 0.52344,1.207031 1,2.410156 1.52344,3.601562 l 1.71485,4.121094 h -7.30079 c 0,0.0039 -0.0625,-0.171875 -0.11718,-0.246094 -0.28907,-0.636719 -0.55078,-1.320312 -0.84375,-1.960937 l -1.75391,-4.164063 c -0.69922,-1.683594 -1.39453,-3.277344 -2.08984,-4.957031 0.86718,-0.02344 1.51953,0.136719 2.35547,-0.25 0.58984,-0.289063 1.48437,-1.007813 1.50781,-2.390625 -0.0234,-0.6875 -0.21094,-1.207031 -0.66797,-1.746094 -0.45313,-0.5 -1.10938,-0.875 -1.96875,-0.886719 h -2.79688 v 16.601563"
       id="path10" /><path
       fill-rule="nonzero"
       fill="#00539f"
       fill-opacity="1"
       d="m 271.12891,0.996094 v 21.640625 h -7.19922 V 13.8125 h -5.04297 v 8.824219 c -1.30469,0 -2.71094,-0.01563 -4.01953,0 H 251.6875 V 6.003906 h -5.03516 v 16.632813 h -7.20312 V 6.003906 h -5.07813 v 16.632813 h -7.41797 c -1.28906,-3.121094 -2.65234,-6.269531 -3.91796,-9.375 -0.14454,-0.652344 -0.28907,-1.308594 -0.47657,-1.945313 V 22.636719 H 215.125 c -1.47266,-3.425781 -2.88672,-6.78125 -4.35547,-10.257813 -0.50781,-1.203125 -0.92578,-2.183593 -1.45312,-3.4375 l -0.0742,-0.160156 -1.14063,-2.6875 -1.64062,-3.835937 c -0.14453,-0.433594 -0.375,-0.828125 -0.51953,-1.261719 h 7.41406 c 1.52344,3.699219 3.0625,7.359375 4.66015,11 l 0.043,0.08984 C 218,11.664063 217.86719,11.125 217.79687,10.722656 V 4.261719 c 0.0156,-1.03125 0,-2.207031 0,-3.265625 h 7.42969 c 0.0937,0.234375 0.14453,0.363281 0.21875,0.550781 0.8711,2.046875 1.69922,4.078125 2.57031,6.113281 l 1.94532,4.425782 c -0.0469,-0.464844 -0.14844,-0.914063 -0.20313,-1.363282 V 0.996094 h 29.12891 v 7.808594 h 5.04297 V 0.996094 h 7.19922"
       id="path11" /><path
       fill-rule="nonzero"
       fill="#88b5e4"
       fill-opacity="1"
       d="m 296.83203,0.992188 h -5.39453 l -4.51563,17.0625 -4.51562,-17.0625 h -5.39844 l -5.72656,21.644531 h 4.54687 l 1,-4.578125 h 5.76172 l 0.9961,4.578125 h 6.66797 l 1,-4.578125 h 5.76171 l 1,4.578125 h 4.54688 z m -19.24609,13.492187 2.08984,-9.730469 h 0.0625 l 2.08984,9.730469 z m 14.42578,0 2.09375,-9.730469 h 0.0586 l 2.09375,9.730469 h -4.24609"
       id="path12" /><path
       fill-rule="nonzero"
       fill="#8fbae5"
       fill-opacity="1"
       d="m 315.5625,8.378906 c 0,-3.136718 -0.45313,-7.695312 -6.66797,-7.695312 -6.51953,0 -7.33594,4.648437 -7.33594,11.195312 0,6.546875 0.81641,11.195313 7.33594,11.195313 5.70313,0 6.84766,-4.011719 6.84766,-8.660156 h -4.34375 c 0,4.648437 -1.14844,5.460937 -2.71485,5.460937 -1.87109,0 -2.77734,-1.175781 -2.77734,-7.695312 0,-6.09375 0.51172,-8.296875 2.71484,-8.296875 1.96094,0 2.59766,1.359375 2.59766,4.496093 h 4.34375"
       id="path13" /><path
       fill-rule="nonzero"
       fill="#8fbae5"
       fill-opacity="1"
       d="m 316.60156,22.636719 h 4.36328 V 13.03125 h 5.09375 v 9.605469 h 4.36328 V 0.996094 h -4.36328 v 8.273437 h -5.09375 V 0.996094 h -4.36328 v 21.640625"
       id="path14" /><path
       fill-rule="nonzero"
       fill="#8fbae5"
       fill-opacity="1"
       d="m 331.36719,0.992188 v 21.644531 h 12.40234 v -3.578125 h -8.03516 v -5.820313 h 7.27735 V 9.664063 h -7.27735 v -5.09375 h 7.73047 V 0.992188 h -12.09765"
       id="path15" /><path
       fill-rule="nonzero"
       fill="#8fbae5"
       fill-opacity="1"
       d="m 344.41406,0.996094 v 21.640625 h 4.00391 V 7.484375 h 0.0586 l 5.33594,15.152344 h 4.96875 V 0.996094 h -4 v 14.820312 h -0.0586 L 349.44531,0.996094 h -5.03125"
       id="path16" /><path
       fill-rule="nonzero"
       fill="#00539f"
       fill-opacity="1"
       d="m 174.05078,46.320313 h 1 V 0.96875 h -1 z m 0,0"
       id="path17" /><path
       fill-rule="nonzero"
       fill="#00539f"
       fill-opacity="1"
       d="m 22.34375,12.148438 h 0.125 v 16.640625 h -3.847656 l -2.617188,7.433593 H 22.46875 V 46.320313 H 32.824219 V 0.96875 h -15.4375 L 0.171875,46.320313 H 10.273438 L 22.34375,12.148438"
       id="path18" /><path
       fill-rule="nonzero"
       fill="#00539f"
       fill-opacity="1"
       d="m 36.738281,46.320313 h 9.972657 V 0.96875 h -9.972657 z m 0,0"
       id="path19" /><path
       fill-rule="nonzero"
       fill="#00539f"
       fill-opacity="1"
       d="m 61.109375,12.148438 h -0.125 v 16.640625 h 3.847656 l 2.617188,7.433593 H 60.984375 V 46.320313 H 50.628906 V 0.96875 h 15.4375 L 83.28125,46.320313 H 73.179688 L 61.109375,12.148438"
       id="path20" /><path
       fill-rule="nonzero"
       fill="#00539f"
       fill-opacity="1"
       d="m 90.898438,46.320313 h 1.320312 v -5.699219 h 0.01953 l 1.269532,5.699219 h 1.121093 l 1.269532,-5.699219 h 0.01953 v 5.699219 h 1.320312 v -7.140625 h -2.132812 l -1.027344,5.042968 h -0.01953 L 93.035156,39.179688 H 90.898438 Z M 102.23047,43.84375 v -0.3125 c 0,-0.414062 -0.0273,-0.789062 -0.082,-1.125 -0.0547,-0.335937 -0.15235,-0.621094 -0.30078,-0.859375 -0.14453,-0.238281 -0.34766,-0.421875 -0.60547,-0.550781 -0.25391,-0.128906 -0.58203,-0.195313 -0.98438,-0.195313 -0.464841,0 -0.839841,0.07813 -1.117185,0.230469 -0.28125,0.152344 -0.496094,0.359375 -0.648437,0.621094 -0.148438,0.261719 -0.25,0.554687 -0.296875,0.890625 -0.05078,0.332031 -0.07813,0.679687 -0.07813,1.039062 0,0.332032 0.01563,0.671875 0.04687,1.015625 0.03125,0.339844 0.109375,0.652344 0.246093,0.929688 0.132813,0.277344 0.339844,0.503906 0.617188,0.675781 0.28125,0.171875 0.671875,0.257813 1.171876,0.257813 0.66016,0 1.14453,-0.167969 1.44922,-0.503907 0.30469,-0.335937 0.47265,-0.820312 0.5,-1.445312 h -1.23828 c -0.043,0.339844 -0.11328,0.59375 -0.22266,0.757812 -0.10547,0.167969 -0.27734,0.25 -0.50781,0.25 -0.12891,0 -0.234377,-0.03125 -0.320315,-0.101562 -0.08594,-0.07031 -0.15625,-0.164063 -0.210937,-0.28125 -0.05469,-0.117188 -0.08984,-0.25 -0.113282,-0.398438 C 99.511719,44.585938 99.5,44.429688 99.5,44.269531 V 43.84375 Z M 99.5,43.019531 V 42.8125 c 0,-0.128906 0.01172,-0.253906 0.03516,-0.382812 0.02344,-0.125 0.05859,-0.242188 0.113282,-0.34375 0.05469,-0.101563 0.125,-0.1875 0.214843,-0.25 0.08984,-0.0625 0.207025,-0.09375 0.347655,-0.09375 0.13672,0 0.2539,0.02734 0.34375,0.08594 0.0898,0.05469 0.16015,0.140625 0.21094,0.25 0.0469,0.109375 0.082,0.242188 0.10156,0.398438 0.0234,0.15625 0.0352,0.335937 0.043,0.542968 z m 7.44922,-0.136718 c 0,-0.640625 -0.16406,-1.148438 -0.48438,-1.519532 -0.32421,-0.375 -0.80468,-0.5625 -1.44531,-0.5625 -0.32031,0 -0.61328,0.04297 -0.8789,0.128907 -0.26954,0.08984 -0.5,0.242187 -0.69141,0.457031 -0.19531,0.21875 -0.34375,0.507812 -0.44922,0.871094 -0.10937,0.363281 -0.16016,0.820312 -0.16016,1.375 0,0.539062 0.043,0.992187 0.12891,1.355468 0.0859,0.363282 0.21484,0.652344 0.38672,0.867188 0.16797,0.21875 0.38281,0.375 0.63672,0.464844 0.25781,0.09375 0.55859,0.140625 0.90625,0.140625 0.73437,0 1.25781,-0.191407 1.57422,-0.570313 0.3164,-0.378906 0.47656,-0.921875 0.47656,-1.628906 h -1.32031 c 0,0.441406 -0.0547,0.757812 -0.16016,0.960937 -0.10547,0.199219 -0.27734,0.296875 -0.50781,0.296875 -0.15625,0 -0.28125,-0.03125 -0.375,-0.101562 -0.0977,-0.07031 -0.17578,-0.183594 -0.22656,-0.335938 -0.0547,-0.152343 -0.0898,-0.347656 -0.10938,-0.585937 -0.0195,-0.238281 -0.0312,-0.519531 -0.0312,-0.855469 0,-0.304687 0.0117,-0.578125 0.0312,-0.808594 0.0195,-0.234375 0.0547,-0.425781 0.10938,-0.574218 0.0508,-0.152344 0.1289,-0.265625 0.23437,-0.339844 0.10156,-0.07813 0.24219,-0.117188 0.41406,-0.117188 0.12891,0 0.23047,0.03125 0.31641,0.09375 0.082,0.06641 0.14453,0.148438 0.19141,0.25 0.043,0.105469 0.0703,0.222657 0.0898,0.351563 0.0156,0.128906 0.0234,0.257812 0.0234,0.386719 z m 0.78906,3.4375 h 1.37891 V 42.75 c 0,-0.589844 0.24219,-0.886719 0.73047,-0.886719 0.20703,0 0.35547,0.05469 0.44922,0.164063 0.0937,0.109375 0.14062,0.304687 0.14062,0.585937 v 3.707032 h 1.37891 v -3.988282 c 0,-0.539062 -0.11719,-0.929687 -0.35547,-1.167968 -0.23438,-0.242188 -0.57422,-0.363282 -1.01563,-0.363282 -0.60547,0 -1.04297,0.230469 -1.30859,0.691407 h -0.0195 v -2.3125 h -1.37891 z m 6.26563,-3.726563 v -0.152344 c 0,-0.210937 0.0508,-0.382812 0.16015,-0.511718 0.10547,-0.125 0.26563,-0.1875 0.48047,-0.1875 0.23047,0 0.39453,0.05859 0.49219,0.175781 0.0977,0.117187 0.14453,0.277344 0.14453,0.484375 0,0.179687 -0.0391,0.316406 -0.11719,0.410156 -0.082,0.09375 -0.22656,0.167969 -0.42968,0.21875 l -0.78125,0.210938 c -0.23829,0.06641 -0.44532,0.140625 -0.61329,0.230468 -0.17187,0.08594 -0.3125,0.195313 -0.42187,0.324219 -0.10938,0.128906 -0.19141,0.285156 -0.24609,0.46875 -0.0547,0.183594 -0.0781,0.402344 -0.0781,0.65625 0,0.179688 0.0234,0.363281 0.0703,0.546875 0.0469,0.179688 0.11719,0.34375 0.21875,0.492188 0.10157,0.148437 0.23438,0.269531 0.39844,0.359375 0.16797,0.09375 0.37109,0.140625 0.61328,0.140625 0.33203,0 0.60156,-0.04687 0.8125,-0.140625 0.21094,-0.08984 0.39453,-0.277344 0.55469,-0.558594 h 0.0195 c 0.0234,0.09375 0.043,0.1875 0.0664,0.285156 0.0234,0.09766 0.0586,0.1875 0.10547,0.273438 h 1.32031 c -0.0664,-0.15625 -0.11328,-0.308594 -0.13672,-0.449219 -0.0234,-0.140625 -0.0352,-0.335938 -0.0352,-0.589844 v -2.828125 c 0,-0.242187 -0.0234,-0.464844 -0.0742,-0.664062 -0.0508,-0.207032 -0.14453,-0.378907 -0.28515,-0.527344 C 116.10152,41.113281 115.9023,41 115.6484,40.921875 c -0.25781,-0.07813 -0.58985,-0.121094 -0.9961,-0.121094 -0.25781,0 -0.5039,0.02734 -0.73437,0.08594 -0.23047,0.05469 -0.42969,0.152344 -0.60156,0.28125 -0.16797,0.128906 -0.30469,0.300781 -0.40235,0.511719 -0.10156,0.214843 -0.15234,0.476562 -0.15234,0.78125 v 0.132812 z m 1.27734,2.097656 c 0,0.152344 -0.0234,0.28125 -0.0781,0.386719 -0.0547,0.101563 -0.1211,0.1875 -0.20704,0.253906 -0.082,0.06641 -0.17187,0.113282 -0.27343,0.144532 -0.10157,0.03125 -0.19532,0.04297 -0.28907,0.04297 -0.1875,0 -0.32031,-0.07031 -0.40234,-0.21875 -0.0781,-0.144531 -0.11719,-0.320312 -0.11719,-0.53125 0,-0.238281 0.0586,-0.425781 0.17969,-0.566406 0.12109,-0.140625 0.32031,-0.242187 0.59766,-0.300781 0.0859,-0.01953 0.18359,-0.05078 0.29297,-0.09766 0.10546,-0.04297 0.20312,-0.101563 0.29687,-0.171875 z m 2.32813,1.628907 h 1.3789 V 42.75 c 0,-0.589844 0.24219,-0.886719 0.73047,-0.886719 0.20703,0 0.35547,0.05469 0.44922,0.164063 0.0937,0.109375 0.14062,0.304687 0.14062,0.585937 v 3.707032 h 1.37891 v -3.988282 c 0,-0.539062 -0.11719,-0.929687 -0.35547,-1.167968 -0.23437,-0.242188 -0.57422,-0.363282 -1.01562,-0.363282 -0.29688,0 -0.56641,0.0625 -0.79688,0.1875 -0.23437,0.121094 -0.42578,0.316407 -0.57031,0.582032 h -0.0195 v -0.628907 h -1.32031 z m 5.07812,-6.039063 h 1.37891 v -1.179687 h -1.37891 z m 0,6.039063 h 1.37891 v -5.378907 h -1.37891 z m 6.32812,-3.4375 c 0,-0.640625 -0.16406,-1.148438 -0.48828,-1.519532 -0.32422,-0.375 -0.80468,-0.5625 -1.4414,-0.5625 -0.32031,0 -0.61719,0.04297 -0.88281,0.128907 -0.26563,0.08984 -0.4961,0.242187 -0.6875,0.457031 -0.19532,0.21875 -0.34375,0.507812 -0.45313,0.871094 -0.10547,0.363281 -0.16016,0.820312 -0.16016,1.375 0,0.539062 0.043,0.992187 0.13282,1.355468 0.0859,0.363282 0.21484,0.652344 0.38281,0.867188 0.17187,0.21875 0.38281,0.375 0.64062,0.464844 0.25782,0.09375 0.5586,0.140625 0.90625,0.140625 0.73047,0 1.25782,-0.191407 1.57422,-0.570313 0.31641,-0.378906 0.47656,-0.921875 0.47656,-1.628906 h -1.32031 c 0,0.441406 -0.0547,0.757812 -0.16015,0.960937 -0.10938,0.199219 -0.27735,0.296875 -0.51172,0.296875 -0.15235,0 -0.27735,-0.03125 -0.375,-0.101562 -0.0977,-0.07031 -0.17188,-0.183594 -0.22266,-0.335938 -0.0547,-0.152343 -0.0898,-0.347656 -0.11328,-0.585937 -0.0195,-0.238281 -0.0273,-0.519531 -0.0273,-0.855469 0,-0.304687 0.008,-0.578125 0.0273,-0.808594 0.0234,-0.234375 0.0586,-0.425781 0.11328,-0.574218 0.0508,-0.152344 0.12891,-0.265625 0.23438,-0.339844 0.10156,-0.07813 0.23828,-0.117188 0.41406,-0.117188 0.125,0 0.23047,0.03125 0.31641,0.09375 0.082,0.06641 0.14453,0.148438 0.1875,0.25 0.043,0.105469 0.0742,0.222657 0.0898,0.351563 0.0156,0.128906 0.0273,0.257812 0.0273,0.386719 z m 0.59375,1.679687 V 44.75 c 0,0.261719 0.0273,0.496094 0.0898,0.707031 0.0586,0.210938 0.16406,0.390625 0.3125,0.539063 0.15234,0.148437 0.35156,0.265625 0.60547,0.347656 0.2539,0.07813 0.57812,0.117188 0.97265,0.117188 0.28516,0 0.55078,-0.03516 0.79688,-0.105469 0.24609,-0.06641 0.46094,-0.175781 0.63672,-0.3125 0.17578,-0.140625 0.3164,-0.316406 0.41406,-0.53125 0.10156,-0.214844 0.15234,-0.460938 0.15234,-0.742188 0,-0.40625 -0.0937,-0.726562 -0.27343,-0.964843 -0.17969,-0.234375 -0.48438,-0.425782 -0.91797,-0.574219 l -0.83203,-0.277344 c -0.23047,-0.07422 -0.39063,-0.164062 -0.47266,-0.273437 -0.0859,-0.105469 -0.125,-0.226563 -0.125,-0.359375 0,-0.191407 0.0625,-0.335938 0.19531,-0.433594 0.12891,-0.09766 0.28125,-0.144531 0.45313,-0.144531 0.22656,0 0.38672,0.0625 0.47656,0.195312 0.0898,0.128906 0.13281,0.332031 0.13281,0.613281 h 1.24219 v -0.21875 c 0,-0.488281 -0.15234,-0.863281 -0.44922,-1.128906 -0.30078,-0.269531 -0.76562,-0.402344 -1.39062,-0.402344 -0.35547,0 -0.65625,0.04297 -0.90625,0.128907 -0.25,0.08984 -0.45313,0.203125 -0.61329,0.351562 -0.16015,0.148438 -0.27734,0.320313 -0.35156,0.515625 -0.0742,0.195313 -0.10937,0.40625 -0.10937,0.625 0,0.378906 0.0937,0.691406 0.28906,0.933594 0.19531,0.246094 0.48047,0.433594 0.85937,0.566406 l 0.97266,0.347656 c 0.13281,0.05469 0.25,0.125 0.34766,0.21875 0.10156,0.08984 0.15234,0.21875 0.15234,0.394532 0,0.210937 -0.0664,0.371093 -0.19141,0.480468 -0.1289,0.105469 -0.29687,0.15625 -0.51171,0.15625 -0.23047,0 -0.41016,-0.07031 -0.53516,-0.214843 -0.12109,-0.140625 -0.18359,-0.328125 -0.18359,-0.5625 V 44.5625 h -1.23829"
       id="path21" /><path
       fill-rule="nonzero"
       fill="#00539f"
       fill-opacity="1"
       d="m 92.058594,31.253906 v -0.148437 c 0,-0.214844 0.05078,-0.382813 0.160156,-0.511719 0.105469,-0.125 0.265625,-0.191406 0.476563,-0.191406 0.234375,0 0.398437,0.05859 0.496093,0.175781 0.09766,0.117188 0.144532,0.277344 0.144532,0.484375 0,0.179688 -0.03906,0.316406 -0.117188,0.410156 -0.08203,0.09375 -0.226562,0.167969 -0.433594,0.21875 l -0.777343,0.210938 c -0.242188,0.07031 -0.445313,0.144531 -0.617188,0.230469 -0.167969,0.08984 -0.308594,0.195312 -0.417969,0.324218 -0.109375,0.132813 -0.191406,0.289063 -0.246093,0.472657 -0.05078,0.179687 -0.07813,0.398437 -0.07813,0.652343 0,0.179688 0.02344,0.363282 0.07031,0.546875 0.04687,0.183594 0.117188,0.347657 0.21875,0.492188 0.09766,0.148437 0.234375,0.269531 0.398438,0.363281 0.167968,0.08984 0.371093,0.136719 0.609375,0.136719 0.335937,0 0.605468,-0.04687 0.816406,-0.136719 0.210937,-0.09375 0.394531,-0.28125 0.554687,-0.5625 h 0.01953 c 0.01953,0.09375 0.04297,0.1875 0.06641,0.285156 0.02344,0.09766 0.05859,0.1875 0.105469,0.277344 h 1.320312 c -0.06641,-0.160156 -0.113281,-0.3125 -0.136719,-0.449219 -0.02344,-0.140625 -0.03516,-0.339843 -0.03516,-0.59375 v -2.828125 c 0,-0.242187 -0.02344,-0.460937 -0.07422,-0.664062 -0.05078,-0.203125 -0.144531,-0.378906 -0.285156,-0.527344 -0.140625,-0.144531 -0.335937,-0.257812 -0.59375,-0.339844 -0.257812,-0.07813 -0.589844,-0.117187 -0.996094,-0.117187 -0.261718,0 -0.503906,0.02734 -0.734375,0.08203 -0.230468,0.05859 -0.429687,0.152344 -0.601562,0.28125 -0.167969,0.128906 -0.304688,0.300781 -0.402344,0.515625 -0.101562,0.210938 -0.152344,0.472656 -0.152344,0.777344 v 0.132812 z m 1.277344,2.101563 c 0,0.148437 -0.02734,0.28125 -0.07813,0.382812 -0.05469,0.105469 -0.121094,0.1875 -0.207032,0.253907 -0.08203,0.06641 -0.171875,0.117187 -0.273437,0.144531 -0.101563,0.03125 -0.199219,0.04687 -0.289063,0.04687 -0.1875,0 -0.320312,-0.07422 -0.402343,-0.21875 -0.07813,-0.148438 -0.117188,-0.324219 -0.117188,-0.53125 0,-0.242188 0.05859,-0.429688 0.179688,-0.570313 0.117187,-0.140625 0.320312,-0.242187 0.597656,-0.300781 0.08984,-0.01953 0.183594,-0.05078 0.289062,-0.09375 0.109375,-0.04297 0.207032,-0.101562 0.300782,-0.175781 z m 2.324218,1.628906 h 1.382813 v -3.570312 c 0,-0.59375 0.242187,-0.890625 0.730469,-0.890625 0.203125,0 0.355468,0.05469 0.449218,0.164062 0.09375,0.109375 0.140625,0.304688 0.140625,0.585938 v 3.710937 h 1.378907 v -3.992187 c 0,-0.539063 -0.121094,-0.929688 -0.355469,-1.167969 -0.238281,-0.242188 -0.574219,-0.359375 -1.015625,-0.359375 -0.300781,0 -0.566406,0.0625 -0.800781,0.183594 -0.230469,0.121093 -0.421875,0.320312 -0.566407,0.585937 h -0.02344 v -0.628906 h -1.320313 z m 7.824224,0 h 1.32031 V 27.84375 h -1.37891 v 2.261719 h -0.0234 c -0.14453,-0.214844 -0.30859,-0.375 -0.49218,-0.484375 -0.1836,-0.105469 -0.40625,-0.15625 -0.66797,-0.15625 -0.56641,0 -0.98047,0.21875 -1.25,0.664062 -0.26563,0.441407 -0.39844,1.164063 -0.39844,2.164063 0,1 0.13281,1.722656 0.39844,2.164062 0.26953,0.445313 0.68359,0.664063 1.25,0.664063 0.28125,0 0.51562,-0.05469 0.70703,-0.164063 0.19141,-0.109375 0.35937,-0.289062 0.51562,-0.542968 h 0.0195 z m -1.375,-4.015625 c 0.0898,-0.296875 0.28515,-0.445312 0.58593,-0.445312 0.30469,0 0.50391,0.148437 0.59375,0.445312 0.0898,0.296875 0.13672,0.738281 0.13672,1.324219 0,0.585937 -0.0469,1.027344 -0.13672,1.324219 -0.0898,0.296875 -0.28906,0.445312 -0.59375,0.445312 -0.30078,0 -0.49609,-0.148437 -0.58593,-0.445312 -0.0898,-0.296875 -0.13672,-0.738282 -0.13672,-1.324219 0,-0.585938 0.0469,-1.027344 0.13672,-1.324219 m 10.50781,-0.714844 c 0,-0.261718 -0.0156,-0.539062 -0.0547,-0.835937 -0.0352,-0.296875 -0.12891,-0.570313 -0.27344,-0.828125 -0.14843,-0.257813 -0.36718,-0.46875 -0.66797,-0.636719 -0.29296,-0.167969 -0.69921,-0.25 -1.21484,-0.25 -0.53906,0 -0.96875,0.09375 -1.28906,0.277344 -0.32031,0.179687 -0.5625,0.4375 -0.73438,0.761719 -0.16797,0.328125 -0.28125,0.71875 -0.32812,1.175781 -0.0508,0.457031 -0.0781,0.953125 -0.0781,1.496094 0,0.539062 0.0273,1.035156 0.0781,1.496093 0.0469,0.453125 0.16015,0.84375 0.32812,1.171875 0.17188,0.328125 0.41407,0.582032 0.73438,0.765625 0.32031,0.183594 0.75,0.273438 1.28906,0.273438 0.47656,0 0.85938,-0.07422 1.15625,-0.226563 0.29688,-0.15625 0.52734,-0.363281 0.69141,-0.625 0.16406,-0.265625 0.27343,-0.570312 0.33593,-0.914062 0.0586,-0.351563 0.0898,-0.714844 0.0898,-1.101563 h -1.44141 c 0,0.386719 -0.0234,0.695313 -0.0703,0.933594 -0.0469,0.238281 -0.10938,0.421875 -0.19141,0.550781 -0.0781,0.128907 -0.17187,0.214844 -0.28515,0.257813 -0.10938,0.04687 -0.22657,0.06641 -0.35157,0.06641 -0.15625,0 -0.28906,-0.03125 -0.40625,-0.09375 -0.11718,-0.0625 -0.21484,-0.1875 -0.28906,-0.371094 -0.0781,-0.183593 -0.13281,-0.441406 -0.17187,-0.773437 -0.0352,-0.335938 -0.0547,-0.769531 -0.0547,-1.3125 0,-0.507813 0.0156,-0.933594 0.0391,-1.28125 0.0273,-0.351563 0.0742,-0.632813 0.14063,-0.851563 0.0664,-0.21875 0.16015,-0.375 0.27343,-0.46875 0.11719,-0.09766 0.26563,-0.148437 0.44532,-0.148437 0.32812,0 0.55468,0.117187 0.67578,0.355469 0.125,0.238281 0.1875,0.617187 0.1875,1.136718 z M 113.5,34.984375 h 1.37891 v -3.570312 c 0,-0.59375 0.24218,-0.890625 0.73047,-0.890625 0.20703,0 0.35937,0.05469 0.44921,0.164062 0.0937,0.109375 0.14063,0.304688 0.14063,0.585938 v 3.710937 h 1.37891 v -3.992187 c 0,-0.539063 -0.11719,-0.929688 -0.35157,-1.167969 -0.23828,-0.242188 -0.57812,-0.359375 -1.01562,-0.359375 -0.60938,0 -1.04297,0.226562 -1.3125,0.6875 h -0.0195 V 27.84375 H 113.5 Z m 6.26563,-3.730469 v -0.148437 c 0,-0.214844 0.0547,-0.382813 0.16015,-0.511719 0.10547,-0.125 0.26563,-0.191406 0.48047,-0.191406 0.23438,0 0.39844,0.05859 0.49609,0.175781 0.0937,0.117188 0.14454,0.277344 0.14454,0.484375 0,0.179688 -0.0391,0.316406 -0.1211,0.410156 -0.0781,0.09375 -0.22265,0.167969 -0.42969,0.21875 l -0.78125,0.210938 c -0.23828,0.07031 -0.44531,0.144531 -0.61328,0.230469 -0.17187,0.08984 -0.3125,0.195312 -0.42187,0.324218 -0.10938,0.132813 -0.19141,0.289063 -0.24219,0.472657 -0.0547,0.179687 -0.082,0.398437 -0.082,0.652343 0,0.179688 0.0234,0.363282 0.0703,0.546875 0.0469,0.183594 0.1211,0.347657 0.21875,0.492188 0.10156,0.148437 0.23438,0.269531 0.40235,0.363281 0.16796,0.08984 0.36718,0.136719 0.60937,0.136719 0.33203,0 0.60547,-0.04687 0.81641,-0.136719 0.20703,-0.09375 0.39453,-0.28125 0.55468,-0.5625 h 0.0195 c 0.0195,0.09375 0.043,0.1875 0.0625,0.285156 0.0234,0.09766 0.0586,0.1875 0.10546,0.277344 h 1.32032 c -0.0664,-0.160156 -0.10938,-0.3125 -0.13282,-0.449219 -0.0234,-0.140625 -0.0352,-0.339843 -0.0352,-0.59375 v -2.828125 c 0,-0.242187 -0.0273,-0.460937 -0.0781,-0.664062 -0.0469,-0.203125 -0.14453,-0.378906 -0.28125,-0.527344 -0.14062,-0.144531 -0.33984,-0.257812 -0.59765,-0.339844 -0.25782,-0.07813 -0.58594,-0.117187 -0.9961,-0.117187 -0.25781,0 -0.5039,0.02734 -0.73437,0.08203 -0.23047,0.05859 -0.42969,0.152344 -0.59766,0.28125 -0.17187,0.128906 -0.30469,0.300781 -0.40625,0.515625 -0.10156,0.210938 -0.14844,0.472656 -0.14844,0.777344 v 0.132812 z m 1.28125,2.101563 c 0,0.148437 -0.0273,0.28125 -0.082,0.382812 -0.0508,0.105469 -0.12109,0.1875 -0.20312,0.253907 -0.082,0.06641 -0.17578,0.117187 -0.27734,0.144531 -0.0977,0.03125 -0.19532,0.04687 -0.28907,0.04687 -0.1875,0 -0.32031,-0.07422 -0.39843,-0.21875 -0.082,-0.148438 -0.1211,-0.324219 -0.1211,-0.53125 0,-0.242188 0.0586,-0.429688 0.17969,-0.570313 0.12109,-0.140625 0.32031,-0.242187 0.60156,-0.300781 0.0859,-0.01953 0.1836,-0.05078 0.28906,-0.09375 0.10547,-0.04297 0.20704,-0.101562 0.30079,-0.175781 z m 2.35546,-4.414063 h 1.38282 v -1.179687 h -1.38282 z m 0,6.042969 h 1.38282 v -5.378906 h -1.38282 z m 2.38282,0 h 1.38281 v -3.230469 c 0,-0.179687 0.0273,-0.332031 0.0898,-0.457031 0.0586,-0.121094 0.14063,-0.222656 0.23828,-0.300781 0.10157,-0.07422 0.21094,-0.128906 0.33204,-0.164063 0.11718,-0.03125 0.23828,-0.04687 0.35937,-0.04687 0.0742,0 0.14453,0 0.21484,0.0039 0.0703,0.0039 0.14063,0.0078 0.21485,0.01563 v -1.320313 c -0.0391,-0.0078 -0.082,-0.01172 -0.125,-0.01563 -0.043,-0.0039 -0.0859,-0.0039 -0.125,-0.0039 -0.28907,0 -0.53125,0.07813 -0.73047,0.234375 -0.19922,0.15625 -0.37109,0.363281 -0.50781,0.625 h -0.0234 v -0.71875 h -1.32031 z m 5.61718,-1.449219 c 0.0664,0.351563 0.17969,0.648438 0.33985,0.886719 0.16015,0.242188 0.375,0.421875 0.64843,0.535156 0.27344,0.117188 0.61719,0.171875 1.03125,0.164063 0.39454,0 0.72266,-0.05859 0.99219,-0.183594 0.27344,-0.121094 0.49219,-0.300781 0.65625,-0.539062 0.16797,-0.238282 0.28906,-0.53125 0.35938,-0.886719 0.0742,-0.351563 0.10937,-0.757813 0.10937,-1.21875 0,-0.46875 -0.0312,-0.878906 -0.0977,-1.234375 -0.0664,-0.359375 -0.17969,-0.65625 -0.33985,-0.894531 -0.16015,-0.242188 -0.375,-0.417969 -0.65234,-0.535157 -0.26953,-0.117187 -0.61328,-0.171875 -1.02735,-0.164062 -0.39453,0 -0.72656,0.0625 -0.99609,0.183594 -0.26953,0.121093 -0.48828,0.300781 -0.65625,0.539062 -0.16406,0.238281 -0.28516,0.535156 -0.35937,0.886719 -0.0703,0.351562 -0.10938,0.757812 -0.10938,1.21875 0,0.472656 0.0352,0.886719 0.10156,1.242187 m 1.29688,-2 c 0.0156,-0.234375 0.0469,-0.433593 0.0977,-0.601562 0.0508,-0.167969 0.125,-0.296875 0.21875,-0.390625 0.0977,-0.09375 0.23047,-0.140625 0.40625,-0.140625 0.27735,0 0.47266,0.148437 0.57813,0.441406 0.10937,0.292969 0.16016,0.777344 0.16016,1.449219 0,0.675781 -0.0508,1.15625 -0.16016,1.449219 -0.10547,0.292968 -0.30078,0.441406 -0.57813,0.441406 -0.17578,0 -0.30859,-0.04687 -0.40625,-0.140625 -0.0937,-0.09375 -0.16796,-0.222656 -0.21875,-0.390625 -0.0508,-0.167969 -0.082,-0.367188 -0.0977,-0.597656 -0.0117,-0.234375 -0.0195,-0.488282 -0.0195,-0.761719 0,-0.273438 0.008,-0.527344 0.0195,-0.757813 m 3.96484,3.449219 h 1.38281 v -4.441406 h 0.80079 v -0.9375 h -0.80079 v -0.472656 c 0,-0.152344 0.0391,-0.261719 0.11719,-0.328125 0.082,-0.07031 0.21875,-0.101563 0.41016,-0.101563 h 0.13281 c 0.0586,0 0.10547,0.0039 0.14063,0.01172 v -0.980469 c -0.25391,-0.01953 -0.5,-0.03125 -0.74219,-0.03125 -0.21875,0 -0.41797,0.02344 -0.59766,0.06641 -0.18359,0.04297 -0.33203,0.113282 -0.45703,0.214844 -0.12109,0.09766 -0.21875,0.234375 -0.28516,0.398438 -0.0664,0.167968 -0.10156,0.371093 -0.10156,0.609375 v 0.613281 h -0.69922 v 0.9375 h 0.69922 z m 5.06641,0 h 1.4414 v -3.101562 h 2.39844 v -1.179688 h -2.39844 v -1.679687 h 2.55079 V 27.84375 h -3.99219 z m 4.71094,0 h 1.3789 V 27.84375 h -1.3789 z m 5.13671,0 h 1.32032 v -5.378906 h -1.37891 v 3.566406 c 0,0.59375 -0.24219,0.890625 -0.73047,0.890625 -0.20312,0 -0.35547,-0.05469 -0.44922,-0.164062 -0.0937,-0.109375 -0.14062,-0.304688 -0.14062,-0.585938 v -3.707031 h -1.37891 v 3.988281 c 0,0.539063 0.11719,0.929688 0.35547,1.167969 0.23438,0.242187 0.57422,0.359375 1.01563,0.359375 0.29687,0 0.5664,-0.05859 0.79687,-0.183594 0.23438,-0.121094 0.42578,-0.316406 0.57031,-0.582031 h 0.0195 z m 2.32422,-6.042969 h 1.37891 v -1.179687 h -1.37891 z m 0,6.042969 h 1.37891 v -5.378906 h -1.37891 z m 5.15235,0 H 160.375 V 27.84375 h -1.37891 v 2.261719 h -0.0195 c -0.14844,-0.214844 -0.3125,-0.375 -0.49609,-0.484375 -0.1836,-0.105469 -0.40625,-0.15625 -0.66406,-0.15625 -0.56641,0 -0.98438,0.21875 -1.25,0.664062 -0.26563,0.441407 -0.40235,1.164063 -0.40235,2.164063 0,1 0.13672,1.722656 0.40235,2.164062 0.26562,0.445313 0.68359,0.664063 1.25,0.664063 0.28125,0 0.51562,-0.05469 0.70312,-0.164063 0.19141,-0.109375 0.36328,-0.289062 0.51563,-0.542968 h 0.0195 z m -1.375,-4.015625 c 0.0898,-0.296875 0.28515,-0.445312 0.58593,-0.445312 0.3086,0 0.50391,0.148437 0.59375,0.445312 0.0898,0.296875 0.13672,0.738281 0.13672,1.324219 0,0.585937 -0.0469,1.027344 -0.13672,1.324219 -0.0898,0.296875 -0.28515,0.445312 -0.59375,0.445312 -0.30078,0 -0.49609,-0.148437 -0.58593,-0.445312 -0.0898,-0.296875 -0.13282,-0.738282 -0.13282,-1.324219 0,-0.585938 0.043,-1.027344 0.13282,-1.324219"
       id="path22" /><path
       fill-rule="nonzero"
       fill="#00539f"
       fill-opacity="1"
       d="m 93.136719,17.746094 h 0.01953 l 0.691406,3.207031 h -1.402343 z m -2.769531,5.898437 h 1.5 l 0.328125,-1.511718 h 1.902343 l 0.328125,1.511718 h 1.5 l -1.890625,-7.140625 h -1.777343 z m 9.996092,-2.480468 v -0.308594 c 0,-0.414063 -0.0273,-0.789063 -0.082,-1.125 -0.0508,-0.339844 -0.15234,-0.625 -0.296875,-0.859375 C 99.835938,18.632813 99.636719,18.449219 99.378906,18.320313 99.121094,18.191406 98.792969,18.125 98.394531,18.125 c -0.46875,0 -0.839843,0.07813 -1.121093,0.230469 -0.28125,0.152344 -0.496094,0.359375 -0.644532,0.621094 -0.152343,0.257812 -0.25,0.554687 -0.300781,0.886718 -0.05078,0.335938 -0.07422,0.683594 -0.07422,1.042969 0,0.332031 0.01563,0.671875 0.04297,1.015625 0.03125,0.339844 0.113281,0.652344 0.246094,0.929688 0.132812,0.273437 0.339844,0.5 0.621094,0.671875 0.277343,0.175781 0.667968,0.261718 1.167968,0.261718 0.660157,0 1.144532,-0.167968 1.449219,-0.503906 0.30859,-0.339844 0.47656,-0.820312 0.5,-1.445312 h -1.238281 c -0.03906,0.339843 -0.113281,0.589843 -0.21875,0.757812 -0.109375,0.167969 -0.277344,0.25 -0.511719,0.25 -0.125,0 -0.234375,-0.03516 -0.320312,-0.105469 -0.08594,-0.06641 -0.15625,-0.160156 -0.210938,-0.277343 -0.05078,-0.117188 -0.08984,-0.25 -0.113281,-0.402344 -0.02344,-0.148438 -0.03516,-0.304688 -0.03516,-0.464844 V 21.164063 Z M 97.632813,20.34375 v -0.210937 c 0,-0.125 0.01172,-0.25 0.03516,-0.378907 0.02344,-0.125 0.0625,-0.242187 0.113281,-0.34375 0.05469,-0.105468 0.125,-0.1875 0.214844,-0.25 0.09375,-0.0625 0.207031,-0.09375 0.347656,-0.09375 0.140625,0 0.253906,0.02734 0.34375,0.08203 0.08984,0.05859 0.160156,0.140625 0.210938,0.25 0.05078,0.109375 0.08594,0.242187 0.105468,0.402343 0.01953,0.15625 0.03125,0.335938 0.03906,0.542969 z m 3.531247,3.300781 h 1.37891 v -3.230468 c 0,-0.179688 0.0312,-0.332032 0.0898,-0.453125 0.0586,-0.125 0.14063,-0.222657 0.23828,-0.300782 0.10157,-0.07813 0.21094,-0.132812 0.33204,-0.164062 0.12109,-0.03516 0.23828,-0.05078 0.35937,-0.05078 0.0742,0 0.14453,0 0.21484,0.0039 0.0703,0.0039 0.14454,0.0078 0.21485,0.01563 v -1.320313 c -0.0391,-0.0078 -0.082,-0.01172 -0.125,-0.01563 -0.043,-0.0039 -0.0859,-0.0039 -0.125,-0.0039 -0.28516,0 -0.52735,0.07813 -0.73047,0.234375 -0.19922,0.15625 -0.36719,0.367188 -0.50781,0.625 h -0.0195 v -0.71875 h -1.32032 z m 3.38282,-1.449218 c 0.0664,0.351562 0.17968,0.648437 0.33984,0.890625 0.16016,0.238281 0.375,0.417968 0.64844,0.535156 0.27343,0.117187 0.61718,0.171875 1.03125,0.164062 0.39453,0 0.72265,-0.0625 0.99609,-0.183593 0.26953,-0.125 0.48828,-0.304688 0.65234,-0.542969 0.16797,-0.234375 0.28907,-0.53125 0.35938,-0.882813 0.0742,-0.355468 0.11328,-0.761718 0.11328,-1.222656 0,-0.464844 -0.0352,-0.875 -0.10156,-1.234375 -0.0664,-0.355469 -0.17969,-0.652344 -0.33985,-0.894531 -0.16015,-0.238281 -0.3789,-0.417969 -0.64843,-0.535156 -0.27735,-0.117188 -0.61719,-0.171875 -1.03125,-0.164063 -0.39453,0 -0.72657,0.0625 -0.9961,0.183594 -0.26953,0.125 -0.48828,0.304687 -0.65625,0.542969 -0.16406,0.234375 -0.28515,0.53125 -0.35937,0.882812 -0.0742,0.355469 -0.10938,0.761719 -0.10938,1.21875 0,0.472656 0.0352,0.890625 0.10157,1.242188 m 1.30078,-2 c 0.0117,-0.234375 0.043,-0.433594 0.0937,-0.601563 0.0508,-0.167969 0.12109,-0.296875 0.21875,-0.390625 0.0977,-0.08984 0.23047,-0.136719 0.40625,-0.136719 0.28125,0 0.47265,0.144532 0.57812,0.4375 0.10938,0.292969 0.16016,0.777344 0.16016,1.449219 0,0.675781 -0.0508,1.160156 -0.16016,1.453125 -0.10547,0.292969 -0.29687,0.4375 -0.57812,0.4375 -0.17578,0 -0.3086,-0.04687 -0.40625,-0.140625 -0.0977,-0.08984 -0.16797,-0.222656 -0.21875,-0.386719 -0.0508,-0.167968 -0.082,-0.367187 -0.0937,-0.601562 -0.0156,-0.234375 -0.0234,-0.488281 -0.0234,-0.761719 0,-0.273437 0.008,-0.527344 0.0234,-0.757812 m 6.40625,3.449218 h 1.32031 v -7.140625 h -1.37891 v 2.261719 h -0.0195 c -0.14844,-0.214844 -0.3125,-0.375 -0.49609,-0.480469 -0.1836,-0.109375 -0.40625,-0.160156 -0.66406,-0.160156 -0.57032,0 -0.98438,0.222656 -1.25,0.664063 -0.26954,0.445312 -0.40235,1.164062 -0.40235,2.164062 0,1 0.13281,1.722656 0.40235,2.167969 0.26562,0.441406 0.67968,0.664062 1.25,0.664062 0.27734,0 0.51171,-0.05469 0.70312,-0.164062 0.19141,-0.113281 0.35938,-0.292969 0.51563,-0.546875 h 0.0195 z m -1.375,-4.015625 c 0.0898,-0.296875 0.28515,-0.445312 0.58593,-0.445312 0.30469,0 0.50391,0.148437 0.59375,0.445312 0.0898,0.296875 0.13672,0.738282 0.13672,1.324219 0,0.589844 -0.0469,1.03125 -0.13672,1.328125 -0.0898,0.296875 -0.28906,0.445313 -0.59375,0.445313 -0.30078,0 -0.49609,-0.148438 -0.58593,-0.445313 -0.0898,-0.296875 -0.13672,-0.738281 -0.13672,-1.328125 0,-0.585937 0.0469,-1.027344 0.13672,-1.324219 m 3.71484,5.777344 h 0.55859 c 0.32032,0 0.58594,-0.02344 0.79688,-0.07031 0.20703,-0.04687 0.39062,-0.148438 0.53906,-0.296875 0.14844,-0.148438 0.30078,-0.417969 0.44922,-0.800782 0.15234,-0.382812 0.24609,-0.699218 0.28516,-0.953125 l 1.30078,-5.019531 h -1.37891 l -0.70312,3.71875 h -0.0195 l -0.80079,-3.71875 h -1.4375 l 1.50782,5.378906 c -0.0195,0.238282 -0.082,0.425782 -0.19532,0.558594 -0.10937,0.136719 -0.28906,0.203125 -0.54296,0.203125 -0.1211,0 -0.23829,-0.01172 -0.35938,-0.03125 z m 4.53516,-1.761719 h 1.3789 v -3.570312 c 0,-0.59375 0.24219,-0.890625 0.73047,-0.890625 0.20703,0 0.35547,0.05469 0.44922,0.167969 0.0937,0.109375 0.14063,0.304687 0.14063,0.582031 v 3.710937 h 1.3789 V 19.65625 c 0,-0.542969 -0.11719,-0.929687 -0.35547,-1.171875 -0.23437,-0.238281 -0.57422,-0.359375 -1.01172,-0.359375 -0.30078,0 -0.57031,0.0625 -0.80078,0.183594 -0.23437,0.125 -0.42578,0.320312 -0.57031,0.585937 h -0.0195 v -0.628906 h -1.32031 z m 6.26562,-3.730468 v -0.148438 c 0,-0.214844 0.0508,-0.382812 0.16016,-0.511719 0.10547,-0.125 0.26562,-0.1875 0.48047,-0.1875 0.23047,0 0.39843,0.05469 0.49218,0.171875 0.0977,0.117188 0.14844,0.277344 0.14844,0.488282 0,0.179687 -0.043,0.316406 -0.12109,0.40625 -0.082,0.09375 -0.22656,0.167968 -0.42969,0.222656 l -0.78125,0.210937 c -0.23828,0.06641 -0.44531,0.140625 -0.61328,0.230469 -0.17188,0.08594 -0.3125,0.191406 -0.42188,0.324219 -0.10937,0.128906 -0.1914,0.285156 -0.24609,0.46875 -0.0508,0.183594 -0.0781,0.402344 -0.0781,0.65625 0,0.179687 0.0234,0.359375 0.0703,0.542969 0.0469,0.183593 0.12109,0.347656 0.21875,0.496093 0.10156,0.144532 0.23437,0.265625 0.40234,0.359375 0.16406,0.09375 0.36719,0.140625 0.60938,0.140625 0.33203,0 0.60547,-0.04687 0.8125,-0.140625 0.21093,-0.09375 0.39453,-0.28125 0.55468,-0.558593 h 0.0234 c 0.0195,0.08984 0.0391,0.1875 0.0625,0.285156 0.0234,0.09766 0.0586,0.1875 0.10547,0.273437 h 1.32031 c -0.0664,-0.160156 -0.11328,-0.308593 -0.13672,-0.449218 -0.0234,-0.140625 -0.0352,-0.335938 -0.0352,-0.589844 v -2.832031 c 0,-0.238282 -0.0234,-0.460938 -0.0742,-0.664063 -0.0508,-0.203125 -0.14453,-0.378906 -0.28516,-0.523437 -0.14062,-0.148438 -0.33593,-0.261719 -0.59375,-0.339844 -0.25781,-0.08203 -0.58984,-0.121094 -0.99609,-0.121094 -0.25781,0 -0.50391,0.02734 -0.73438,0.08594 -0.23046,0.05469 -0.42968,0.148437 -0.59765,0.277343 -0.17188,0.132813 -0.3086,0.304688 -0.40625,0.515625 -0.10156,0.214844 -0.15235,0.472657 -0.15235,0.78125 v 0.128907 z m 1.28125,2.101562 c 0,0.152344 -0.0273,0.28125 -0.082,0.382813 -0.0547,0.105468 -0.12109,0.191406 -0.20312,0.257812 -0.0859,0.06641 -0.17579,0.113281 -0.27735,0.144531 -0.0977,0.02734 -0.19531,0.04297 -0.28906,0.04297 -0.1875,0 -0.32031,-0.07422 -0.39844,-0.21875 -0.082,-0.148437 -0.12109,-0.324219 -0.12109,-0.53125 0,-0.238281 0.0586,-0.429687 0.17969,-0.570312 0.12109,-0.140625 0.32031,-0.238282 0.60156,-0.296875 0.0859,-0.02344 0.17969,-0.05469 0.28906,-0.09766 0.10547,-0.04297 0.20313,-0.101562 0.30078,-0.175781 z M 129,23.644531 h 1.37891 v -3.539062 c 0,-0.320313 0.0664,-0.554688 0.19531,-0.699219 0.1289,-0.148437 0.30469,-0.222656 0.52344,-0.222656 0.19531,0 0.33203,0.0625 0.41796,0.179687 0.082,0.121094 0.125,0.292969 0.125,0.519532 v 3.761718 h 1.37891 v -3.539062 c 0,-0.320313 0.0664,-0.554688 0.19531,-0.699219 0.12891,-0.148437 0.30469,-0.222656 0.52344,-0.222656 0.19531,0 0.33203,0.0625 0.41406,0.179687 0.0859,0.121094 0.125,0.292969 0.125,0.519532 v 3.761718 h 1.38282 v -3.910156 c 0,-0.519531 -0.10938,-0.917969 -0.32422,-1.195312 -0.21875,-0.277344 -0.5586,-0.414063 -1.01563,-0.414063 -0.32812,0 -0.60937,0.07031 -0.84765,0.214844 -0.23438,0.144531 -0.40625,0.359375 -0.51172,0.644531 h -0.0234 c -0.0742,-0.28125 -0.21875,-0.492187 -0.43359,-0.640625 -0.21875,-0.144531 -0.48438,-0.21875 -0.80469,-0.21875 -0.30078,0 -0.5586,0.05078 -0.77344,0.160156 -0.21875,0.105469 -0.41406,0.28125 -0.58594,0.53125 h -0.0195 V 18.265625 H 129 Z m 7.65234,-6.039062 h 1.38282 v -1.179688 h -1.38282 z m 0,6.039062 h 1.38282 v -5.378906 h -1.38282 z m 6.32813,-3.441406 c 0,-0.636719 -0.16016,-1.144531 -0.48438,-1.519531 C 142.17187,18.3125 141.69141,18.125 141.05078,18.125 c -0.32031,0 -0.61328,0.04297 -0.87891,0.128906 -0.26953,0.08984 -0.49609,0.238282 -0.6914,0.457032 -0.19531,0.214843 -0.34375,0.507812 -0.44922,0.867187 -0.10547,0.363281 -0.16016,0.824219 -0.16016,1.375 0,0.542969 0.043,0.992188 0.12891,1.355469 0.0859,0.363281 0.21484,0.65625 0.38672,0.871094 0.16797,0.214843 0.38281,0.371093 0.63672,0.464843 0.25781,0.09375 0.5625,0.140625 0.90625,0.140625 0.73437,0 1.25781,-0.191406 1.57422,-0.570312 0.3164,-0.378906 0.47656,-0.921875 0.47656,-1.628906 h -1.32031 c 0,0.4375 -0.0547,0.757812 -0.16016,0.960937 -0.10547,0.199219 -0.27734,0.296875 -0.51172,0.296875 -0.15234,0 -0.27734,-0.03516 -0.375,-0.105469 -0.0937,-0.06641 -0.16797,-0.179687 -0.22266,-0.332031 -0.0547,-0.15625 -0.0898,-0.351562 -0.10937,-0.585937 -0.0195,-0.238282 -0.0312,-0.523438 -0.0312,-0.855469 0,-0.308594 0.0117,-0.578125 0.0312,-0.808594 0.0195,-0.234375 0.0547,-0.425781 0.10937,-0.578125 0.0547,-0.148437 0.13282,-0.261719 0.23438,-0.339844 0.10547,-0.07422 0.24219,-0.113281 0.41406,-0.113281 0.12891,0 0.23438,0.03125 0.31641,0.09375 0.082,0.0625 0.14844,0.148438 0.1914,0.25 0.043,0.105469 0.0703,0.222656 0.0898,0.351563 0.0156,0.128906 0.0234,0.257812 0.0234,0.382812 z m 0.59375,1.679688 v 0.191406 c 0,0.261719 0.0312,0.496094 0.0898,0.707031 0.0586,0.207031 0.16406,0.390625 0.31641,0.539063 0.14844,0.148437 0.35156,0.265625 0.60547,0.34375 0.2539,0.08203 0.57422,0.121093 0.96875,0.121093 0.28515,0 0.55468,-0.03516 0.80078,-0.105468 0.24609,-0.07031 0.45703,-0.175782 0.63281,-0.316407 0.17578,-0.136718 0.31641,-0.316406 0.41406,-0.527343 0.10157,-0.214844 0.15235,-0.460938 0.15235,-0.742188 0,-0.40625 -0.0898,-0.726562 -0.26953,-0.964844 -0.17969,-0.238281 -0.48829,-0.425781 -0.92188,-0.574218 l -0.82812,-0.28125 c -0.23438,-0.07031 -0.39063,-0.160157 -0.47657,-0.269532 -0.082,-0.105468 -0.125,-0.226562 -0.125,-0.359375 0,-0.191406 0.0664,-0.339843 0.19532,-0.433593 0.1289,-0.09766 0.28125,-0.144532 0.45703,-0.144532 0.22656,0 0.38281,0.0625 0.47265,0.191407 0.0898,0.132812 0.13672,0.335937 0.13672,0.617187 h 1.23828 v -0.21875 c 0,-0.488281 -0.14843,-0.863281 -0.44922,-1.132812 -0.30078,-0.265625 -0.76171,-0.398438 -1.39062,-0.398438 -0.35156,0 -0.65625,0.04297 -0.90625,0.128906 -0.25,0.08984 -0.45313,0.203125 -0.61328,0.351563 -0.16016,0.144531 -0.27735,0.316406 -0.35156,0.515625 -0.0703,0.195312 -0.10938,0.402344 -0.10938,0.625 0,0.378906 0.0977,0.691406 0.28906,0.933594 0.19532,0.242187 0.48047,0.433593 0.86328,0.566406 l 0.96875,0.347656 c 0.13282,0.05469 0.25,0.125 0.35157,0.214844 0.0977,0.08984 0.14843,0.222656 0.14843,0.394531 0,0.214844 -0.0625,0.375 -0.1914,0.480469 -0.125,0.109375 -0.29688,0.160156 -0.50781,0.160156 -0.23438,0 -0.41407,-0.07031 -0.53516,-0.214844 -0.125,-0.140625 -0.1875,-0.332031 -0.1875,-0.5625 v -0.183593 h -1.23828"
       id="path23" /><path
       fill-rule="nonzero"
       fill="#00539f"
       fill-opacity="1"
       d="M 92.378906,5.167969 H 90.9375 v 7.136719 h 1.441406 z m 1.058594,7.136719 h 1.378906 V 8.734375 c 0,-0.589844 0.242188,-0.886719 0.730469,-0.886719 0.207031,0 0.355469,0.054688 0.449219,0.164063 0.09375,0.109375 0.140625,0.304687 0.140625,0.585937 v 3.707032 h 1.378906 V 8.316406 c 0,-0.539062 -0.117187,-0.929687 -0.355469,-1.171875 -0.234375,-0.238281 -0.574218,-0.359375 -1.011718,-0.359375 -0.300782,0 -0.570313,0.0625 -0.800782,0.1875 -0.234375,0.121094 -0.425781,0.316407 -0.570312,0.582032 h -0.01953 V 6.925781 H 93.4375 Z m 4.84375,-1.757813 v 0.1875 c 0,0.261719 0.03125,0.496094 0.08984,0.707031 0.05859,0.210938 0.164062,0.390625 0.316406,0.539063 0.148438,0.148437 0.347656,0.265625 0.601563,0.34375 0.253906,0.08203 0.578125,0.121094 0.972661,0.121094 0.28516,0 0.55078,-0.03516 0.80078,-0.105469 0.24609,-0.07031 0.45703,-0.171875 0.63281,-0.3125 0.17578,-0.140625 0.31641,-0.316406 0.41407,-0.53125 0.10156,-0.210938 0.15234,-0.460938 0.15234,-0.742188 0,-0.402343 -0.0898,-0.726562 -0.26953,-0.960937 -0.17969,-0.238281 -0.48828,-0.429688 -0.92188,-0.578125 L 100.24219,8.9375 c -0.23438,-0.074219 -0.394534,-0.164062 -0.476565,-0.269531 -0.08203,-0.109375 -0.125,-0.226563 -0.125,-0.363281 0,-0.191407 0.06641,-0.335938 0.195313,-0.433594 0.128906,-0.097656 0.281252,-0.144531 0.453122,-0.144531 0.22657,0 0.38672,0.066406 0.47657,0.195312 0.0898,0.128906 0.13671,0.332031 0.13671,0.613281 h 1.23829 v -0.21875 c 0,-0.488281 -0.14844,-0.863281 -0.44922,-1.128906 -0.30078,-0.265625 -0.76563,-0.402344 -1.39063,-0.402344 -0.355467,0 -0.656249,0.042969 -0.906249,0.132813 -0.25,0.085937 -0.453125,0.203125 -0.613281,0.347656 -0.160156,0.148438 -0.277344,0.320313 -0.351562,0.515625 -0.07422,0.195313 -0.109375,0.40625 -0.109375,0.625 0,0.378906 0.09766,0.691406 0.289062,0.933594 0.195313,0.246094 0.480469,0.433594 0.863281,0.566406 l 0.968754,0.347656 c 0.13281,0.05469 0.25,0.125 0.34765,0.21875 0.10157,0.08984 0.15235,0.21875 0.15235,0.394532 0,0.210937 -0.0625,0.371093 -0.19141,0.480468 -0.125,0.105469 -0.29687,0.15625 -0.50781,0.15625 -0.23438,0 -0.414065,-0.07031 -0.535159,-0.210937 -0.125,-0.144531 -0.1875,-0.332031 -0.1875,-0.566406 v -0.179688 z m 5.10156,-3.621094 h -0.69922 v 0.941407 h 0.69922 v 3.078125 c 0,0.273437 0.0156,0.5 0.0508,0.679687 0.0352,0.179688 0.0937,0.324219 0.1836,0.4375 0.0937,0.109375 0.21875,0.1875 0.38672,0.234375 0.16797,0.04687 0.38672,0.07031 0.66015,0.07031 0.16016,0 0.3125,-0.0078 0.45313,-0.01953 0.14453,-0.01563 0.29297,-0.02734 0.44531,-0.04297 v -0.957032 c -0.0469,0.0039 -0.0937,0.01172 -0.14844,0.01172 -0.0547,0.0039 -0.10547,0.0078 -0.16015,0.0078 -0.19922,0 -0.33203,-0.04687 -0.39453,-0.136719 -0.0625,-0.08984 -0.0937,-0.242188 -0.0937,-0.453125 V 7.867188 h 0.79687 V 6.925781 H 104.7657 V 5.386719 h -1.38282 z m 2.83985,-0.660156 h 1.3789 V 5.085938 h -1.3789 z m 0,6.039063 h 1.3789 V 6.925781 h -1.3789 z m 2.71875,-5.378907 h -0.69922 v 0.941407 h 0.69922 v 3.078125 c 0,0.273437 0.0195,0.5 0.0508,0.679687 0.0352,0.179688 0.0937,0.324219 0.18359,0.4375 0.0898,0.109375 0.21875,0.1875 0.38672,0.234375 0.16797,0.04687 0.38672,0.07031 0.66016,0.07031 0.16015,0 0.3125,-0.0078 0.45312,-0.01953 0.14453,-0.01563 0.29297,-0.02734 0.44531,-0.04297 v -0.957032 c -0.0469,0.0039 -0.0937,0.01172 -0.14843,0.01172 -0.0547,0.0039 -0.10547,0.0078 -0.16016,0.0078 -0.19922,0 -0.33203,-0.04687 -0.39453,-0.136719 -0.0625,-0.08984 -0.0977,-0.242188 -0.0977,-0.453125 V 7.867188 h 0.80078 V 6.925781 h -0.80078 V 5.386719 h -1.3789 z m 5.53125,5.378907 h 1.3164 V 6.925781 h -1.3789 v 3.570313 c 0,0.59375 -0.24219,0.890625 -0.73047,0.890625 -0.20313,0 -0.35547,-0.05469 -0.44922,-0.164063 -0.0937,-0.113281 -0.14063,-0.304687 -0.14063,-0.585937 V 6.925781 h -1.3789 v 3.992188 c 0,0.539062 0.11719,0.929687 0.35547,1.167969 0.23828,0.238281 0.57422,0.359375 1.01562,0.359375 0.30078,0 0.56641,-0.0625 0.80078,-0.183594 0.23047,-0.125 0.42188,-0.320313 0.56641,-0.585938 h 0.0234 z m 2.63281,-5.378907 h -0.69922 v 0.941407 h 0.69922 v 3.078125 c 0,0.273437 0.0156,0.5 0.0508,0.679687 0.0312,0.179688 0.0937,0.324219 0.18359,0.4375 0.0898,0.109375 0.21875,0.1875 0.38672,0.234375 0.16407,0.04687 0.38672,0.07031 0.66016,0.07031 0.16016,0 0.30859,-0.0078 0.45312,-0.01953 0.14454,-0.01563 0.29297,-0.02734 0.44532,-0.04297 v -0.957032 c -0.0469,0.0039 -0.0977,0.01172 -0.14844,0.01172 -0.0547,0.0039 -0.10938,0.0078 -0.16016,0.0078 -0.20312,0 -0.33203,-0.04687 -0.39843,-0.136719 -0.0625,-0.08984 -0.0937,-0.242188 -0.0937,-0.453125 V 7.867188 h 0.80078 V 6.925781 h -0.80078 V 5.386719 h -1.37891 z m 6.69922,2.898438 V 9.515625 c 0,-0.414062 -0.0273,-0.789062 -0.082,-1.125 -0.0508,-0.335937 -0.15235,-0.621094 -0.29688,-0.859375 -0.14844,-0.234375 -0.35156,-0.421875 -0.60547,-0.550781 -0.25781,-0.128906 -0.58593,-0.195313 -0.98437,-0.195313 -0.46875,0 -0.84375,0.078125 -1.1211,0.230469 -0.28125,0.15625 -0.49609,0.359375 -0.64453,0.621094 -0.15234,0.257812 -0.25,0.554687 -0.30078,0.890625 -0.0508,0.332031 -0.0742,0.679687 -0.0742,1.039062 0,0.332032 0.0156,0.671875 0.043,1.015625 0.0312,0.34375 0.11328,0.652344 0.2461,0.929688 0.13281,0.277344 0.33984,0.5 0.62109,0.675781 0.27734,0.171875 0.66797,0.257813 1.16797,0.257813 0.66015,0 1.14453,-0.167969 1.44922,-0.503907 0.30859,-0.335937 0.47265,-0.820312 0.5,-1.445312 h -1.23828 c -0.0391,0.339844 -0.11329,0.59375 -0.21875,0.757812 -0.10938,0.167969 -0.27735,0.25 -0.51172,0.25 -0.125,0 -0.23438,-0.03125 -0.32032,-0.101562 -0.0859,-0.07031 -0.15625,-0.164063 -0.21093,-0.28125 -0.0508,-0.117188 -0.0898,-0.25 -0.11328,-0.398438 -0.0234,-0.152343 -0.0352,-0.304687 -0.0352,-0.46875 V 9.824219 Z M 121.07422,9.003906 V 8.796875 c 0,-0.125 0.0117,-0.253906 0.0352,-0.378906 0.0234,-0.128906 0.0625,-0.242188 0.11328,-0.347656 0.0547,-0.101563 0.125,-0.183594 0.21484,-0.25 0.0898,-0.0625 0.20703,-0.09375 0.34766,-0.09375 0.14062,0 0.2539,0.027343 0.34375,0.085937 0.0898,0.054688 0.16015,0.136719 0.21093,0.25 0.0508,0.109375 0.0859,0.242188 0.10547,0.398438 0.0195,0.15625 0.0312,0.339843 0.0391,0.542968 z m 5.76953,1.851563 c 0.0664,0.355469 0.17969,0.648437 0.33984,0.890625 0.16016,0.238281 0.37891,0.417969 0.65235,0.535156 0.26953,0.117188 0.61328,0.171875 1.02734,0.164063 0.39453,0 0.72656,-0.0625 0.99609,-0.183594 0.26954,-0.125 0.48829,-0.304688 0.65625,-0.539063 0.16407,-0.238281 0.28516,-0.53125 0.35938,-0.886718 0.0703,-0.351563 0.10937,-0.761719 0.10937,-1.21875 0,-0.46875 -0.0352,-0.878907 -0.10156,-1.238282 -0.0664,-0.355468 -0.17969,-0.652343 -0.33984,-0.894531 -0.16016,-0.238281 -0.375,-0.417969 -0.64844,-0.535156 -0.27344,-0.113281 -0.61719,-0.167969 -1.03125,-0.164063 -0.39062,0 -0.72266,0.0625 -0.99609,0.1875 -0.26953,0.121094 -0.48438,0.300782 -0.65235,0.539063 -0.16796,0.234375 -0.28906,0.53125 -0.35937,0.882812 -0.0742,0.355469 -0.11328,0.761719 -0.11328,1.222657 0,0.472656 0.0352,0.886718 0.10156,1.238281 m 1.30078,-2 c 0.0117,-0.234375 0.043,-0.433594 0.0937,-0.601563 0.0508,-0.164062 0.125,-0.292968 0.22266,-0.386718 0.0937,-0.09375 0.23047,-0.140625 0.40234,-0.140625 0.28125,0 0.47266,0.144531 0.58203,0.441406 0.10547,0.292969 0.16016,0.773437 0.16016,1.449219 0,0.671875 -0.0547,1.15625 -0.16016,1.449218 -0.10937,0.292969 -0.30078,0.4375 -0.58203,0.4375 -0.17187,0 -0.30859,-0.04297 -0.40234,-0.136718 -0.0977,-0.09375 -0.17188,-0.222657 -0.22266,-0.390625 -0.0508,-0.167969 -0.082,-0.367188 -0.0937,-0.601563 -0.0117,-0.230469 -0.0195,-0.484375 -0.0195,-0.757812 0,-0.273438 0.008,-0.527344 0.0195,-0.761719 m 3.96484,3.449219 h 1.37891 v -4.4375 h 0.80078 V 6.925781 h -0.80078 v -0.46875 c 0,-0.152343 0.0391,-0.265625 0.12109,-0.332031 0.0781,-0.066406 0.21485,-0.097656 0.41016,-0.097656 h 0.12891 c 0.0625,0 0.10937,0.00391 0.14062,0.00781 V 5.054688 c -0.2539,-0.019532 -0.5,-0.027344 -0.73828,-0.027344 -0.22266,0 -0.42187,0.019531 -0.60156,0.0625 -0.17969,0.046875 -0.33203,0.117187 -0.45703,0.214844 -0.1211,0.101562 -0.21485,0.234375 -0.28125,0.402343 -0.0703,0.164063 -0.10157,0.367188 -0.10157,0.609375 v 0.609375 h -0.69921 v 0.941407 h 0.69921 v 4.4375"
       id="path24" /></g><style
     type="text/css"
     id="style1">&#10;	.st0{fill:#003C65;}&#10;</style><path
     class="st0"
     d="m 24.534802,12.214194 h -0.04296 c -0.223373,0 -0.369425,0.120279 -0.455338,0.257739 v -0.171825 c 0,-0.04296 -0.03437,-0.08591 -0.07732,-0.08591 h -0.189008 c -0.04296,0 -0.07732,0.03437 -0.07732,0.08591 v 1.546431 c 0,0.04296 0.03437,0.07732 0.07732,0.07732 h 0.206191 c 0.04296,0 0.08591,-0.03437 0.08591,-0.07732 v -0.773217 c 0,-0.317877 0.146052,-0.489701 0.438156,-0.489701 h 0.05155 c 0.04296,0 0.08591,-0.03437 0.08591,-0.07733 v -0.20619 c -0.02577,-0.04296 -0.06014,-0.08591 -0.103096,-0.08591 m 0.910677,0.455338 c 0,-0.146051 0.128869,-0.189008 0.274922,-0.189008 0.231964,0 0.292103,0.120277 0.326468,0.214783 0.01718,0.03437 0.02577,0.05155 0.06014,0.05155 h 0.214783 c 0.03437,0 0.06014,-0.01717 0.06014,-0.06014 0,-0.01718 0,-0.03437 -0.0086,-0.04296 -0.05155,-0.20619 -0.214783,-0.455339 -0.635756,-0.455339 -0.33506,0 -0.644347,0.146052 -0.644347,0.506888 0,0.695892 0.970816,0.403789 0.970816,0.764624 0,0.154643 -0.120278,0.214783 -0.317877,0.214783 -0.249148,0 -0.317878,-0.137463 -0.352243,-0.231967 -0.0086,-0.03437 -0.02578,-0.05155 -0.06014,-0.05155 H 25.11901 c -0.03437,0 -0.06014,0.02578 -0.06014,0.05155 0,0.01718 0,0.03437 0,0.05155 0.04296,0.231966 0.257739,0.472521 0.678711,0.472521 0.352243,0 0.670121,-0.137459 0.670121,-0.524069 0.0086,-0.687304 -0.962224,-0.40379 -0.962224,-0.773216 m 4.295644,-0.489702 c -0.240555,0 -0.386608,0.103095 -0.47252,0.231964 v -0.798989 c 0,-0.04296 -0.03437,-0.08591 -0.08591,-0.08591 h -0.20619 c -0.04296,0 -0.07732,0.03437 -0.07732,0.08591 v 2.233735 c 0,0.04296 0.03437,0.07732 0.07732,0.07732 h 0.20619 c 0.04296,0 0.08591,-0.03437 0.08591,-0.07732 v -0.92786 c 0,-0.274919 0.146052,-0.420973 0.360834,-0.420973 0.214782,0 0.360834,0.154643 0.360834,0.420973 v 0.92786 c 0,0.04296 0.03437,0.07732 0.07732,0.07732 h 0.206191 c 0.04296,0 0.08591,-0.03437 0.08591,-0.07732 v -0.884904 c 0,-0.463929 -0.1976,-0.781806 -0.618573,-0.781806 m 2.628936,0.03437 h -0.206191 c -0.04296,0 -0.07732,0.03437 -0.07732,0.08591 v 0.927858 c 0,0.274923 -0.13746,0.420974 -0.352243,0.420974 -0.206191,0 -0.33506,-0.154643 -0.33506,-0.420974 v -0.927858 c 0,-0.04296 -0.03437,-0.08591 -0.08591,-0.08591 h -0.20619 c -0.04296,0 -0.07733,0.03437 -0.07733,0.08591 v 0.884902 c 0,0.481114 0.1976,0.773217 0.601391,0.773217 0.249146,0 0.369425,-0.0945 0.455338,-0.214783 v 0.103095 c 0,0.04296 0.03437,0.07733 0.07732,0.07733 h 0.206191 c 0.04296,0 0.08591,-0.03437 0.08591,-0.07733 v -1.546431 c 0,-0.04296 -0.04296,-0.08591 -0.08591,-0.08591 m -4.725211,0.283511 c 0.206191,0 0.309286,0.120279 0.352243,0.300698 0,0.02578 0.02577,0.05155 0.06014,0.05155 h 0.231965 c 0.03437,0 0.05155,-0.02578 0.05155,-0.05155 0,-0.01717 0,-0.02578 -0.0086,-0.04296 -0.06873,-0.317875 -0.317879,-0.567024 -0.695895,-0.567024 -0.403791,0 -0.73026,0.300697 -0.73026,0.781807 v 0.223375 c 0,0.481113 0.317878,0.773215 0.73026,0.773215 0.429564,0 0.652938,-0.317878 0.695895,-0.549841 0,-0.01717 0.0086,-0.04296 0.0086,-0.05155 0,-0.03437 -0.02577,-0.05155 -0.06014,-0.05155 h -0.231964 c -0.02578,0 -0.05155,0.01718 -0.05155,0.05155 -0.04296,0.197599 -0.163235,0.300695 -0.352243,0.300695 -0.214782,0 -0.369425,-0.154643 -0.369425,-0.420974 v -0.300695 c 0,-0.300695 0.154643,-0.446749 0.369425,-0.446749 M 26.991909,2.0421082 c 0.429564,0 0.713077,-0.2835129 0.713077,-0.7130773 0,-0.42956436 -0.283513,-0.71307724 -0.713077,-0.71307724 -0.429565,0 -0.713078,0.28351288 -0.713078,0.71307724 0,0.4209735 0.283513,0.7130773 0.713078,0.7130773 M 6.5790039,6.3893004 9.0275219,0.04892865 c -3.041318,-0.32646871 -6.048269,1.24573725 -7.474424,4.03790625 -0.0086,0.017184 -0.0086,0.025772 -0.0086,0.042957 l -0.103096,0.2749213 c -0.73884999,1.9158576 0.386609,3.3334206 1.486294,3.7543942 1.091093,0.4209728 2.912447,0.1460515 3.651298,-1.7698062 M 29.071001,2.0421082 c 0.429564,0 0.713076,-0.2835129 0.713076,-0.7130773 0,-0.42956436 -0.283512,-0.71307724 -0.713076,-0.71307724 -0.429565,0 -0.713078,0.28351288 -0.713078,0.71307724 0,0.4209735 0.292104,0.7130773 0.713078,0.7130773 M 11.01211,8.0302373 C 9.5429989,11.836178 6.0291609,13.262334 2.8332009,12.71249 c 0.73026,0.764623 1.640937,1.374608 2.689074,1.78699 3.857489,1.494885 8.2046821,-0.429566 9.6909751,-4.287055 C 16.3473,7.2742036 15.505354,4.0524698 13.331758,2.0249257 Z M 23.821723,2.9527852 c 0,-0.1718264 -0.137461,-0.3092871 -0.309287,-0.3092871 h -0.824764 c -0.171825,0 -0.309286,0.1374607 -0.309286,0.3092871 v 4.4846532 c 0,0.6271638 -0.489703,0.9020859 -0.841946,0.9020859 -0.360835,0 -0.833356,-0.2749221 -0.833356,-0.9020859 v -0.085913 c 0,-0.1718256 -0.13746,-0.3092865 -0.309286,-0.3092865 h -0.790399 c -0.171826,0 -0.309287,0.1374609 -0.309287,0.3092865 v 0.068731 c 0,1.4347458 1.108277,2.2681005 2.242328,2.2681005 1.151232,0 2.285283,-0.8333547 2.285283,-2.2681005 z M 22.369795,12.17983 c -0.412382,0 -0.738851,0.300696 -0.738851,0.781806 v 0.223375 c 0,0.481113 0.326469,0.773216 0.738851,0.773216 0.412382,0 0.738851,-0.300695 0.738851,-0.773216 v -0.223375 c 0,-0.48111 -0.326469,-0.781806 -0.738851,-0.781806 m 0.369426,1.048136 c 0,0.274923 -0.154644,0.420975 -0.369426,0.420975 -0.206191,0 -0.369426,-0.154643 -0.369426,-0.420975 v -0.300694 c 0,-0.274922 0.154643,-0.420974 0.369426,-0.420974 0.214782,0 0.369426,0.154643 0.369426,0.420974 z m -1.494886,-1.692482 h -1.34024 c -0.04296,0 -0.07733,0.03437 -0.07733,0.08591 v 2.233733 c 0,0.04296 0.03437,0.07733 0.07733,0.07733 h 0.20619 c 0.04296,0 0.08591,-0.03437 0.08591,-0.07733 v -0.876311 h 0.824763 c 0.04296,0 0.08591,-0.03437 0.08591,-0.07732 v -0.18901 c 0,-0.04296 -0.03437,-0.08591 -0.08591,-0.08591 h -0.824763 v -0.747442 h 1.039546 c 0.04296,0 0.08591,-0.03437 0.08591,-0.07732 v -0.180418 c 0,-0.05155 -0.03437,-0.08591 -0.07732,-0.08591 m 9.05522,-8.8919887 h -0.824764 c -0.171825,0 -0.309286,0.1374607 -0.309286,0.3092871 v 3.9262191 c 0,1.022364 -0.498295,1.4605192 -1.202781,1.4605192 -0.704485,0 -1.177006,-0.4381552 -1.177006,-1.4605192 V 2.9527844 c 0,-0.1718264 -0.137461,-0.3092871 -0.309286,-0.3092871 h -0.816173 c -0.171827,0 -0.309287,0.1374607 -0.309287,0.3092871 v 3.9262191 c 0,1.7354405 1.048137,2.8093522 2.620344,2.8093522 1.563615,0 2.637526,-1.0739117 2.637526,-2.8093522 V 2.9527844 c 0,-0.1632348 -0.137461,-0.3092871 -0.309287,-0.3092871 m 17.225542,9.5706967 h -0.04296 c -0.223374,0 -0.369426,0.120279 -0.455341,0.257739 v -0.171825 c 0,-0.04296 -0.03437,-0.08591 -0.07732,-0.08591 h -0.189008 c -0.04296,0 -0.07732,0.03437 -0.07732,0.08591 v 1.546431 c 0,0.04296 0.03437,0.07732 0.07732,0.07732 h 0.206192 c 0.04296,0 0.08591,-0.03437 0.08591,-0.07732 v -0.773217 c 0,-0.317877 0.146052,-0.489701 0.438155,-0.489701 h 0.05155 c 0.04296,0 0.08591,-0.03437 0.08591,-0.07733 v -0.20619 c -0.02578,-0.04296 -0.06014,-0.08591 -0.103094,-0.08591 M 46.004435,7.1109684 h -1.022363 c -0.197599,0 -0.240555,0.1546432 -0.257738,0.3092864 -0.05155,0.472521 -0.403791,0.9192679 -1.134051,0.9192679 -0.721668,0 -1.305877,-0.5326597 -1.305877,-1.5550235 V 5.4786234 c 0,-1.0223637 0.584209,-1.5807976 1.305877,-1.5807976 0.721669,0 1.048138,0.4897035 1.134051,0.9622246 0.02578,0.1975995 0.137459,0.26633 0.249146,0.26633 h 1.013775 c 0.146051,0 0.231963,-0.1030955 0.214779,-0.2491476 -0.07732,-1.2027804 -1.022363,-2.3282395 -2.611751,-2.3282395 -1.589388,0 -2.749214,1.1684154 -2.749214,2.9038562 v 1.3316497 c 0,1.7354407 1.159826,2.9038565 2.749214,2.9038565 1.589388,0 2.543023,-1.1684158 2.628935,-2.3368313 0.0086,-0.1116867 -0.07732,-0.240556 -0.214783,-0.240556 m -0.03437,5.1032256 h -0.343651 v -0.360833 c 0,-0.04296 -0.03437,-0.08591 -0.07732,-0.08591 h -0.1976 c -0.04296,0 -0.07733,0.03437 -0.07733,0.08591 v 0.154643 c 0,0.171825 -0.06873,0.214782 -0.231963,0.214782 -0.04296,0 -0.07732,0.03437 -0.07732,0.08591 v 0.163234 c 0,0.04296 0.03437,0.07732 0.07732,0.07732 h 0.231963 v 0.841948 c 0,0.352242 0.12028,0.549841 0.532662,0.549841 h 0.180419 c 0.04296,0 0.08591,-0.03437 0.08591,-0.07732 v -0.171826 c 0,-0.04296 -0.03437,-0.07732 -0.08591,-0.07732 h -0.111688 c -0.206191,0 -0.231967,-0.06873 -0.231967,-0.266331 v -0.790403 h 0.343655 c 0.04296,0 0.08591,-0.03437 0.08591,-0.07732 v -0.163235 c -0.01718,-0.06014 -0.06014,-0.103095 -0.103096,-0.103095 m 6.159954,-0.03437 c -0.231963,0 -0.412382,0.103096 -0.532658,0.274921 -0.111687,-0.197599 -0.292106,-0.274921 -0.498296,-0.274921 -0.231963,0 -0.360835,0.103096 -0.446747,0.231966 v -0.111688 c 0,-0.04296 -0.03437,-0.08591 -0.08591,-0.08591 h -0.206191 c -0.04296,0 -0.07732,0.03437 -0.07732,0.08591 v 1.546431 c 0,0.04296 0.03437,0.07733 0.07732,0.07733 h 0.206191 c 0.04296,0 0.08591,-0.03437 0.08591,-0.07733 v -0.867721 c 0,-0.274923 0.05155,-0.481113 0.343651,-0.481113 0.26633,0 0.32647,0.171826 0.32647,0.481113 v 0.86772 c 0,0.04296 0.03437,0.07732 0.07732,0.07732 h 0.214785 c 0.04296,0 0.07733,-0.03437 0.07733,-0.07732 v -0.86772 c 0,-0.292103 0.06873,-0.481113 0.34365,-0.481113 0.274923,0 0.326471,0.180419 0.326471,0.481113 v 0.86772 c 0,0.04296 0.03437,0.07732 0.07732,0.07732 h 0.20619 c 0.04296,0 0.08591,-0.03437 0.08591,-0.07732 v -0.841945 c 0,-0.489705 -0.103095,-0.824765 -0.601392,-0.824765 M 52.439304,2.6434853 H 51.61454 c -0.171824,0 -0.309287,0.1374607 -0.309287,0.3092871 V 5.4356668 H 48.951248 V 2.9527844 c 0,-0.1718264 -0.13746,-0.3092871 -0.309287,-0.3092871 H 47.82579 c -0.171827,0 -0.309287,0.1374607 -0.309287,0.3092871 v 6.3317802 c 0,0.1718264 0.13746,0.3092863 0.309287,0.3092863 h 0.824764 c 0.171826,0 0.309286,-0.1374599 0.309286,-0.3092863 V 6.7844992 h 2.354013 v 2.5000654 c 0,0.1718264 0.137462,0.3092863 0.309286,0.3092863 h 0.824764 c 0.171827,0 0.309286,-0.1374599 0.309286,-0.3092863 V 2.9527844 C 52.748582,2.7895496 52.611138,2.6434973 52.439312,2.6434973 M 36.631338,9.2845646 V 8.5543049 c 0,-0.1718256 -0.137459,-0.3092862 -0.309286,-0.3092862 H 33.684526 V 2.9613752 c 0,-0.1718256 -0.13746,-0.3092862 -0.309287,-0.3092862 h -0.824764 c -0.171823,0 -0.309286,0.1374606 -0.309286,0.3092862 v 6.3317811 c 0,0.1718256 0.137463,0.3092862 0.309286,0.3092862 h 3.771577 c 0.171827,-0.00859 0.309286,-0.1546431 0.309286,-0.3178779 m 7.225276,2.8952644 c -0.240555,0 -0.378018,0.103096 -0.472522,0.231965 v -0.120278 c 0,-0.04296 -0.03437,-0.08591 -0.08591,-0.08591 h -0.1976 c -0.04296,0 -0.07733,0.03437 -0.07733,0.08591 v 1.546431 c 0,0.04296 0.03437,0.07733 0.07733,0.07733 h 0.206191 c 0.04296,0 0.08591,-0.03437 0.08591,-0.07733 v -0.927859 c 0,-0.274919 0.154643,-0.420971 0.360834,-0.420971 0.214783,0 0.360834,0.154643 0.360834,0.420971 v 0.927859 c 0,0.04296 0.03437,0.07733 0.07732,0.07733 h 0.206191 c 0.04296,0 0.08591,-0.03437 0.08591,-0.07733 v -0.8849 c 0,-0.455341 -0.206191,-0.773218 -0.627165,-0.773218 m 5.635888,0.03437 h -0.206191 c -0.04296,0 -0.07732,0.03437 -0.07732,0.08591 v 0.927858 c 0,0.274923 -0.137459,0.420974 -0.352242,0.420974 -0.206191,0 -0.335062,-0.154643 -0.335062,-0.420974 v -0.927858 c 0,-0.04296 -0.03437,-0.08591 -0.08591,-0.08591 h -0.206191 c -0.04296,0 -0.07732,0.03437 -0.07732,0.08591 v 0.884902 c 0,0.481114 0.1976,0.773217 0.601389,0.773217 0.249147,0 0.369426,-0.0945 0.455339,-0.214783 v 0.103095 c 0,0.04296 0.03437,0.07733 0.07732,0.07733 h 0.206191 c 0.04296,0 0.08591,-0.03437 0.08591,-0.07733 v -1.546431 c 0,-0.04296 -0.04296,-0.08591 -0.08591,-0.08591 M 36.20177,13.597396 h -0.438155 c -0.111687,0 -0.163234,-0.03437 -0.163234,-0.120279 0,-0.07732 0.05155,-0.120276 0.137459,-0.120276 h 0.335062 c 0.386607,0 0.652937,-0.206191 0.652937,-0.584209 v -0.704484 c 0,-0.04296 -0.03437,-0.07733 -0.07732,-0.07733 h -0.171827 c -0.05155,0 -0.08591,0.03437 -0.08591,0.07733 v 0.223373 c -0.103095,-0.07733 -0.231966,-0.111687 -0.352242,-0.111687 h -0.08591 c -0.386606,0 -0.652937,0.223374 -0.652937,0.592798 0,0.180419 0.06873,0.317879 0.214782,0.420975 -0.163234,0.03437 -0.231966,0.14605 -0.231966,0.28351 0,0.120279 0.05155,0.214783 0.154643,0.257739 -0.146051,0.07733 -0.231963,0.214783 -0.231963,0.395202 0,0.28351 0.214783,0.524069 0.601389,0.524069 h 0.395199 c 0.386609,0 0.601392,-0.231967 0.601392,-0.524069 0,-0.292106 -0.214783,-0.532662 -0.601392,-0.532662 M 35.96122,12.471935 h 0.0945 c 0.20619,0 0.317877,0.128868 0.317877,0.300694 0,0.180419 -0.120279,0.300695 -0.317877,0.300695 h -0.0945 c -0.197598,0 -0.317877,-0.120276 -0.317877,-0.300695 -0.0086,-0.180415 0.111687,-0.300694 0.317877,-0.300694 m 0.171828,1.890083 h -0.266334 c -0.231966,0 -0.317879,-0.0945 -0.317879,-0.240556 0,-0.154643 0.08591,-0.249146 0.317879,-0.249146 h 0.26633 c 0.231964,0 0.317878,0.0945 0.317878,0.249146 0.0086,0.146052 -0.07732,0.240556 -0.317878,0.240556 m -2.130641,-2.182187 c -0.240554,0 -0.378017,0.103096 -0.472521,0.231965 v -0.120278 c 0,-0.04296 -0.03437,-0.08591 -0.08591,-0.08591 h -0.20619 c -0.04296,0 -0.07732,0.03437 -0.07732,0.08591 v 1.546431 c 0,0.04296 0.03437,0.07732 0.07732,0.07732 h 0.20619 c 0.04296,0 0.08591,-0.03437 0.08591,-0.07732 v -0.92786 c 0,-0.274919 0.154644,-0.42097 0.360834,-0.42097 0.214783,0 0.360835,0.154643 0.360835,0.42097 v 0.92786 c 0,0.04296 0.03437,0.07732 0.07732,0.07732 h 0.206191 c 0.04296,0 0.08591,-0.03437 0.08591,-0.07732 v -0.884901 c 0.0086,-0.455341 -0.197599,-0.773217 -0.618573,-0.773217 m 3.651298,0.489703 c 0,-0.146051 0.128871,-0.189008 0.274922,-0.189008 0.231963,0 0.292103,0.120277 0.32647,0.214783 0.01718,0.03437 0.02578,0.05155 0.06013,0.05155 h 0.214782 c 0.03437,0 0.06014,-0.01717 0.06014,-0.06014 0,-0.01718 0,-0.03437 -0.0086,-0.04296 -0.05155,-0.206191 -0.214782,-0.45534 -0.635753,-0.45534 -0.335062,0 -0.644348,0.146053 -0.644348,0.506888 0,0.695892 0.970815,0.403789 0.970815,0.764624 0,0.154643 -0.120276,0.214783 -0.317878,0.214783 -0.249147,0 -0.317875,-0.137463 -0.352243,-0.231967 -0.0086,-0.03437 -0.02578,-0.05155 -0.06014,-0.05155 h -0.21478 c -0.03437,0 -0.06014,0.02578 -0.06014,0.05155 0,0.01718 0,0.03437 0,0.05155 0.04296,0.231967 0.257738,0.472521 0.678713,0.472521 0.352242,0 0.67012,-0.137459 0.67012,-0.524069 0.0086,-0.687304 -0.962226,-0.40379 -0.962226,-0.773216 m 2.706257,-0.455338 H 39.23448 c -0.04296,0 -0.08591,0.03437 -0.08591,0.08591 v 0.163234 c 0,0.04296 0.03437,0.07733 0.08591,0.07733 h 0.773216 l -0.798992,1.022363 c -0.04296,0.05155 -0.06014,0.06872 -0.06014,0.154643 v 0.13746 c 0,0.04296 0.03437,0.07732 0.08591,0.07732 h 1.125459 c 0.04296,0 0.07732,-0.03437 0.07732,-0.07732 v -0.154643 c 0,-0.04296 -0.03437,-0.08591 -0.07732,-0.08591 h -0.7904 l 0.816171,-1.013775 c 0.04296,-0.05155 0.05155,-0.08591 0.05155,-0.137459 v -0.163236 c 0.0086,-0.04296 -0.02578,-0.08591 -0.07732,-0.08591 M 39.354762,9.2845686 V 2.9527844 c 0,-0.1718264 -0.13746,-0.3092871 -0.309288,-0.3092871 h -0.824763 c -0.171824,0 -0.309287,0.1374607 -0.309287,0.3092871 v 6.3317802 c 0,0.1718264 0.137463,0.3092863 0.309287,0.3092863 h 0.824763 c 0.171828,0 0.309288,-0.1460515 0.309288,-0.3092863 m 2.328239,2.8952644 c -0.412381,0 -0.738852,0.300696 -0.738852,0.781806 v 0.223375 c 0,0.481113 0.326471,0.773216 0.738852,0.773216 0.249147,0 0.549841,-0.120279 0.670121,-0.455338 0.0086,-0.01717 0.01717,-0.03437 0.01717,-0.05155 0,-0.03437 -0.02578,-0.06014 -0.05155,-0.06014 h -0.223375 c -0.05155,0 -0.06873,0.03437 -0.07732,0.05155 -0.09451,0.180419 -0.214783,0.20619 -0.335062,0.20619 -0.214783,0 -0.369426,-0.163234 -0.369426,-0.40379 v -0.05155 h 1.013774 c 0.04296,0 0.07732,-0.03437 0.07732,-0.08591 v -0.154643 c 0.0086,-0.455341 -0.317878,-0.773217 -0.721669,-0.773217 m 0.369445,0.756033 h -0.738852 v -0.03437 c 0,-0.24915 0.154644,-0.403794 0.369426,-0.403794 0.214783,0 0.369426,0.146055 0.369426,0.395201 z"
     id="path1-9"
     style="stroke-width:0.0859124" /></svg>
