Type,Name,Request Count,Failure Count,Median Response Time,Average Response Time,Min Response Time,Max Response Time,Average Content Size,Requests/s,Failures/s,50%,66%,75%,80%,90%,95%,98%,99%,99.9%,99.99%,100%
direct_client,del_multiples,1260,0,300.0,301.4714454847669,20.967483520507812,2405.942678451538,51.0,20.909087787099697,0.0,300,320,340,350,380,400,430,440,1600,2400,2400
direct_client,del_single,1220,0,290.0,307.1670391520516,19.967079162597656,2813.5716915130615,51.0,20.245307222429865,0.0,290,320,330,340,380,400,420,450,2800,2800,2800
direct_client,get_multiples,1205,0,310.0,320.56131679487424,34.00063514709473,2333.9085578918457,8056.0,19.99638951067868,0.0,310,340,350,370,400,420,440,450,2300,2300,2300
direct_client,get_range,1222,0,290.0,308.7938087466501,20.97487449645996,2407.9418182373047,872.0,20.278496250663355,0.0,290,320,340,350,380,410,430,450,2300,2400,2400
direct_client,get_single,1214,0,290.0,302.57200193169484,67.60549545288086,2812.572956085205,88.0,20.14574013772939,0.0,290,310,330,340,380,410,430,450,2300,2800,2800
direct_client,set_multiples,2380,0,320.0,385.8594518749654,115.58318138122559,3346.2586402893066,51.0,39.494943597854984,0.0,320,350,370,390,440,980,1400,1500,2400,3300,3300
direct_client,set_single,1215,0,300.0,309.7562768331771,29.000520706176758,2715.022325515747,51.0,20.162334651846137,0.0,300,320,330,340,370,400,430,550,2300,2700,2700
,Aggregated,9716,0,300.0,327.3200918343294,19.967079162597656,3346.2586402893066,1151.6798065047344,161.2322991583021,0.0,300,330,340,360,390,430,890,1300,2700,3300,3300
