Type,Name,Request Count,Failure Count,Median Response Time,Average Response Time,Min Response Time,Max Response Time,Average Content Size,Requests/s,Failures/s,50%,66%,75%,80%,90%,95%,98%,99%,99.9%,99.99%,100%
client-middleware,/CommunicationService/delMultiple,1314,0,360.0,358.3047228498183,4.951953887939453,943.3720111846924,4.0,10.95258760282286,0.0,360,480,530,560,650,740,830,860,940,940,940
client-middleware,/CommunicationService/delSingle,1347,0,340.0,352.1047739426826,2.000570297241211,1216.2253856658936,4.0,11.227652588281881,0.0,340,460,520,560,650,720,810,860,1100,1200,1200
client-middleware,/CommunicationService/getMultiple,1275,0,420.0,427.2166525148878,24.640798568725586,1008.7995529174805,20763.562352941175,10.627510801825833,0.0,420,530,590,640,760,840,890,930,1000,1000,1000
client-middleware,/CommunicationService/getRange,1344,0,340.0,345.82735810961043,3.9997100830078125,1113.267421722412,2010.252232142857,11.202646680512878,0.0,340,460,520,560,640,720,810,840,960,1100,1100
client-middleware,/CommunicationService/getSingle,1373,0,340.0,357.92630046975063,1.970529556274414,1085.127592086792,15.477057538237437,11.44437045561323,0.0,340,470,530,560,660,740,830,890,970,1100,1100
client-middleware,/CommunicationService/setMultiple,1284,0,460.0,464.24685516090034,27.349472045898438,1301.1493682861328,4.0,10.70252852513284,0.0,460,570,640,690,810,900,990,1100,1300,1300,1300
client-middleware,/CommunicationService/setSingle,1305,0,360.0,358.4689061760446,1.9984245300292969,1067.2540664672852,4.0,10.877569879515853,0.0,360,470,520,560,660,730,810,840,1000,1100,1100
,Aggregated,9242,0,370.0,379.77909897344244,1.970529556274414,1301.1493682861328,3161.3904998917983,77.03486653370537,0.0,370,490,550,590,690,780,860,920,1100,1300,1300
