09-April-23 21:54:26 - INFO:  get_single:0.0004983702674508095
09-April-23 21:54:26 - INFO:  get_single:0.0004420848563313484
09-April-23 21:54:26 - INFO:  get_single:0.00045988336205482483
09-April-23 21:54:26 - INFO:  get_single:0.0009978003799915314
09-April-23 21:54:26 - INFO:  get_single:0.0004650391638278961
09-April-23 21:54:26 - INFO:  get_single:0.005396964959800243
09-April-23 21:54:26 - INFO:  get_single:0.0005352776497602463
09-April-23 21:54:26 - INFO:  get_single:0.0006041321903467178
09-April-23 21:54:26 - INFO:  get_single:0.0005065798759460449
09-April-23 21:54:26 - INFO:  get_single:0.0004864763468503952
09-April-23 21:54:26 - INFO:  get_single:0.0005165142938494682
09-April-23 21:54:27 - INFO:  get_single:0.005155667662620544
09-April-23 21:54:27 - INFO:  get_single:0.005125300958752632
09-April-23 21:54:27 - INFO:  get_single:0.0010380987077951431
09-April-23 21:54:27 - INFO:  get_single:0.002579585649073124
09-April-23 21:54:27 - INFO:  get_single:0.03556463774293661
09-April-23 21:54:27 - INFO:  get_single:0.012415372766554356
09-April-23 21:54:28 - INFO:  get_single:0.0038031628355383873
09-April-23 21:54:28 - INFO:  get_single:0.002762790769338608
09-April-23 21:54:28 - INFO:  get_single:0.0007396228611469269
09-April-23 21:54:28 - INFO:  get_single:0.01071087084710598
09-April-23 21:54:28 - INFO:  get_single:0.006761254742741585
09-April-23 21:54:28 - INFO:  get_single:0.00908624567091465
09-April-23 21:54:28 - INFO:  get_single:0.016711260192096233
09-April-23 21:54:28 - INFO:  get_single:0.0065872929990291595
09-April-23 21:54:29 - INFO:  get_single:0.003400552086532116
09-April-23 21:54:29 - INFO:  get_single:0.000933431088924408
09-April-23 21:54:29 - INFO:  get_single:0.006362735293805599
09-April-23 21:54:29 - INFO:  get_single:0.01727683376520872
09-April-23 21:54:29 - INFO:  get_single:0.012336647137999535
09-April-23 21:54:29 - INFO:  get_single:0.0008594421669840813
09-April-23 21:54:29 - INFO:  get_single:0.000514359213411808
09-April-23 21:54:29 - INFO:  get_single:0.01914137601852417
09-April-23 21:54:30 - INFO:  get_single:0.0035505080595612526
09-April-23 21:54:30 - INFO:  get_single:0.006726774387061596
09-April-23 21:54:30 - INFO:  get_single:0.01624636258929968
09-April-23 21:54:30 - INFO:  get_single:0.006580927409231663
09-April-23 21:54:30 - INFO:  get_single:0.02618085779249668
09-April-23 21:54:30 - INFO:  get_single:0.0012173112481832504
09-April-23 21:54:30 - INFO:  get_single:0.0014968803152441978
09-April-23 21:54:30 - INFO:  get_single:0.009407342411577702
09-April-23 21:54:30 - INFO:  get_single:0.00468332227319479
09-April-23 21:54:30 - INFO:  get_single:0.0044928016141057014
09-April-23 21:54:30 - INFO:  get_single:0.002268856391310692
09-April-23 21:54:30 - INFO:  get_single:0.01542462594807148
09-April-23 21:54:30 - INFO:  get_single:0.011688665486872196
09-April-23 21:54:30 - INFO:  get_single:0.005218369886279106
09-April-23 21:54:30 - INFO:  get_single:0.001915285363793373
09-April-23 21:54:30 - INFO:  get_single:0.00630557257682085
09-April-23 21:54:31 - INFO:  get_single:0.0179987084120512
09-April-23 21:54:31 - INFO:  get_single:0.0020148511976003647
09-April-23 21:54:31 - INFO:  get_single:0.0071342140436172485
09-April-23 21:54:31 - INFO:  get_single:0.010984004475176334
09-April-23 21:54:31 - INFO:  get_single:0.01545637659728527
09-April-23 21:54:31 - INFO:  get_single:0.0029319515451788902
09-April-23 21:54:31 - INFO:  get_single:0.001261950470507145
09-April-23 21:54:31 - INFO:  get_single:0.017499658279120922
09-April-23 21:54:31 - INFO:  get_single:0.027932959608733654
09-April-23 21:54:32 - INFO:  get_single:0.003957031294703484
09-April-23 21:54:32 - INFO:  get_single:0.021577185951173306
09-April-23 21:54:32 - INFO:  get_single:0.03982806298881769
09-April-23 21:54:32 - INFO:  get_single:0.0031044064089655876
09-April-23 21:54:32 - INFO:  get_single:0.0073097869753837585
09-April-23 21:54:32 - INFO:  get_single:0.011220940388739109
09-April-23 21:54:32 - INFO:  get_single:0.028258074074983597
09-April-23 21:54:32 - INFO:  get_single:0.0052194371819496155
09-April-23 21:54:33 - INFO:  get_single:0.019181249663233757
09-April-23 21:54:33 - INFO:  get_single:0.007801001891493797
09-April-23 21:54:33 - INFO:  get_single:0.014028985053300858
09-April-23 21:54:33 - INFO:  get_single:0.002915114164352417
09-April-23 21:54:33 - INFO:  get_single:0.0077917128801345825
09-April-23 21:54:33 - INFO:  get_single:0.013446727767586708
09-April-23 21:54:33 - INFO:  get_single:0.0026648910716176033
09-April-23 21:54:34 - INFO:  get_single:0.007928439415991306
09-April-23 21:54:34 - INFO:  get_single:0.0018313238397240639
09-April-23 21:54:34 - INFO:  get_single:0.005822279490530491
09-April-23 21:54:34 - INFO:  get_single:0.01889283023774624
09-April-23 21:54:34 - INFO:  get_single:0.008129469119012356
09-April-23 21:54:34 - INFO:  get_single:0.10053026769310236
09-April-23 21:54:34 - INFO:  get_single:0.0013854270800948143
09-April-23 21:54:35 - INFO:  get_single:0.0020985472947359085
09-April-23 21:54:35 - INFO:  get_single:0.007161797024309635
09-April-23 21:54:35 - INFO:  get_single:0.004493745043873787
09-April-23 21:54:35 - INFO:  get_single:0.0011159460991621017
09-April-23 21:54:35 - INFO:  get_single:0.0064615970477461815
09-April-23 21:54:35 - INFO:  get_single:0.023246596567332745
09-April-23 21:54:35 - INFO:  get_single:0.08410419337451458
09-April-23 21:54:35 - INFO:  get_single:0.02494086977094412
09-April-23 21:54:35 - INFO:  get_single:0.00192173570394516
09-April-23 21:54:35 - INFO:  get_single:0.033990261144936085
09-April-23 21:54:35 - INFO:  get_single:0.013542093336582184
09-April-23 21:54:36 - INFO:  get_single:0.004651905037462711
09-April-23 21:54:36 - INFO:  get_single:0.0009916368871927261
09-April-23 21:54:36 - INFO:  get_single:0.0037311306223273277
09-April-23 21:54:36 - INFO:  get_single:0.022314666770398617
09-April-23 21:54:36 - INFO:  get_single:0.004213918931782246
09-April-23 21:54:36 - INFO:  get_single:0.0012423684820532799
09-April-23 21:54:36 - INFO:  get_single:0.04587373975664377
09-April-23 21:54:36 - INFO:  get_single:0.00425240583717823
09-April-23 21:54:36 - INFO:  get_single:0.0032638823613524437
09-April-23 21:54:36 - INFO:  get_single:0.013764618895947933
09-April-23 21:54:36 - INFO:  get_single:0.07894751243293285
09-April-23 21:54:36 - INFO:  get_single:0.0009071100503206253
09-April-23 21:54:36 - INFO:  get_single:0.002855101600289345
09-April-23 21:54:36 - INFO:  get_single:0.0020674560219049454
09-April-23 21:54:36 - INFO:  get_single:0.006368111819028854
09-April-23 21:54:36 - INFO:  get_single:0.001452130265533924
09-April-23 21:54:36 - INFO:  get_single:0.027760900557041168
09-April-23 21:54:36 - INFO:  get_single:0.023149906657636166
09-April-23 21:54:36 - INFO:  get_single:0.01038630772382021
09-April-23 21:54:36 - INFO:  get_single:0.012366604059934616
09-April-23 21:54:37 - INFO:  get_single:0.010662337765097618
09-April-23 21:54:37 - INFO:  get_single:0.012344899587333202
09-April-23 21:54:37 - INFO:  get_single:0.007669888436794281
09-April-23 21:54:37 - INFO:  get_single:0.014941222965717316
09-April-23 21:54:37 - INFO:  get_single:0.005676392465829849
09-April-23 21:54:37 - INFO:  get_single:0.0015263864770531654
09-April-23 21:54:37 - INFO:  get_single:0.0011925389990210533
09-April-23 21:54:37 - INFO:  get_single:0.006746462546288967
09-April-23 21:54:38 - INFO:  get_single:0.000649712048470974
09-April-23 21:54:38 - INFO:  get_single:0.004478492774069309
09-April-23 21:54:38 - INFO:  get_single:0.0012894272804260254
09-April-23 21:54:38 - INFO:  get_single:0.007249042391777039
09-April-23 21:54:38 - INFO:  get_single:0.0015162760391831398
09-April-23 21:54:38 - INFO:  get_single:0.01664401963353157
09-April-23 21:54:39 - INFO:  get_single:0.0017736274749040604
09-April-23 21:54:39 - INFO:  get_single:0.004125649109482765
09-April-23 21:54:39 - INFO:  get_single:0.03373114485293627
09-April-23 21:54:39 - INFO:  get_single:0.004760670475661755
09-April-23 21:54:39 - INFO:  get_single:0.02626217994838953
09-April-23 21:54:39 - INFO:  get_single:0.05526535399258137
09-April-23 21:54:39 - INFO:  get_single:0.020688144490122795
09-April-23 21:54:39 - INFO:  get_single:0.013543473556637764
09-April-23 21:54:39 - INFO:  get_single:0.005429900251328945
09-April-23 21:54:39 - INFO:  get_single:0.0185203580185771
09-April-23 21:54:40 - INFO:  get_single:0.005263040773570538
09-April-23 21:54:40 - INFO:  get_single:0.0012076152488589287
09-April-23 21:54:40 - INFO:  get_single:0.0018258579075336456
09-April-23 21:54:40 - INFO:  get_single:0.03730665612965822
09-April-23 21:54:40 - INFO:  get_single:0.014486960135400295
09-April-23 21:54:40 - INFO:  get_single:0.04121593851596117
09-April-23 21:54:40 - INFO:  get_single:0.008743700571358204
09-April-23 21:54:40 - INFO:  get_single:0.01123237144201994
09-April-23 21:54:40 - INFO:  get_single:0.004327626898884773
09-April-23 21:54:41 - INFO:  get_single:0.0007437411695718765
09-April-23 21:54:41 - INFO:  get_single:0.0006067696958780289
09-April-23 21:54:41 - INFO:  get_single:0.021640495397150517
09-April-23 21:54:41 - INFO:  get_single:0.013393855653703213
09-April-23 21:54:41 - INFO:  get_single:0.01437129732221365
09-April-23 21:54:41 - INFO:  get_single:0.00414531584829092
09-April-23 21:54:41 - INFO:  get_single:0.10350174177438021
09-April-23 21:54:41 - INFO:  get_single:0.01695187110453844
09-April-23 21:54:42 - INFO:  get_single:0.007180501706898212
09-April-23 21:54:42 - INFO:  get_single:0.013578790239989758
09-April-23 21:54:42 - INFO:  get_single:0.011405900120735168
09-April-23 21:54:42 - INFO:  get_single:0.02851545810699463
09-April-23 21:54:42 - INFO:  get_single:0.04309675842523575
09-April-23 21:54:42 - INFO:  get_single:0.10864222329109907
09-April-23 21:54:42 - INFO:  get_single:0.011323336511850357
09-April-23 21:54:42 - INFO:  get_single:0.010573557578027248
09-April-23 21:54:42 - INFO:  get_single:0.012153398245573044
09-April-23 21:54:42 - INFO:  get_single:0.005967543460428715
09-April-23 21:54:42 - INFO:  get_single:0.006416431628167629
09-April-23 21:54:42 - INFO:  get_single:0.0014753900468349457
09-April-23 21:54:42 - INFO:  get_single:0.0011425251141190529
09-April-23 21:54:43 - INFO:  get_single:0.0036027003079652786
09-April-23 21:54:43 - INFO:  get_single:0.0244248416274786
09-April-23 21:54:43 - INFO:  get_single:0.04799902904778719
09-April-23 21:54:43 - INFO:  get_single:0.01498826127499342
09-April-23 21:54:43 - INFO:  get_single:0.011688780970871449
09-April-23 21:54:43 - INFO:  get_single:0.002390630543231964
09-April-23 21:54:43 - INFO:  get_single:0.01186645682901144
09-April-23 21:54:43 - INFO:  get_single:0.013627388514578342
09-April-23 21:54:43 - INFO:  get_single:0.04400350805372
09-April-23 21:54:43 - INFO:  get_single:0.006163430400192738
09-April-23 21:54:44 - INFO:  get_single:0.024349519051611423
09-April-23 21:54:44 - INFO:  get_single:0.014485111460089684
09-April-23 21:54:44 - INFO:  get_single:0.0018646148964762688
09-April-23 21:54:44 - INFO:  get_single:0.006485026329755783
09-April-23 21:54:44 - INFO:  get_single:0.011101402342319489
09-April-23 21:54:44 - INFO:  get_single:0.0066509610041975975
09-April-23 21:54:44 - INFO:  get_single:0.003858642652630806
09-April-23 21:54:44 - INFO:  get_single:0.016818681731820107
09-April-23 21:54:44 - INFO:  get_single:0.0012643113732337952
09-April-23 21:54:44 - INFO:  get_single:0.01421760767698288
09-April-23 21:54:45 - INFO:  get_single:0.12016020063310862
09-April-23 21:54:45 - INFO:  get_single:0.004139670170843601
09-April-23 21:54:45 - INFO:  get_single:0.020602175034582615
09-April-23 21:54:45 - INFO:  get_single:0.0193911325186491
09-April-23 21:54:45 - INFO:  get_single:0.009061340242624283
09-April-23 21:54:45 - INFO:  get_single:0.02235260047018528
09-April-23 21:54:45 - INFO:  get_single:0.0008147452026605606
09-April-23 21:54:45 - INFO:  get_single:0.0728650614619255
09-April-23 21:54:45 - INFO:  get_single:0.05966939311474562
09-April-23 21:54:45 - INFO:  get_single:0.006410002708435059
09-April-23 21:54:46 - INFO:  get_single:0.009662210009992123
09-April-23 21:54:46 - INFO:  get_single:0.00297681987285614
09-April-23 21:54:46 - INFO:  get_single:0.004733609966933727
09-April-23 21:54:46 - INFO:  get_single:0.010176901705563068
09-April-23 21:54:46 - INFO:  get_single:0.00199123565107584
09-April-23 21:54:46 - INFO:  get_single:0.001978175714612007
09-April-23 21:54:46 - INFO:  get_single:0.015138828195631504
09-April-23 21:54:46 - INFO:  get_single:0.006642226129770279
09-April-23 21:54:46 - INFO:  get_single:0.0008335737511515617
09-April-23 21:54:46 - INFO:  get_single:0.0007257908582687378
09-April-23 21:54:46 - INFO:  get_single:0.001603499986231327
09-April-23 21:54:46 - INFO:  get_single:0.0019099675118923187
09-April-23 21:54:46 - INFO:  get_single:0.006468507461249828
09-April-23 21:54:47 - INFO:  get_single:0.009895320050418377
09-April-23 21:54:47 - INFO:  get_single:0.004218929447233677
09-April-23 21:54:47 - INFO:  get_single:0.002054871991276741
09-April-23 21:54:47 - INFO:  get_single:0.016092374920845032
09-April-23 21:54:47 - INFO:  get_single:0.0013512903824448586
09-April-23 21:54:47 - INFO:  get_single:0.0005881395190954208
09-April-23 21:54:47 - INFO:  get_single:0.005916395224630833
09-April-23 21:54:47 - INFO:  get_single:0.002269687131047249
09-April-23 21:54:47 - INFO:  get_single:0.012880630791187286
09-April-23 21:54:47 - INFO:  get_single:0.0054318662732839584
09-April-23 21:54:48 - INFO:  get_single:0.004636645317077637
09-April-23 21:54:48 - INFO:  get_single:0.043581861071288586
09-April-23 21:54:48 - INFO:  get_single:0.006716329604387283
09-April-23 21:54:48 - INFO:  get_single:0.0068936096504330635
09-April-23 21:54:48 - INFO:  get_single:0.034442491829395294
09-April-23 21:54:48 - INFO:  get_single:0.0023690341040492058
09-April-23 21:54:48 - INFO:  get_single:0.027957252226769924
09-April-23 21:54:48 - INFO:  get_single:0.0069357240572571754
09-April-23 21:54:48 - INFO:  get_single:0.020566033199429512
09-April-23 21:54:48 - INFO:  get_single:0.014255364425480366
09-April-23 21:54:48 - INFO:  get_single:0.00962839275598526
09-April-23 21:54:48 - INFO:  get_single:0.004208896309137344
09-April-23 21:54:49 - INFO:  get_single:0.03301747050136328
09-April-23 21:54:49 - INFO:  get_single:0.010909553617238998
09-April-23 21:54:49 - INFO:  get_single:0.018466545268893242
09-April-23 21:54:49 - INFO:  get_single:0.044640627689659595
09-April-23 21:54:49 - INFO:  get_single:0.0047863805666565895
09-April-23 21:54:49 - INFO:  get_single:0.00770269799977541
09-April-23 21:54:49 - INFO:  get_single:0.003351716324687004
09-April-23 21:54:49 - INFO:  get_single:0.010471463203430176
09-April-23 21:54:49 - INFO:  get_single:0.009478837251663208
09-April-23 21:54:49 - INFO:  get_single:0.011921512894332409
09-April-23 21:54:49 - INFO:  get_single:0.004058012738823891
09-April-23 21:54:50 - INFO:  get_single:0.010503740981221199
09-April-23 21:54:50 - INFO:  get_single:0.10319823026657104
09-April-23 21:54:50 - INFO:  get_single:0.0025110337883234024
09-April-23 21:54:50 - INFO:  get_single:0.003106837160885334
09-April-23 21:54:50 - INFO:  get_single:0.0047672586515545845
09-April-23 21:54:50 - INFO:  get_single:0.011624293401837349
09-April-23 21:54:50 - INFO:  get_single:0.024203232489526272
09-April-23 21:54:50 - INFO:  get_single:0.002650514245033264
09-April-23 21:54:50 - INFO:  get_single:0.002414305694401264
09-April-23 21:54:50 - INFO:  get_single:0.015664863400161266
09-April-23 21:54:50 - INFO:  get_single:0.039771659299731255
09-April-23 21:54:51 - INFO:  get_single:0.05995074100792408
09-April-23 21:54:51 - INFO:  get_single:0.0017256727442145348
09-April-23 21:54:51 - INFO:  get_single:0.000874573364853859
09-April-23 21:54:51 - INFO:  get_single:0.0037354128435254097
09-April-23 21:54:51 - INFO:  get_single:0.00616030115634203
09-April-23 21:54:51 - INFO:  get_single:0.016278304159641266
09-April-23 21:54:51 - INFO:  get_single:0.00587488804012537
09-April-23 21:54:52 - INFO:  get_single:0.024133477360010147
09-April-23 21:54:52 - INFO:  get_single:0.009780323132872581
09-April-23 21:54:52 - INFO:  get_single:0.010912722907960415
09-April-23 21:54:52 - INFO:  get_single:0.0071373796090483665
09-April-23 21:54:52 - INFO:  get_single:0.014592957682907581
09-April-23 21:54:52 - INFO:  get_single:0.0011770883575081825
09-April-23 21:54:52 - INFO:  get_single:0.013401691801846027
09-April-23 21:54:53 - INFO:  get_single:0.012479719705879688
09-April-23 21:54:53 - INFO:  get_single:0.007779248058795929
09-April-23 21:54:53 - INFO:  get_single:0.014590187929570675
09-April-23 21:54:53 - INFO:  get_single:0.022187727503478527
09-April-23 21:54:53 - INFO:  get_single:0.0040839239954948425
09-April-23 21:54:53 - INFO:  get_single:0.004672493785619736
09-April-23 21:54:53 - INFO:  get_single:0.014304758049547672
09-April-23 21:54:53 - INFO:  get_single:0.008466084487736225
09-April-23 21:54:53 - INFO:  get_single:0.00925485324114561
09-April-23 21:54:53 - INFO:  get_single:0.003620176576077938
09-April-23 21:54:53 - INFO:  get_single:0.06520787067711353
09-April-23 21:54:53 - INFO:  get_single:0.06877313926815987
09-April-23 21:54:53 - INFO:  get_single:0.10339963063597679
09-April-23 21:54:53 - INFO:  get_single:0.027249038219451904
09-April-23 21:54:53 - INFO:  get_single:0.031387186609208584
09-April-23 21:54:54 - INFO:  get_single:0.006308510899543762
09-April-23 21:54:54 - INFO:  get_single:0.0053452132269740105
09-April-23 21:54:54 - INFO:  get_single:0.02493765577673912
09-April-23 21:54:54 - INFO:  get_single:0.01507419440895319
09-April-23 21:54:54 - INFO:  get_single:0.011701737530529499
09-April-23 21:54:54 - INFO:  get_single:0.001385210081934929
09-April-23 21:54:54 - INFO:  get_single:0.006970373913645744
09-April-23 21:54:54 - INFO:  get_single:0.005468207411468029
09-April-23 21:54:55 - INFO:  get_single:0.0008550733327865601
09-April-23 21:54:55 - INFO:  get_single:0.0007617250084877014
09-April-23 21:54:55 - INFO:  get_single:0.012544517405331135
09-April-23 21:54:55 - INFO:  get_single:0.012636658735573292
09-April-23 21:54:55 - INFO:  get_single:0.0003672400489449501
09-April-23 21:54:55 - INFO:  get_single:0.04087904840707779
09-April-23 21:54:55 - INFO:  get_single:0.012041037902235985
09-April-23 21:54:55 - INFO:  get_single:0.018179986625909805
09-April-23 21:54:55 - INFO:  get_single:0.026116007938981056
09-April-23 21:54:55 - INFO:  get_single:0.01723363995552063
09-April-23 21:54:55 - INFO:  get_single:0.036006310023367405
09-April-23 21:54:55 - INFO:  get_single:0.04974963515996933
09-April-23 21:54:56 - INFO:  get_single:0.000999603420495987
09-April-23 21:54:56 - INFO:  get_single:0.004610604606568813
09-April-23 21:54:56 - INFO:  get_single:0.0025929883122444153
09-April-23 21:54:56 - INFO:  get_single:0.011870252899825573
09-April-23 21:54:56 - INFO:  get_single:0.004981229081749916
09-April-23 21:54:56 - INFO:  get_single:0.00927745271474123
09-April-23 21:54:56 - INFO:  get_single:0.01111406646668911
09-April-23 21:54:56 - INFO:  get_single:0.010517527349293232
09-April-23 21:54:56 - INFO:  get_single:0.04903374705463648
09-April-23 21:54:56 - INFO:  get_single:0.005477813072502613
09-April-23 21:54:56 - INFO:  get_single:0.013496634550392628
09-April-23 21:54:56 - INFO:  get_single:0.004267293028533459
09-April-23 21:54:57 - INFO:  get_single:0.015600684098899364
09-April-23 21:54:57 - INFO:  get_single:0.008359484374523163
09-April-23 21:54:57 - INFO:  get_single:0.0053544919937849045
09-April-23 21:54:57 - INFO:  get_single:0.05255396943539381
09-April-23 21:54:57 - INFO:  get_single:0.009376508183777332
09-April-23 21:54:58 - INFO:  get_single:0.007998017594218254
09-April-23 21:54:58 - INFO:  get_single:0.038707390427589417
09-April-23 21:54:58 - INFO:  get_single:0.011195098049938679
09-April-23 21:54:58 - INFO:  get_single:0.015270035713911057
09-April-23 21:54:58 - INFO:  get_single:0.07509547099471092
09-April-23 21:54:58 - INFO:  get_single:0.03526222053915262
09-April-23 21:54:58 - INFO:  get_single:0.0068361954763531685
09-April-23 21:54:58 - INFO:  get_single:0.005036159418523312
09-April-23 21:54:58 - INFO:  get_single:0.018295795656740665
09-April-23 21:54:58 - INFO:  get_single:0.06464420352131128
09-April-23 21:54:58 - INFO:  get_single:0.005791421048343182
09-April-23 21:54:58 - INFO:  get_single:0.010355493985116482
09-April-23 21:54:59 - INFO:  get_single:0.002472538501024246
09-April-23 21:54:59 - INFO:  get_single:0.002166593447327614
09-April-23 21:54:59 - INFO:  get_single:0.001180189661681652
09-April-23 21:54:59 - INFO:  get_single:0.005706568248569965
09-April-23 21:54:59 - INFO:  get_single:0.01060786284506321
09-April-23 21:54:59 - INFO:  get_single:0.006157278083264828
09-April-23 21:54:59 - INFO:  get_single:0.025749591179192066
09-April-23 21:54:59 - INFO:  get_single:0.0018442459404468536
09-April-23 21:54:59 - INFO:  get_single:0.013032466173171997
09-April-23 21:54:59 - INFO:  get_single:0.01765773445367813
09-April-23 21:54:59 - INFO:  get_single:0.0060443030670285225
09-April-23 21:55:00 - INFO:  get_single:0.005640003830194473
09-April-23 21:55:00 - INFO:  get_single:0.00533415749669075
09-April-23 21:55:00 - INFO:  get_single:0.023445443250238895
09-April-23 21:55:00 - INFO:  get_single:0.009399518370628357
09-April-23 21:55:00 - INFO:  get_single:0.049740773625671864
09-April-23 21:55:00 - INFO:  get_single:0.06415390688925982
09-April-23 21:55:00 - INFO:  get_single:0.10070652794092894
09-April-23 21:55:00 - INFO:  get_single:0.025593084283173084
09-April-23 21:55:00 - INFO:  get_single:0.006346362642943859
09-April-23 21:55:00 - INFO:  get_single:0.00734364241361618
09-April-23 21:55:00 - INFO:  get_single:0.025034346617758274
09-April-23 21:55:00 - INFO:  get_single:0.006427939049899578
09-April-23 21:55:00 - INFO:  get_single:0.0042046429589390755
09-April-23 21:55:01 - INFO:  get_single:0.005591707304120064
09-April-23 21:55:01 - INFO:  get_single:0.0009782388806343079
09-April-23 21:55:01 - INFO:  get_single:0.008539455942809582
09-April-23 21:55:01 - INFO:  get_single:0.0035277586430311203
09-April-23 21:55:01 - INFO:  get_single:0.002066614106297493
09-April-23 21:55:01 - INFO:  get_single:0.03818747401237488
09-April-23 21:55:01 - INFO:  get_single:0.017152758315205574
09-April-23 21:55:01 - INFO:  get_single:0.005462253466248512
09-April-23 21:55:01 - INFO:  get_single:0.01166531816124916
09-April-23 21:55:01 - INFO:  get_single:0.001667245291173458
09-April-23 21:55:01 - INFO:  get_single:0.0021652281284332275
09-April-23 21:55:01 - INFO:  get_single:0.005515607073903084
09-April-23 21:55:01 - INFO:  get_single:0.0007593538612127304
09-April-23 21:55:01 - INFO:  get_single:0.008860922418534756
09-April-23 21:55:02 - INFO:  get_single:0.010796880349516869
09-April-23 21:55:02 - INFO:  get_single:0.009434700012207031
09-April-23 21:55:02 - INFO:  get_single:0.03436962328851223
09-April-23 21:55:02 - INFO:  get_single:0.004474518820643425
09-April-23 21:55:02 - INFO:  get_single:0.02094042394310236
09-April-23 21:55:02 - INFO:  get_single:0.03589749988168478
09-April-23 21:55:02 - INFO:  get_single:0.032118139788508415
09-April-23 21:55:02 - INFO:  get_single:0.0155149195343256
09-April-23 21:55:03 - INFO:  get_single:0.059969061985611916
09-April-23 21:55:03 - INFO:  get_single:0.03530432190746069
09-April-23 21:55:03 - INFO:  get_single:0.07615331467241049
09-April-23 21:55:03 - INFO:  get_single:0.030439934693276882
09-April-23 21:55:03 - INFO:  get_single:0.0059364307671785355
09-April-23 21:55:03 - INFO:  get_single:0.026571878232061863
09-April-23 21:55:03 - INFO:  get_single:0.01942840777337551
09-April-23 21:55:03 - INFO:  get_single:0.008326645009219646
09-April-23 21:55:03 - INFO:  get_single:0.04367002844810486
09-April-23 21:55:03 - INFO:  get_single:0.03591051883995533
09-April-23 21:55:03 - INFO:  get_single:0.004516667686402798
09-April-23 21:55:04 - INFO:  get_single:0.011599062010645866
09-April-23 21:55:04 - INFO:  get_single:0.023775141686201096
09-April-23 21:55:04 - INFO:  get_single:0.02512178849428892
09-April-23 21:55:04 - INFO:  get_single:0.01173426490277052
09-April-23 21:55:04 - INFO:  get_single:0.025788540951907635
09-April-23 21:55:04 - INFO:  get_single:0.041053236462175846
09-April-23 21:55:04 - INFO:  get_single:0.012885099276900291
09-April-23 21:55:04 - INFO:  get_single:0.0011615939438343048
09-April-23 21:55:04 - INFO:  get_single:0.0007704254239797592
09-April-23 21:55:04 - INFO:  get_single:0.01122979260981083
09-April-23 21:55:04 - INFO:  get_single:0.004238852299749851
09-April-23 21:55:04 - INFO:  get_single:0.017457992769777775
09-April-23 21:55:05 - INFO:  get_single:0.011891113594174385
09-April-23 21:55:05 - INFO:  get_single:0.008458631113171577
09-April-23 21:55:05 - INFO:  get_single:0.0053850580006837845
09-April-23 21:55:05 - INFO:  get_single:0.003742549568414688
09-April-23 21:55:05 - INFO:  get_single:0.04985028691589832
09-April-23 21:55:05 - INFO:  get_single:0.0014180392026901245
09-April-23 21:55:05 - INFO:  get_single:0.0028617409989237785
09-April-23 21:55:05 - INFO:  get_single:0.0037059132009744644
09-April-23 21:55:05 - INFO:  get_single:0.05710945464670658
09-April-23 21:55:06 - INFO:  get_single:0.006529970094561577
09-April-23 21:55:06 - INFO:  get_single:0.006521670147776604
09-April-23 21:55:06 - INFO:  get_single:0.003743973560631275
09-April-23 21:55:06 - INFO:  get_single:0.007874056696891785
09-April-23 21:55:06 - INFO:  get_single:0.03344622813165188
09-April-23 21:55:06 - INFO:  get_single:0.04803050868213177
09-April-23 21:55:06 - INFO:  get_single:0.008808684535324574
09-April-23 21:55:06 - INFO:  get_single:0.030352742411196232
09-April-23 21:55:06 - INFO:  get_single:0.03377552796155214
09-April-23 21:55:06 - INFO:  get_single:0.0010021161288022995
09-April-23 21:55:06 - INFO:  get_single:0.006449738517403603
09-April-23 21:55:07 - INFO:  get_single:0.018313532695174217
09-April-23 21:55:07 - INFO:  get_single:0.0018975744023919106
09-April-23 21:55:07 - INFO:  get_single:0.0024026790633797646
09-April-23 21:55:07 - INFO:  get_single:0.016529105603694916
09-April-23 21:55:07 - INFO:  get_single:0.006707379594445229
09-April-23 21:55:07 - INFO:  get_single:0.06542905606329441
09-April-23 21:55:07 - INFO:  get_single:0.02921193279325962
09-April-23 21:55:07 - INFO:  get_single:0.014823484234511852
09-April-23 21:55:07 - INFO:  get_single:0.030939619056880474
09-April-23 21:55:07 - INFO:  get_single:0.040740717202425
09-April-23 21:55:08 - INFO:  get_single:0.012596785090863705
09-April-23 21:55:08 - INFO:  get_single:0.0037339050322771072
09-April-23 21:55:08 - INFO:  get_single:0.023279706947505474
09-April-23 21:55:08 - INFO:  get_single:0.06954582966864109
09-April-23 21:55:09 - INFO:  get_single:0.044185223057866096
09-April-23 21:55:09 - INFO:  get_single:0.03123743273317814
09-April-23 21:55:09 - INFO:  get_single:0.0004905043169856071
09-April-23 21:55:09 - INFO:  get_single:0.007402829825878143
09-April-23 21:55:09 - INFO:  get_single:0.004593792371451855
09-April-23 21:55:09 - INFO:  get_single:0.03178665414452553
09-April-23 21:55:09 - INFO:  get_single:0.00584772415459156
09-April-23 21:55:09 - INFO:  get_single:0.02316283993422985
09-April-23 21:55:09 - INFO:  get_single:0.009719084948301315
09-April-23 21:55:09 - INFO:  get_single:0.0005624014884233475
09-April-23 21:55:09 - INFO:  get_single:0.026858500204980373
09-April-23 21:55:09 - INFO:  get_single:0.013556355610489845
09-April-23 21:55:09 - INFO:  get_single:0.017949956469237804
09-April-23 21:55:09 - INFO:  get_single:0.0012094685807824135
09-April-23 21:55:09 - INFO:  get_single:0.005485129542648792
09-April-23 21:55:09 - INFO:  get_single:0.0054721524938941
09-April-23 21:55:09 - INFO:  get_single:0.037600260227918625
09-April-23 21:55:09 - INFO:  get_single:0.04481200873851776
09-April-23 21:55:09 - INFO:  get_single:0.009356473572552204
09-April-23 21:55:09 - INFO:  get_single:0.005767478607594967
09-April-23 21:55:09 - INFO:  get_single:0.019216788932681084
09-April-23 21:55:09 - INFO:  get_single:0.009528695605695248
09-April-23 21:55:10 - INFO:  get_single:0.03417556080967188
09-April-23 21:55:10 - INFO:  get_single:0.0005714576691389084
09-April-23 21:55:10 - INFO:  get_single:0.08781108446419239
09-April-23 21:55:10 - INFO:  get_single:0.045574676245450974
09-April-23 21:55:10 - INFO:  get_single:0.0058773839846253395
09-April-23 21:55:11 - INFO:  get_single:0.013225691393017769
09-April-23 21:55:11 - INFO:  get_single:0.0036251209676265717
09-April-23 21:55:11 - INFO:  get_single:0.03984022606164217
09-April-23 21:55:11 - INFO:  get_single:0.03781535942107439
09-April-23 21:55:11 - INFO:  get_single:0.002106139436364174
09-April-23 21:55:12 - INFO:  get_single:0.019364873878657818
09-April-23 21:55:12 - INFO:  get_single:0.015190248377621174
09-April-23 21:55:12 - INFO:  get_single:0.02172402013093233
09-April-23 21:55:12 - INFO:  get_single:0.030001387931406498
09-April-23 21:55:12 - INFO:  get_single:0.0017406167462468147
09-April-23 21:55:12 - INFO:  get_single:0.018997980281710625
09-April-23 21:55:12 - INFO:  get_single:0.011059951968491077
09-April-23 21:55:13 - INFO:  get_single:0.021086816675961018
09-April-23 21:55:13 - INFO:  get_single:0.02727304771542549
09-April-23 21:55:13 - INFO:  get_single:0.06034202314913273
09-April-23 21:55:13 - INFO:  get_single:0.005391684360802174
09-April-23 21:55:13 - INFO:  get_single:0.0685005048289895
09-April-23 21:55:13 - INFO:  get_single:0.015654959715902805
09-April-23 21:55:13 - INFO:  get_single:0.11407654918730259
09-April-23 21:55:13 - INFO:  get_single:0.016092837788164616
09-April-23 21:55:13 - INFO:  get_single:0.024683047086000443
09-April-23 21:55:13 - INFO:  get_single:0.00512500386685133
09-April-23 21:55:13 - INFO:  get_single:0.003294224850833416
09-April-23 21:55:13 - INFO:  get_single:0.0005251988768577576
09-April-23 21:55:14 - INFO:  get_single:0.006045377813279629
09-April-23 21:55:14 - INFO:  get_single:0.07469540275633335
09-April-23 21:55:14 - INFO:  get_single:0.001927942968904972
09-April-23 21:55:14 - INFO:  get_single:0.0017262976616621017
09-April-23 21:55:14 - INFO:  get_single:0.0008903425186872482
09-April-23 21:55:14 - INFO:  get_single:0.02305460534989834
09-April-23 21:55:14 - INFO:  get_single:0.11948396638035774
09-April-23 21:55:14 - INFO:  get_single:0.006306516006588936
09-April-23 21:55:14 - INFO:  get_single:0.021151977591216564
09-April-23 21:55:14 - INFO:  get_single:0.027860085479915142
09-April-23 21:55:14 - INFO:  get_single:0.009976825676858425
09-April-23 21:55:14 - INFO:  get_single:0.015909846872091293
09-April-23 21:55:14 - INFO:  get_single:0.03189720492810011
09-April-23 21:55:15 - INFO:  get_single:0.005392479710280895
09-April-23 21:55:15 - INFO:  get_single:0.0020461343228816986
09-April-23 21:55:15 - INFO:  get_single:0.004871971905231476
09-April-23 21:55:15 - INFO:  get_single:0.009261265397071838
09-April-23 21:55:15 - INFO:  get_single:0.007719795219600201
09-April-23 21:55:15 - INFO:  get_single:0.001993679441511631
09-April-23 21:55:15 - INFO:  get_single:0.014503027312457561
09-April-23 21:55:15 - INFO:  get_single:0.005459032021462917
09-April-23 21:55:15 - INFO:  get_single:0.01937306486070156
09-April-23 21:55:16 - INFO:  get_single:0.023366060107946396
09-April-23 21:55:16 - INFO:  get_single:0.010090787895023823
09-April-23 21:55:16 - INFO:  get_single:0.0026257727295160294
09-April-23 21:55:16 - INFO:  get_single:0.001102318987250328
09-April-23 21:55:16 - INFO:  get_single:0.004703352227807045
09-April-23 21:55:16 - INFO:  get_single:0.014807229861617088
09-April-23 21:55:16 - INFO:  get_single:0.056794204749166965
09-April-23 21:55:16 - INFO:  get_single:0.005172363482415676
09-April-23 21:55:16 - INFO:  get_single:0.0015105176717042923
09-April-23 21:55:16 - INFO:  get_single:0.0050514014437794685
09-April-23 21:55:16 - INFO:  get_single:0.015383444726467133
09-April-23 21:55:16 - INFO:  get_single:0.005564621649682522
09-April-23 21:55:16 - INFO:  get_single:0.0012101801112294197
09-April-23 21:55:16 - INFO:  get_single:0.011464780196547508
09-April-23 21:55:17 - INFO:  get_single:0.004673551768064499
09-April-23 21:55:17 - INFO:  get_single:0.005871124565601349
09-April-23 21:55:17 - INFO:  get_single:0.0050194598734378815
09-April-23 21:55:17 - INFO:  get_single:0.00902217160910368
09-April-23 21:55:17 - INFO:  get_single:0.07989620510488749
09-April-23 21:55:17 - INFO:  get_single:0.0025771474465727806
09-April-23 21:55:17 - INFO:  get_single:0.03748655691742897
09-April-23 21:55:17 - INFO:  get_single:0.024128582328557968
09-April-23 21:55:17 - INFO:  get_single:0.003195938654243946
09-April-23 21:55:17 - INFO:  get_single:0.021154134534299374
09-April-23 21:55:17 - INFO:  get_single:0.0007937606424093246
09-April-23 21:55:18 - INFO:  get_single:0.0029999883845448494
09-April-23 21:55:18 - INFO:  get_single:0.003357050009071827
09-April-23 21:55:18 - INFO:  get_single:0.0025396114215254784
09-April-23 21:55:18 - INFO:  get_single:0.0045485347509384155
09-April-23 21:55:18 - INFO:  get_single:0.004714080132544041
09-April-23 21:55:18 - INFO:  get_single:0.03594340290874243
09-April-23 21:55:18 - INFO:  get_single:0.010253772139549255
09-April-23 21:55:18 - INFO:  get_single:0.006721364334225655
09-April-23 21:55:18 - INFO:  get_single:0.004133186303079128
09-April-23 21:55:18 - INFO:  get_single:0.0007526054978370667
09-April-23 21:55:19 - INFO:  get_single:0.05475048068910837
09-April-23 21:55:19 - INFO:  get_single:0.02974050585180521
09-April-23 21:55:19 - INFO:  get_single:0.029134035110473633
09-April-23 21:55:19 - INFO:  get_single:0.013924586586654186
09-April-23 21:55:19 - INFO:  get_single:0.023506034165620804
09-April-23 21:55:19 - INFO:  get_single:0.05344013124704361
09-April-23 21:55:19 - INFO:  get_single:0.018471659161150455
09-April-23 21:55:19 - INFO:  get_single:0.005666024051606655
09-April-23 21:55:19 - INFO:  get_single:0.04722428508102894
09-April-23 21:55:19 - INFO:  get_single:0.10472286865115166
09-April-23 21:55:20 - INFO:  get_single:0.015153427608311176
09-April-23 21:55:20 - INFO:  get_single:0.01616679783910513
09-April-23 21:55:20 - INFO:  get_single:0.017707432620227337
09-April-23 21:55:20 - INFO:  get_single:0.005447991192340851
09-April-23 21:55:20 - INFO:  get_single:0.0019694073125720024
09-April-23 21:55:20 - INFO:  get_single:0.001001838594675064
09-April-23 21:55:20 - INFO:  get_single:0.0007597329095005989
09-April-23 21:55:20 - INFO:  get_single:0.017478691413998604
09-April-23 21:55:20 - INFO:  get_single:0.0020586522296071053
09-April-23 21:55:20 - INFO:  get_single:0.011791455559432507
09-April-23 21:55:21 - INFO:  get_single:0.013112293556332588
09-April-23 21:55:21 - INFO:  get_single:0.029932456091046333
09-April-23 21:55:21 - INFO:  get_single:0.0027929535135626793
09-April-23 21:55:21 - INFO:  get_single:0.02372507844120264
09-April-23 21:55:21 - INFO:  get_single:0.010715488344430923
09-April-23 21:55:21 - INFO:  get_single:0.0061522601172327995
09-April-23 21:55:22 - INFO:  get_single:0.006272682920098305
09-April-23 21:55:22 - INFO:  get_single:0.0014945734292268753
09-April-23 21:55:22 - INFO:  get_single:0.04635900631546974
09-April-23 21:55:22 - INFO:  get_single:0.016546867787837982
09-April-23 21:55:22 - INFO:  get_single:0.01596277393400669
09-April-23 21:55:22 - INFO:  get_single:0.07035056874155998
09-April-23 21:55:22 - INFO:  get_single:0.005376148968935013
09-April-23 21:55:22 - INFO:  get_single:0.01759920734912157
09-April-23 21:55:22 - INFO:  get_single:0.007267454639077187
09-April-23 21:55:23 - INFO:  get_single:0.009563462808728218
09-April-23 21:55:23 - INFO:  get_single:0.04168075509369373
09-April-23 21:55:23 - INFO:  get_single:0.017454774118959904
09-April-23 21:55:23 - INFO:  get_single:0.009408831596374512
09-April-23 21:55:23 - INFO:  get_single:0.07962045539170504
09-April-23 21:55:23 - INFO:  get_single:0.032959635369479656
09-April-23 21:55:23 - INFO:  get_single:0.011465747840702534
09-April-23 21:55:23 - INFO:  get_single:0.006563790142536163
09-April-23 21:55:23 - INFO:  get_single:0.04251518566161394
09-April-23 21:55:24 - INFO:  get_single:0.036700534634292126
09-April-23 21:55:24 - INFO:  get_single:0.0016789520159363747
09-April-23 21:55:24 - INFO:  get_single:0.003840663470327854
09-April-23 21:55:24 - INFO:  get_single:0.0011812429875135422
09-April-23 21:55:24 - INFO:  get_single:0.0014663692563772202
09-April-23 21:55:24 - INFO:  get_single:0.0015209540724754333
09-April-23 21:55:24 - INFO:  get_single:0.014690189622342587
09-April-23 21:55:24 - INFO:  get_single:0.018590467050671577
09-April-23 21:55:24 - INFO:  get_single:0.010988449677824974
09-April-23 21:55:24 - INFO:  get_single:0.018633265048265457
09-April-23 21:55:25 - INFO:  get_single:0.01321281585842371
09-April-23 21:55:25 - INFO:  get_single:0.04356264881789684
09-April-23 21:55:25 - INFO:  get_single:0.024004468694329262
09-April-23 21:55:25 - INFO:  get_single:0.013407513499259949
09-April-23 21:55:25 - INFO:  get_single:0.013629375956952572
09-April-23 21:55:25 - INFO:  get_single:0.06587391626089811
09-April-23 21:55:25 - INFO:  get_single:0.012197794392704964
09-April-23 21:55:25 - INFO:  get_single:0.005435626953840256
09-April-23 21:55:25 - INFO:  get_single:0.042617942206561565
09-April-23 21:55:25 - INFO:  get_single:0.005152295343577862
09-April-23 21:55:26 - INFO:  get_single:0.001563526690006256
09-April-23 21:55:26 - INFO:  get_single:0.011261881329119205
09-April-23 21:55:26 - INFO:  get_single:0.02816856186836958
09-April-23 21:55:26 - INFO:  get_single:0.0027108974754810333
09-April-23 21:55:26 - INFO:  get_single:0.013403485529124737
09-April-23 21:55:26 - INFO:  get_single:0.01851619780063629
09-April-23 21:55:26 - INFO:  get_single:0.03167759347707033
09-April-23 21:55:26 - INFO:  get_single:0.0020118840038776398
09-April-23 21:55:26 - INFO:  get_single:0.029859543778002262
09-April-23 21:55:26 - INFO:  get_single:0.0005956981331110001
