Type,Name,Request Count,Failure Count,Median Response Time,Average Response Time,Min Response Time,Max Response Time,Average Content Size,Requests/s,Failures/s,50%,66%,75%,80%,90%,95%,98%,99%,99.9%,99.99%,100%
client-middleware,/CommunicationService/delMultiple,1298,0,360.0,368.74275012817145,5.512475967407227,1076.0273933410645,4.0,10.818938590875117,0.0,360,480,560,590,690,770,820,870,980,1100,1100
client-middleware,/CommunicationService/delSingle,1252,0,360.0,362.70373336042456,1.9159317016601562,1004.4827461242676,4.0,10.435524742508202,0.0,360,460,540,570,670,760,830,880,970,1000,1000
client-middleware,/CommunicationService/getMultiple,1237,0,430.0,447.032023170058,17.00758934020996,1146.0769176483154,20663.99434114794,10.310498487605948,0.0,430,550,630,670,780,870,940,1000,1100,1100,1100
client-middleware,/CommunicationService/getRange,1328,0,390.0,389.12433385849,5.9986114501953125,981.7564487457275,2026.682981927711,11.068991100679627,0.0,390,500,570,600,700,780,850,910,980,980,980
client-middleware,/CommunicationService/getSingle,1261,0,320.0,339.40616777073666,1.9996166229248047,946.4881420135498,15.355273592386995,10.510540495449556,0.0,320,430,500,540,650,740,840,870,950,950,950
client-middleware,/CommunicationService/setMultiple,1302,0,450.0,466.73492883573846,27.350187301635742,1254.7318935394287,4.0,10.852278925515717,0.0,450,580,650,700,820,920,1000,1100,1200,1300,1300
client-middleware,/CommunicationService/setSingle,1264,0,370.0,373.44594922246813,2.0012855529785156,1031.9912433624268,4.0,10.535545746430007,0.0,370,480,540,580,680,760,840,890,940,1000,1000
,Aggregated,8942,0,380.0,392.5502825519218,1.9159317016601562,1254.7318935394287,3164.0150972936704,74.53231808906418,0.0,380,500,570,610,720,810,890,950,1100,1300,1300
