Type,Name,Request Count,Failure Count,Median Response Time,Average Response Time,Min Response Time,Max Response Time,Average Content Size,Requests/s,Failures/s,50%,66%,75%,80%,90%,95%,98%,99%,99.9%,99.99%,100%
direct_client,del_multiples,2436,0,89,95.22352204925713,2.9129981994628906,1304.0037155151367,51.0,20.254352538357505,0.0,89,120,130,140,170,190,210,230,1100,1300,1300
direct_client,del_single,2295,0,89,94.49503156873915,0.9748935699462891,1456.6669464111328,51.0,19.081994694388538,0.0,89,120,130,140,160,180,220,240,970,1500,1500
direct_client,get_multiples,2373,0,110.0,109.72864920209844,18.98670196533203,1473.717212677002,8056.0,19.730533076158604,0.0,110,130,150,160,180,200,240,260,820,1500,1500
direct_client,get_range,2262,0,89,92.26207518134889,2.5093555450439453,1268.1317329406738,872.0,18.80761307133197,0.0,89,110,130,140,160,180,210,230,650,1300,1300
direct_client,get_single,2374,0,88,91.73274743225561,0.9667873382568359,1656.5048694610596,88.0,19.738847670796684,0.0,88,110,130,140,160,180,210,240,500,1700,1700
direct_client,set_multiples,4655,0,100.0,108.98166906436711,20.722389221191406,1526.625156402588,51.0,38.70443804025213,0.0,100,130,140,150,180,200,250,300,1000,1500,1500
direct_client,set_single,2311,0,91,92.47622764353007,0.9753704071044922,816.1985874176025,51.0,19.215028208597783,0.0,91,120,130,140,160,180,220,230,620,820,820
,Aggregated,18706,0,94,99.2574184626344,0.9667873382568359,1656.5048694610596,1170.4699561637976,155.53280729988322,0.0,94,120,140,150,170,190,230,250,900,1500,1700
