    To Our Shareholders:


                                                                                                       statutory written premiums reached
                                                           Your company set new records in
                                                                                 $3.076 billion, up 2.6 percent compared with
                                                       2005, with net income up 3.1 percent to

                                                                                                       A.M. Best's estimate of 0.7 percent industry
                                                       $602 million and operating income up
        
                                                                                                       growth. Life insurance written premiums
                                   7.3 percent to $562 million. This was the
                                                                                                       reached $205 million, up 6.6 percent.
                                                       fourth consecutive year of higher property
                                                                                                       Statutory property casualty surplus, a key
                                                       casualty underwriting profits. Investment
                                    2,919 3,058
                                              2,254




                                                                                                       measure of financial strength, remained
                          2,653                        income set another record, continuing our
                                     2,126




                2,391
                           1,908




     2,073                                                                                             exceptionally strong at $4.194 billion.
                 1,721




                                                       unbroken string of year-over-year increases
       1,453




                                                       in this measure.
                                                                                                       Issues and Perspectives
                                                           Dividends from our Fifth Third Bancorp
                                                                                                          Looking beyond 2005's very satisfactory
                    



                                                       common stock added $106 million to
                                                                                                       numbers, certain trends suggest that 2006

                                                       investment income, which in total
                                                                                                       will be a challenging year for our industry
    Property casualty net earned premiums
                                                       contributed $526 million to earnings before
    increased 4.8 percent in 2005. On the
                                                                                                       and for your company. We anticipate that our
    statutory basis that facilitates industry
                                                       taxes. The growth rate reached 6.9 percent,
    comparisons, net written premiums rose
                                                                                                       results may be tempered by our decisions to
    2.6 percent, and the company continued
                                                       and we anticipate another good year in 2006,
    its track record of outpacing industry                                                             give up short-term gain in order to achieve
    growth, estimated at 0.7 percent.
                                                       in the same 6.5 percent to 7.0 percent range.
                                                                                                       long-term results. Briefly, these are the issues
                                                       Lower unrealized gains in our investment
                                                                                                       and our perspective:
                                                       portfolio in 2005, due primarily to a lower
                                                                                                        The property casualty insurance
                                                       year-end market value of the Fifth Third
                                                                                                          marketplace. Pricing on commercial lines
                                                       stock, led to book value of $34.88 versus          business, the source of 71 percent of our
    
                                                       $35.60 at year-end 2004. Return on equity          premium revenues, is softening. It's
  
                                                                                                          increasingly difficult to take business
                                                       improved to 9.8 percent from 9.4 percent,
                                                                                                          away from the quality insurers that are
                                                       while return on equity including
                                                                                                          our main competition in our agents'
                                                       comprehensive income declined to
                                                                                                          offices. After a few good years, there is
                                                       1.6 percent from 4.6 percent, also reflecting
                                                                                                          plenty of capital and surplus to support
                                     16,107

                                              16,003




                                                       year-end market values.                            growth, and every insurer wants to put it
                           15,509




                                                           The cumulative, steady efforts of our          to work. And, while we focused on
                                                       independent agents and our associates over         restoring personal lines profitability in
                                                                                                          2005, other carriers refined their pricing
                 14,122




                                                       the past several years once again showed
       13,964




                                                                                                          models and began reducing their prices
                                                       results. Property casualty underwriting
                                                                                                          for good accounts. Even as we earned a
                                                       profits rose 10.8 percent, contributing
                                                                              full-year underwriting profit on personal
                                                       $330 million before taxes. The statutory
    Over the past five years, assets grew at                                                              lines for the first time since 1999, we
    a 3.8 percent compound annual rate,
                                                       combined ratio improved to 89.0 percent            began working on plans to resume
    primarily because of 2.3 percent compound
    annual growth in invested assets.
                                                       from 89.4 percent, with commercial lines           personal lines growth.
                                                       continuing strong at 87.1 percent and              As a result, we are projecting that our
                                                       personal lines improving more than 10 points       2006 written premiums will be flat to
                                                                                                          slightly up, with modest growth in
                                                       to 94.3 percent. A.M. Best Co. estimates
                                                                                                          commercial lines offsetting a decline in
                                                       the industry's 2005 combined ratio at
    2005 10-K
                                                                                                          personal lines.
    For a detailed review of the                       102 percent.
                                                                                                        Expenses. Your company is investing in
    company's 2006 outlook, please
                                                           With increased competition in the current
                                                                                                          our future. Infrastructure improvements
    see the Executive Summary,
                                                       marketplace, our 2005 property casualty
                                                                                                          include major automation projects that
    10-K Pages 31-35.



                                                increase
  improve service to and communication
                                                 our 2006
  with our agencies. We are incurring
                                                 retentions,
  expenses for new project development as
                                                 the
  well as deployment and enhancement of
                                                 deductible-
  systems in operation. Current earnings
                                                 like
  also are charged for the previously
                                                 amounts
  capitalized costs of developing the
                                                 that we
  systems now in operation. We've also
                                                                John J. Schiff, Jr., CPCU, chairman,
                                                 would pay president and chief executive officer
  added staff to work on these projects and
                                                                                                       
                                                 before our
  to service our growing business. And in
                                                                                                       
                                                 reinsurers would cover some or all of our
  2006, we will begin expensing options as
                                                                                                       
                                                 excess losses.
  required, with a per-share earnings impact
                                                                                                       
  of about 2 cents per quarter.                 Reserve development. Insurers set aside               
                                                 loss reserves from current earnings for
  For both commercial lines and personal                                                              
                                                 claims that are still in the settlement
  lines, lower 2006 earned premium                                                                    
                                                 process or that have not yet been reported.
  growth could contribute to a higher                                                                  
                                                 Generally, as time goes on, we study
  expense ratio as we continue investing in                                                            
                                                 those reserves and adjust them if claims
  our infrastructure. Overall, we expect to
                                                 are coming in lower or higher than
  achieve a property casualty combined
                                                 anticipated, with a corresponding benefit
  ratio in the range of 92 percent to
                                                 or charge to current earnings. In 2004 and
  94 percent, which would be excellent but
                                                 2005, underwriting income and combined
  would not match our outstanding
                                                 ratios benefited from higher-than-normal
  89.2 percent GAAP ratio in 2005.
                                                 favorable development of reserves.
 Catastrophes and reinsurance. After two
                                                 While we anticipate a benefit again in
  years of multiple hurricanes and other
                                                 2006, we expect it may improve our
  catastrophe losses, most observers believe
                                                 combined ratio 2 to 3 percentage points,
  we are in a period with higher potential
                                                 compared with 5.7 points in 2005 and
  for severe weather. Our 2005 catastrophe
                                                 6.7 points in 2004.
  losses were $127 million compared with
  $148 million in 2004 and $97 million in
                                               Productivity Drives Opportunities
  2003, including ceded and assumed
                                                  While these trends could pressure your
  reinsurance. Considering this trend,
                                               company's short-term performance, we
  along with our increased retention under
                                               nevertheless remain very confident about the
  2006 reinsurance agreements, we believe
  catastrophe losses could contribute          future. We have seen soft market pricing
  between 4.0 to 4.5 percentage points         before and know that our best approach is to
                                                                                                       
  to our 2006 combined ratio, slightly         price every account in line with the risk we           
  above historic levels.
                                               assume, continuing to target a profit in our           
  We expect premium costs for all of our
                                               overall insurance underwriting. We are                  
  2006 property casualty reinsurance                                                                  
                                               patient, and we have proven capable of
  agreements to be about $7 million less                                                              
                                               achieving industry-leading results, seeing
  than 2005, without taking into account the
                                               opportunities in all market cycles.
  reinstatement premiums we paid in 2005.
  However, reinsurance costs for some             In May 2005, Independent Agent
  business lines are rising. Our savings       Magazine looked at the 19 "Tiffany class"
  primarily arose from the exceptional         U.S. publicly traded property casualty
  financial strength that allowed us to

                                                                                                                                       3
                                                                                                            of business, commercial auto and
                                                       insurers with the highest 2004 revenues.
    Property Casualty
    Statutory Surplus Ratio
                                                                                                            commercial packages. On the personal lines
                                                       Cincinnati Financial Corporation  No. 19 
                                                                                                            side, our Diamond policy processing system
                                                       stood at the top of the list for after-tax profits
         Net written premiums to surplus
         Estimated industry net written premiums
                                                                                                            is live, as of early 2006, in 10 states that
                                                       per employee.
         to surplus (A.M. Best)

                                                                                                            represent approximately 85 percent of total
                                                          You don't have to look far to find the
                1.3
                                                                                                            personal lines premium volume, and many
                                                       sources of this exceptional productivity.
                         1.2
       1.1                         1.1
                                            1.0                                                             agents are beginning to see the benefits of
                 1.1




                                                       Productivity Drives Progress
        1.0




                          1.0




                                                                                                            easier renewal processing.
                                                          Your company has made strides in
                                    0.7


                                             0.7




                                                                                                            People Drive Productivity
                                                       updating its technology. We're now placing
                                                                                                               The most important source of our
                                                       our forms libraries and state manuals online.
                                                                                                            productivity truly is our people. Their
                                                       Several business areas have eliminated
      2001 2002 2003 2004 2005
                                                                                                            effectiveness, above and beyond efficiency
                                                       waiting and duplication of effort by
    The company historically has maintained
    its ratio of net written premiums to
                                                                                                            or automation, leads to profits. From our
                                                       centralizing their files in online document
    statutory surplus below the industry
    average. The lower the ratio, the stronger
                                                                                                            14 investment portfolio managers
                                                       repositories, where they are simultaneously
    a property casualty insurer's security for
    policyholders and its capacity to support                                                               responsible for our $12.657 billion of
                                                       available on demand to multiple viewers.
    business growth. In 2004, the company
    transferred equity securities to the                                                                    securities, to our 100 field marketing
                                                       Life insurance and claims operations have
    property casualty subsidiary. The transfer
    accounted for most of the reduction in the                                                              representatives who manage agency
                                                       used this capability to streamline their
    ratio for 2005 and 2004.
                                                                                                            relationships and $282 million of new
                                                       processes and reduce turnaround time.
                                                                                                            commercial lines business, associates across
                                                       Cincinnati and our vendor were recognized
                                                                                                            the company are highly skilled and intensely
                                                       with a 2005 Best Practices Award from the
    Life Statutory Capital
    and Surplus Ratio
                                                                                                            alert to opportunities to contribute to your
                                                       Association for Information and Image
    (Percent)
                                                                                                            company's success.
                                                       Management for enabling field claims
         Adjusted capital and surplus to liabilities
         Estimated industry adjusted capital and
                                                                                                               In 2005, underwriters continued to pay
                                                       representatives to remotely capture, index
         surplus to liabilities (A.M. Best)

                                                                                                            particular attention to insurance-to-value and
                                                       and submit supplemental claim materials,
                                                                                                            risk transfer when renewing policies. Field
                                                       such as pictures and audio files, via an
        52.3




                                                                                                            claims associates, led by Vice President
                                                       Internet connection.
                                    40.2
                 39.7

                           39.2




                                                                                                            Charles "Bud" Stoneburner II, CPCU, as
                                              37.3




                                                          Our commercial lines department began
                                                                                                            of early 2005, responded to more than
                                                       imaging its files in 2005. By year-end, half
                                  10.7
       11.1                                 10.4
                         10.5                                                                               3,300 hurricane claims and more than
                10.0                                   of its teams were using online underwriting
                                                                                                            200,000 claims in total, paying all that was
                                                       and policy files for new business and
      2001 2002 2003 2004 2005                                                                              due under the policy and doing so with a
                                                       renewals, with plans to include the other half
    The ratio of statutory adjusted capital and                                                             human touch.
                                                       during 2006. Our commercial lines policy
    surplus to liabilities for Cincinnati Life
    remained at more than three times the
                                                       quoting system now is available in all of our
    estimated industry average in 2005,                                                                     The Relationship Mindset
    reflecting the financial stability of              states, for all major product lines.
                                                                                                               Your company's professional claims
    Cincinnati Life. The higher the ratio, the
    stronger a life insurer's security for                We launched a new, Web-based
                                                                                                            representatives continue to be our best
    policyholders and its capacity to support
    business growth.                                   commercial policy processing system,
                                                                                                            advertising program. Satisfied agents and
                                                       e-CLASTM, late in 2005. The initial release
                                                                                                            policyholders often report that they could
                                                       produces Ohio Businessowners Package
                                                                                                            pay less for a policy from another carrier but
                                                       policies. We have plans to extend the system
                                                                                                            refuse to give up the service of their local
                                                       in 2006 to our agents in additional states and
                                                                                                            Cincinnati field associates.
                                                       to start preparations for adding the next lines

4
                                                   the top two carriers in three-quarters.
    Cincinnati associates connect with their
                                                      The independent agencies we select are
customers, coming forward to meet their
                                                   recognized across our industry as strong
needs. That initiative extends to their                                                             2005 10-K
                                                   sales organizations. This year, the
community. In 2005, associates organized                                                            For a discussion of strategies
                                                                                                    to cultivate relationships with
                                                   Independent Insurance Agents & Brokers
relief for tsunami and Katrina survivors, in
                                                                                                    independent insurance agents,
                                                   of America gave one of our Minnesota
addition to participating in regular activities
                                                                                                    please see Our Business and
                                                   agents its most distinguished honor and
such as blood drives, school partnerships and                                                       Our Strategy, 10-K Pages 1-8.
                                                   named 36 Cincinnati agencies among just
fund drives for the arts and United Way.                                                            Details related to technology
                                                   139 chosen nationally for its 2005 Best
En masse, they put work aside for a few                                                             solutions are on 10-K
                                                   Practices Study Group. Another agency in         Pages 4-5, and details related
minutes, lining the streets in front of our
                                                                                                    to insurer financial strength
                                                   North Carolina earned Rough Notes'
headquarters offices to joyfully welcome a
                                                                                                    ratings are on 10-K Pages 5-7.
                                                   Marketing Agency of the Year title. These
local battalion back safely from Iraq and to
                                                   agencies market the worth of their service,
somberly salute soldiers who had sacrificed
                                                   their insurance skill and local knowledge
their lives.
                                                   along with Cincinnati product and service
    Deeply engaged with people, Cincinnati
                                                   advantages. What they offer is a step above
associates have the right mindset to create
                                                   the rest, positioning them to go on the
the strong agency relationships cited by both
                                                   offense as value players rather than compete
A.M. Best and Fitch Ratings as they
                                                   primarily on price.
affirmed your company's financial strength
                                                      We also go on the offense by continuously
ratings in 2005. The A++ from A.M. Best
                                                   improving products and tools and refining
places your company among the top
                                                   our underwriting guidelines and rate
1.6 percent of property casualty insurance
                                                   structures. During 2005, for example, we
groups. Moody's Investors Service and
                                                   introduced a new edition of our commercial
Standard & Poor's Ratings Services also
                                                   property form and our new Termsetter series
award very strong ratings to your company.
                                                   of life insurance products. In 2006, we are      2005 10-K
Franchise Worth
                                                                                                    For a detailed review of
                                                   working on improved worksite life products
   All of these superior ratings increase our                                                       investment operations, please
                                                   and enrollment software, as well as expanded
franchise value, attracting good agents by                                                          see Investments Results of
                                                   eligibility and coverage updates for our
                                                                                                    Operations, 10-K Pages 54-57.
giving them a sales point to emphasize with
                                                   Businessowners Package Policy. Your
the many insurance buyers who are willing
                                                   company's personal lines operations have
to pay a fair price for high quality protection.
                                                   moved into the profitable range. In 2006, we
In 2005, we began appointing agencies to
                                                   are working to improve our high policy
actively market in Delaware, our 32nd state
                                                   retention and attract desirable personal lines
of operations. New appointments pushed us
                                                   accounts by adjusting rates, increasing our
past the 1,000 mark to 1,024 agency
                                                   loss-free credit and incorporating insurance
relationships operating in 1,253 locations.
                                                   scores into our pricing.
Leveraging the Cincinnati claims and ratings
                                                   Steady Over Time
advantages, each reporting agency location
                                                      Our intention remains to be a steady
produced $2.5 million of business, on
                                                   market participant, capable of writing most
average, making us the top carrier within
                                                   types of accounts served by local agencies.
more than half of our agencies and one of

                                                                                                                                      5
                                                                                                   Poor's 500 Index. For the five years ending
                                                That steadiness is good for shareholders, too.
    Consolidated Pretax
    Investment Income
                                                                                                   December 31, 2005, our total return reached
                                                In a study published in 2005, Aon Re Global
    Less expenses
    (Dollars in millions)
                                                                                                   40.9 percent versus 2.8 percent for the
                                                listed Cincinnati Financial as the first runner-
                                                                                                   S&P 500. Cincinnati Financial has
                                                up among all commercial insurers for having
                                                                                                   outperformed the S&P 500 in 13 of the
                                                the lowest earnings volatility over a two-year
                                                                                                   past 16 years.
                                                period. Aon's premise is that less volatile
                                        526
                                492
                        465




                                                                                                      Over time, we seek to increase earnings
                                                earnings will, over time, lead to increased
               445
       421




                                                                                                   per share, book value and dividends at a rate
                                                shareholder value. It's a premise we share.
                                                                                                   that would allow long-term total return to
                                                    Over time, the effects of insurance pricing
                                                                                                   our shareholders to exceed that of the
                                                and economic cycles even out. At any point,
                                                                                                   Standard & Poor's Composite 1500 Property
                                                we choose to look past the peaks and valleys,
      2001 2002 2003 2004 2005
                                                                                                   Casualty Insurance Index. Our five-year total
                                                focusing on what it takes to assure growth
    Consolidated pretax investment income
                                                                                                   return matched the Index return.
                                                and profits over the longer term. That's the
    rose 6.9 percent in 2005. Dividend
    increases announced during 2005 by
                                                                                                      NASDAQ and Mergent, Inc., introduced a
                                                basis for our total return investment program
    companies whose common stocks are
    in the portfolio are expected to add
                                                                                                   new NASDAQ Dividend Achievers Index in
                                                and our emphasis on common stocks, which
    $15 million to investment income in 2006.
                                                                                                   February 2006, naming Cincinnati Financial
                                                make up 54.8 percent of our consolidated
                                                                                                   as a founding member. It is comprised of
                                                portfolio's market value.
                                                                                                   NASDAQ-listed companies that have
                                                    We like stocks with steadily increasing
                                                                                                   increased annual regular dividend payments
                                                dividends and potential for appreciation.
                                                                                                   for the last 10 or more consecutive years.
                                                While our financial stocks, including our
                                                                                                   In fact, your 2006 indicated annual
                                                largest holding in Fifth Third, are cyclical,
                                                                                                   dividend of $1.34 per share represents the
                                                they meet this longer-term investment
                                                                                                   46th consecutive year of increase.
                                                objective. In late 2005, we began selling our
                                                                                                      Your company's people are prepared to
                                                core holding in Alltel Corporation common
                                                                                                   rise above any challenges that 2006 may
                                                stock when its business model and outlook
                                                                                                   bring and to dedicate themselves to
                                                for dividend increases changed. With that
                                                                                                   increasing shareholder value, over time.
                                                sale complete early in 2006, we are investing
    2005 10-K
                                                the proceeds in line with our overall
    For a detailed review of the
                                                                                                   Respectfully,
                                                investment objectives.
    company's financial results and
                                                                                                  
                                                    Since 1996, the board of directors also
    condition, please see Financial
                                                                                                   John J. Schiff, Jr., CPCU
                                                has authorized investment in our own shares,
    Statements and Supplementary
                                                                                                   Chairman, President and
                                                including the most recent authorization of
    Data, 10-K Page 77, and Notes
    to Consolidated Financial                                                                      Chief Executive Officer
                                                10 million shares approved in August 2005.
    Statements, 10-K Page 84.
                                                                                                   March 10, 2006
                                                Your company returned $267 million to
                                                shareholders during 2005, including
                                                $63 million through repurchases of our
                                                common stock and $204 million of cash
                                                dividends paid. Shareholders also received a
                                                5 percent stock dividend in April. Total
                                                return to shareholders was 9.1 percent in
                                                2005 versus 4.9 percent for the Standard &


6
