Dear Fellow Investors




Hurricane Isabel started out as one of the                           Yet, it showcased our most important corporate
              greatest natural disasters in company history.                  strength --people with enormous pride in their work who
              Our response became the greatest example                        rose to meet the challenge directly, despite the hardship.
of ingenuity, cooperation and hard work I have yet                            They rebuilt our system swiftly and safely. The crisis also
encountered.                                                                  showed the strength of doing business in communities
                                                                              where we know the lay of the land, where customers are
In Crisis, A Showcase of Qualities                                            also friends, neighbors and even fellow investors.
Important to Today's Investor                                                     Weeks after the storm, on Halloween, we got a
Looking back, the storm exacted huge personal and                             photo by e-mail from a proud mother and customer whose
economic costs. About 1.8 million Dominion customers in                       little boy dressed up as a Dominion Virginia Power
Virginia and North Carolina lost power, many for days.                        "bucket truck guy."
Our employees left homes that were flooded and dam-                               We want that kind of feedback. We love it.
aged to spend days and nights repairing the system.                               The crisis also demonstrated our financial strength.
Workers came from as far as Texas and Quebec to help                          Our 2003 earnings reported under Generally Accepted
replace thousands of poles and transformers and string                        Accounting Principles (GAAP) include a $122 million
nearly a thousand miles of wire.                                              after-tax expense related to this massive --at times, heroic
                                                                              --effort. Investors recognized our ability to absorb
                                                                              the financial punch. Your share price remained steady
                                                                              throughout the ordeal.



                                                                      We Target 2004 Operating Earnings of
                                                                      $4.80 to $5.00 Per Share
                                                                      The likes of Isabel don't come around often.
                                                                             So we excluded its costs from our 2003 operating
                                                                      earnings. We think the most useful way to reveal our core
                                                                      earnings strength is to compare operating earnings
                                                                      adjusted for certain charges on a year-to-year basis. Such
                                                                      charges may come from losses created by a massive
                                                                      storm cleanup, restructuring costs or an investment gone
                                                                      bad. Gains created by asset sales or accounting changes
                                                                      also are excluded.
                                                                             Last year, excluding certain items, we fell short of
                                                                      operating earnings targets of $4.60 to $4.70 per share
                                                                      by reporting 2003 operating earnings of $4.55. Our
                                                                      2004 operating earnings targets are $4.80 to $5 per
                                                                      share and we assume about 5 percent growth in 2005.
                                                                      These targets, too, may exclude certain items we can't
                                                                      yet predict.
Nearly 600,000 customers were
restored to power during the first
24 hours after Hurricane Isabel.
By the end of the two-week
restoration effort, the company
had replaced thousands of utility
poles, cross-arms, spans of wire
and transformers.




The likes of Isabel
don't come around
often.




          
                                                                     a 16.2-percent increase in our share price, which closed


                                                                     the year at $63.83, up from $54.90 a year earlier. And


                                                                     it also includes your annual dividend of $2.58 per share,
            
                                                                     a 4-percent yield at year-end.
25

                                                            20.8
                                                                         Our dividend payout -- illustrated on a GAAP basis
20
                                              16.9
             16.5
                                                                     on page 24, but about 57 percent of operating earnings
                             15.9
15
                                                                     at current levels -- totaled more than $800 million last
10
                                                                     year. We've paid out more than 300 consecutive divi-
 5
                                                                     dends over the last 70 years.
 0
                                                                         Through recent market turmoil, I've made a special
                                                                     point to assure you that our existing dividend rate is
                                                                     secure. It remains secure. Only our board of directors
                                                                     can determine whether or when to increase it. Many fac-
                                                                     tors influence the board's decision and management's
         Our GAAP earnings include a $750 million charge             recommendations. Ultimately, any decision hinges entirely
recorded in 2003 as a result of a disappointing write-               on whether we can invest this cash for the long term at
down at our telecommunications unit. They also include a             returns higher than our cost of capital. We compare these
$180 million gain created by an accounting change in                 opportunities with the alternatives of repurchasing shares
the treatment of asset retirement obligations, a gain we             or raising the dividend.
also excluded from operating earnings. With these and
certain items detailed on page 24, we reported GAAP                  Promoting Management Focus on
earnings of $1.00, down about 79 percent from GAAP                   Sustained Long-Term Results
earnings of $4.82 a year earlier.                                    How company executives are rewarded is an important
                                                                     corporate governance issue today.
A 21.4-Percent Total Return                                              At Dominion, we pay officers and middle manage-
In 2003, we delivered a total return of 21.4 percent,                ment to strike a reasonable balance between making
exceeding past-year targets of 15 percent. This includes             their annual earnings and productivity goals and sound





long-term decisions. Four years ago, we instituted a                                      Electric Utilities Index, which produced a total return of
unique long-term share-ownership program. It requires                                     24 percent. Looking across all sectors, the S&P 500
officers to own from three to eight times their annual base                               returned 29 percent.
salaries in stock. Together, our 62-person officer group                                         For the last 3- and 5-year periods, we beat these
owned more than 2.2 million shares of common stock at                                     indexes. So it was no surprise the broader indexes
year-end. We're committed to aligning management                                          moved slightly ahead of us in 2003 to recover ground
interests with yours.                                                                     we never lost.
                                                                                                 At year-end, our equity market capitalization -- our
Looking Beyond A Given Year's                                                             share price times the number of outstanding common
Earnings Per Share                                                                        shares -- was bigger than Federal Express or General
Investors continue to focus on the basics. Does the com-                                  Mills. At $20.8 billion, ranked by market capitalization,
pany pay out a steady dividend? Does it have growing                                      we were the nation's third-largest natural gas and electric
cash flow and increasing earnings? Does its business                                      company.
plan ring true? Does it have a strong balance sheet and
                                                                                          Operating Cash Flow:
financial flexibility?
                                                                                          Significant Growth Expected in 2004
      Let's look at how Dominion did in 2003 compared
with the pack.                                                                            In past years, I've told you that cash is king.
      Our 21-percent year-end total return trailed the S&P                                       In 2004, we expect to generate positive free cash
Utilities Index, which returned 26 percent, and the S&P                                   flow, barring any major new acquisition or unforeseen

                                                                                                                                    
                                                              
development. Free cash flow is simply cash from operat-
                                                              
ing activities minus your dividend and capital expenditures.
                                                                         
    Our decision to cut back on planned capital
                                                                                             
                                                                                                                                 
                                                               
expenditures because of soft markets for power is a
                                                               
major reason we expect to generate positive free cash
                                                                                                                         
                                                               
flow in 2004 in the neighborhood of $100 million to                            
                                                                                       
$300 million. Turn to page 24 to find the same metrics         
                                                                       

under GAAP.                                                     


How We Expect Annual Earnings Growth
                                                              
To Reach 5 Percent                                             
Last year, we targeted 5- to 7-percent growth in operat-
ing earnings per share. Given market conditions, we
expect earnings at the low end of that range in 2004. As
always, we will strive to balance risks, invest our cash
flow wisely and operate superbly.






8. Dominion 2003
     We do our business in places we know best, namely               generation, transmission and distribution, as well as nat-
the Midwest, Northeast and Mid-Atlantic regions of the               ural gas exploration, production, storage, large interstate
United States. Combined, their gross domestic output rep-            pipelines and retail distribution.
resents the world's third-largest economy.                               Our Dominion Delivery business manages our distrib-
     Within that economy, we serve 5.3 million customer              ution wires and pipes that serve about 3.9 million
accounts from a $44.2 billion asset base that includes               customers in five states, and Dominion Retail's 1.4 million
major pieces of America's energy infrastructure -- electric          customers in eight states. Delivery generated about 26
                                                                     percent of our 2003 operating segment earnings, or
                                                                     $453 million, up 7 percent compared with 2002.
Dominion Generation oversees our electric generation.

                                                                     Last year, it accounted for nearly 30 percent of 2003


                                                                     operating segment earnings, or $508 million, down 9
         
                                                                     percent compared with 2002. Dominion Energy oversees

                                                           
                                                                     our interstate natural gas pipeline transmission network,
                                         
                            
                                                                     our electric transmission and Dominion Energy
           

                                                                     Clearinghouse, which coordinates our energy buying,



                                                                     selling and trading. Last year, it accounted for 20 percent


 



                                                                          of our operating segment earnings, or $350 million, up


                                                                          30 percent compared with 2002, which includes a
             record contribution of $64 million from the Clearinghouse.
7.0
                                                                          The remaining 24 percent of 2003 operating segment
                                                                  6.4
                                                6.1
                                                                          earnings, or $415 million, came from our Dominion
                                4.9
                                                                          Exploration & Production segment, up 9 percent com-
3.5

                                                                          pared with a year earlier. Net expenses from our corpo-
             2.8

                                                                          rate operations, excluding certain items listed on page
                                                                          24, amounted to $277 million in 2003, up about 4 per-
 0

                                                                          cent compared with a year earlier.
     
                                                                           

                                                                          Reliable Production At Our "Gas Factory"
                                                                          Our E&P people like to think they run a "gas factory."
                                                                               We're producing about 450 billion cubic feet equiva-
                                                                          lent annually, roughly three-quarters of it from onshore
                                                                          reserves. Much of that is embedded in coal-bed methane
                                                                          and tight-gas reservoirs. Our drilling success rate in these


                                                                       Retail Rate Certainty Also
gas factories is more than 95 percent. We don't have a
                                                                       an Investor Advantage
lot of risk, but we have to get these low-risk, long-lived
reserves out of the ground efficiently. They are the back-             In the past, the electric utility business was a lot simpler.
bone of our E&P assets. Overall, more than 80 percent of                   We built power plants approved by regulators and
Dominion E&P's 6.4 trillion cubic feet of proved natural               sold all the output into our franchise service territories at
gas and oil reserve base resides onshore, principally in               rates, including profit levels, which regulators deter-
the Appalachian Basin, west Texas and western Canada.                  mined. Much of this has changed in efforts to deregulate
         Offshore properties in the Gulf of Mexico have                the power industry. Dominion Virginia Power now oper-
been yielding about 25 percent of E&P's production.                    ates under capped rates. From an investor perspective,
There, we typically share costs with partners to minimize              it's a competitive advantage because savings from produc-
the higher risks of finding these potentially rewarding off-           tivity gains go to the bottom line. Rate stability also benefits
shore reserves and producing gas and oil from them. This               Dominion Virginia Power's retail customers.
opens up an upside component to our overall program.                       In our electric-utility service area we have rate
         In short, this blend -- weighted towards low-risk,            certainty in Virginia until 2007. As we went to press,
onshore reserves -- provides stable and relatively pre-                Virginia legislators were studying the possibility of a
dictable earnings and cash flow. Dominion was one of                   rate-cap extension. At our natural gas-utility service areas
the most active onshore operators in both 2002 and                     in Ohio, West Virginia and Pennsylvania, which serve
2003. On a net basis, we drilled 922 wells in 2003 and                 about 1.7 million retail customers, we still operate under
expect even more in 2004.                                              stable forms of traditional regulation.

                                                                                                                   
Managing Our Businesses                                           Generation:
                                                                  Unit Mix
As a Btu Balance Sheet
                                                                  As of Year End
Deregulation opens unique opportunities because we own
                                                                     Baseload      50%
electric generation and natural gas assets. Both forms can
                                                                     Intermediate 28%
be measured in British Thermal Units, or Btus. Think of
                                                                     Peaking       22%
our businesses as a Btu balance sheet -- assets on the
left; "liabilities," or obligations to customers, on the right.
    Our "assets" are megawatts and natural gas
reserves that make up the supply side of our portfolio.
Our Btu obligations include customer- supply obligations,
                                                                  Generation:
forward sales contracts with credit-worthy institutions and
                                                                  Fuel Mix
financial hedges, which are agreements to sell energy at          As of Year End

a certain price on a future date.                                    Gas/Other 28%

    By the end of 2003, we had matched 90 percent of                 Coal          26%

our electric generation with our retail and wholesale cus-           Nuclear       21%

                                                                     Purchases     15%
tomers. We also hedged or locked in the prices we expect
                                                                     Oil           10%
to get for more than 80 percent of our 2004 natural gas
and oil production, reducing our exposure to price volatil-
ity in wholesale natural gas and power markets.
    If gas prices spike up or down, we have less to
make or less to lose. In a boom-or-bust scenario, we'll
make a margin.


                                                                  Electric Generation Capacity Growth
Creating Profits, Cash Through Commodity                          Megawatts
                                                                  As of Year End
Volatility, Growing "Internal Hedge"
I have a name for the 10 percent of generation that we                      2000         2001     2002     2003
                                                                                                           24,408
                                                                                                  23,830
                                                                  25,000
have not matched and the 20 percent of natural gas that                                  21,867
                                                                            19,265
we have not hedged -- "Btu equity."
    Btu equity gives us flexibility. We can create more
                                                                  12,500
cash and profits by taking advantage of interconnections
between natural gas and competitive power markets.
Think of a child's seesaw: When natural gas prices rise,
                                                                      0

it costs us more to generate power in our merchant
gas-fired units. Therefore, the profit margins earned on


Regulated Revenue by Customer Class:   natural gas-fired electric merchant generation go down.
Electricity                            As a natural gas producer, however, we can sell at high-
For the Year 2003
                                       er prices into markets for real-time use, or spot sales.
                      47%
   Residential
                                              We want to expand our ability to create internal
                      30%
   Commercial
                                       hedges, too. To accomplish this, we're increasing the
                      10%
   Industrial
                                       number of end-use retail customers in regions where retail
                      10%
   Public Authority

                                       customer choice is a reality. By year-end, our Dominion
                      3%
   Resale

                                       Retail unit included more than 900,000 of these
                                       price-sensitive gas and power customers among its over-
                                       all base of 1.4 million customers. Retail's commodity
Regulated Revenue by Customer Class:
Natural Gas

                                                                                                     
customers give us a ready market in which to sell
                                                                                                      
power or natural gas and to prudently take advantage
                                                                                                      
                                                                                               
of price volatility.
     An example is in eastern Pennsylvania, where we
are building a 1,180-megawatt natural gas-fired facility
called Fairless Works. Nearly 200,000 Dominion Retail
customers will be served by output from the first of its two    
                                                                
units, which are both set to come on line in 2004.              
                                                                
Virtually all of the remaining first-unit output is contracted
for sale to a local electric utility.
     Internal hedges are simply a more efficient way to
run our business. First, they don't tie up working capital
the way financial hedges with traders do because they
don't require cash margin deposits. In addition, internal
                                                                              
                                                                                                    
                                                                
hedges increase profits because we cut out the trading
                                                                                                      
                                                                
                                                                                                   
middleman. They also reduce the credit risks of doing
                                                                                                     
business with others because we deal only with ourselves.                                             
Finally, these transactions don't require mark-to-market
accounting, which is sometimes required with financial
hedges and may have the potential to distort earnings.


Wise Investing: Adding to our Btu
Balance Sheet Assets
In addition to our construction at Fairless Works, we're
adding other assets that strengthen our Btu balance sheet.
     In 2003, we brought Dominion Cove Point into
operation. Based in southern Maryland, it's the nation's
second-largest liquefied natural gas import and storage
facility. It has the capacity to deliver up to 1 billion
cubic feet of natural gas daily -- enough to meet the
daily energy needs of 3.4 million homes.
     It's already fully subscribed -- by Statoil, Shell and
BP Energy. The first commercial delivery arrived in late
August. The service fees these credit-quality companies
pay add to our earnings. We're spending $140 million
to expand Cove Point, increasing its LNG tank storage
                                



capability by 56 percent. In fact, we've suspended devel-                 Opportunities to expand our asset base at a price
opment of a planned natural gas pipeline through West               that returns immediate profits don't show up very often.
Virginia, Virginia and North Carolina to study whether the                In November we found one. We signed a deal to
budgeted money can be put to more profitable use at                 acquire the 545-megawatt Kewaunee Power Plant in
Cove Point. Global energy giant Statoil confirmed that              northeastern Wisconsin for $220 million in cash. We will
our timing appeared good in early 2004. Statoil signed              assume a 10-year power sales contract to serve the two
a letter of intent to contract for additional planned capac-        utilities selling the facility. We expect to begin booking
ity expansions at Cove Point that will nearly double its            profits when this nuclear station joins our 5,500-
overall capability by late 2008. We'll seek federal regu-           megawatt nuclear fleet in the autumn of 2004, our best
latory approval to begin the process this year.                     estimate based on the time required to get the approvals
                                                                    from several state and federal agencies.
Investing Wisely: Demand Growth Strategy
                                                                    Record Replacement At
In Northern Virginia, on schedule, we placed a
                                                                    North Anna Nuclear Station
545-megawatt natural gas-fired facility into operation
at our Possum Point Power Station to meet annual                    Long-time Dominion investors know we rank among the
customer demand growth of 1.5 percent at Dominion                   top three operators of nuclear plants in the nation. Our
Virginia Power.                                                     Virginia nuclear facilities, North Anna and Surry power
                                                                    stations, consistently rank among the Top 10 most effi-
                                                                    cient producers.



                                                              When routine inspections revealed wear and tear in
     the vessel head, or lid, of one of our four Virginia reac-

                                                         tors, our nuclear operations pros had two choices: Do a
                                               costly, lengthy repair, or replace it with a new one --
                                                         a task no American company had successfully accom-
                                                         plished. Replace it we did, safely and in record time,
                                                         writing an important chapter in U.S. energy history. So
                                                         we accelerated and completed vessel head replacements
                                                         at our three other Virginia units. With new vessel heads,
                                                         and regulatory approval in 2003 to extend their operat-
                                                         ing lives another 20 years, North Anna and Surry are
                                                         positioned for years of continued low-cost production.


                                                         Six Sigma Process Improvement Yields
                                                         $200 Million in Ongoing Savings
                                                         Call it what you will -- working harder, smarter, quicker,
                                                         better, more efficiently or "achieving productivity gains."
                                                         In Dominion's case, our investors benefit from an employee


                                                                     Our best move was to minimize the impact and try
culture that motivates people to take a lot of pride in their
                                                                to get it behind us. In March of this year, we signed an
jobs and log continuing savings along the way.
                                                                agreement to sell Dominion Telecom. Although we
    Our Six Sigma process improvement initiative is now
                                                                excluded the write-offs from our operating earnings, it
in its fourth year. We've found more than $200 million in
                                                                did reduce the equity on our balance sheet.
ongoing savings. More than 150 Six Sigma "black belt"
                                                                     Maintaining a strong balance sheet is a critical piece
experts are enhancing our productivity. With more than
                                                                of our strategy. Three times in the last two years we've
350 workplace improvement projects under way in 2004
                                                                issued new shares in public offerings to raise equity
and another 600 in the queue, we're targeting additional
                                                                instead of increasing our debt. In total, we issued more
ongoing savings in 2004 of $50 million per year.
                                                                than 49 million shares. That raised more than $2.4 bil-
Pounding the Ground Harder,                                     lion. Spread our net income over that expanded share
Getting the Gas Faster                                          base (more than 325 million shares outstanding) and the
                                                                dilution amounted to 65 cents per share by the end of
An example at our Sonora natural gas properties in west
                                                                2003. In most cases, we'd rather absorb the impact of
Texas brings clear meaning to the term "process improve-
                                                                dilution in our short-term earnings, than rob our long-term
ment." We acquired the Sonora properties in 2001 with
                                                                future by neglecting our balance sheet.
our purchase of Louis Dreyfus Natural Gas. Time is
                                                                     Over the course of the last few years, we're proud of
money in Sonora -- the faster you can get the gas out,
                                                                the progress we've made in strengthening our credit
the quicker it goes to market, the sooner sales hit the
                                                                ratios. We will continue to focus on improving these mea-
cash register. Our seasoned gas pros are using Six
                                                                sures, such as debt to total capital and cash coverage of
Sigma techniques to promote faster drilling. Lately,
                                                                interest expense. Our objective is to lower our adjusted
they've been racing each other to drill faster, but always
                                                                debt as a percentage of our total capital to the 50 per-
maintaining the highest standards of safety. Dominion is
                                                                cent range, and to have our funds from operations cover
a leader in industry safety and environmental awards.
                                                                our interest expense by at least four times. Turn to page
    At year-end, gross production at Sonora exceeded
                                                                24 for details on the same metrics under GAAP.
200 million cubic feet per day. Since we acquired
Sonora, production at those properties is up more than
50 percent.


                                                                
Capital Preservation: Managing Our Risks,                       
                                                                
Minding Our Balance Sheet
Over the years, our Dominion team has earned a reputa-
tion among investors for spending capital wisely. That's
why the write-offs at our telecommunications business
were so painful. Unfortunately, markets for Dominion
Telecom's services did not develop as we had expected,
                                                                                                   
and I alone accept responsibility.
                                                                                                  






    Our solid investment grade credit rating and stable            Fortunately, the lights stayed on in the Mid-Atlantic,
outlook from Moody's (Baa1) underscores the improve-           thanks in part to a critical role that Dominion's high-volt-
ments in our earnings, cash flow, balance sheet, liquidity     age transmission assets and generating stations in the
and financial flexibility. In late 2003, Standard & Poor's     north and south played in helping to contain the blackout
reaffirmed its BBB+ investment grade rating and, despite       and return power. Our Millstone Power Station, said the
our improving metrics, included a negative outlook. This       chairman of Connecticut's Department of Public Utility
didn't warrant the issuance of additional shares. We told      Control, "stood as solid as a rock when everyone else
S&P we'd address any future concerns through continued         fell." State Senator Melodie Peters said, "Thank God for
focus on our balance sheet and earnings growth.                Dominion and Millstone." Northeast Utilities former chair-
                                                               man, Mike Morris, said the power station's ability to
Dominion Systems Help To Reduce Scope                          keep generating during the crisis, "was critical to
of Northeast Blackout                                          Connecticut and New England, and we thank them."
Our entire industry came under fire during the major               This massive disruption highlighted the need for more
summer blackout on August 14. I remember the vivid             investment in transmission, as well as better regional and
television images -- some 50 million people in the             national planning. We're taking steps to join a regional
Northeast, Midwest and Canada without power for days.          transmission operator called PJM Interconnection that
                                                               promotes regional transmission coordination. And I've
                                                               written to members of Congress to urge them to adopt





binding reliability standards, to eliminate long delays in            fleets. It ended what could have been costly, draining liti-
siting, to promote regional transmission and work to pro-             gation. The projected costs already are embedded in exist-
vide investment incentives for companies like Dominion.               ing budgets and will not affect our earnings guidance.
                                                                          Beyond the EPA settlement, we generally support the
Federal Environmental Relations:                                      EPA's efforts to identify and implement legislative and regu-
Dominion, EPA Agree on Game Plan                                      latory solutions for additional environmental improvements.
It's not often that agreeing to spend $1.2 billion is good
                                                                      The Balance Sheet Of Customer Goodwill
news. But in the case of Dominion's landmark settlement
with the EPA announced in April 2003, it wasn't just                  I've discussed our Btu balance sheet but want to close
good news -- it was great news. This was a difficult                  my letter with a word about our customer goodwill
negotiation. Good people worked long hours on both                    balance sheet.
sides of the table.                                                       In the hours, days and weeks after Isabel, I heard
    The settlement results in a cleaner environment for               countless times about Dominion employees leaving
everyone, with improvements that go well beyond the                   behind their families in the dark so they could get the
requirements of the Clean Air Act or state regulations.               lights back on for others. Workers not usually involved in
We will become one of the nation's cleanest coal-burning              storm restoration jumped in, eager to help get the power
                                                                      flowing again.



                                                                  precision. With this promotion, all businesses will have
     Our customers took note. Everywhere, they went out
                                                                  benefit of Tom's skill and leadership.
of their way to say thank you. They held fish fries and
                                                                      I thank the skilled, energetic leaders who make up
barbecues for crews, brought coffee and baked goods to
                                                                  our board. Our board's counsel and steady guidance
shops and offices and left coolers of soft drinks at work
                                                                  are instrumental in helping us to meet requirements of the
sites. Even when their power had yet to be restored, they
                                                                  Sarbanes-Oxley legislation in our stewardship of your
posted signs expressing encouragement and gratitude.
                                                                  capital.
     My gratitude is immense, and I thank all 16,700
                                                                      To our vendors, bankers and contractors, thanks for
employees, the guardians of the Dominion culture who
                                                                  the good work. You, too, play key roles in helping us set
keep the Dominion enterprise rumbling forward on time,
                                                                  great standards of reliability, service and courtesy for mil-
on budget and on target, moving faster, thinking harder.
                                                                  lions of Dominion customers. We always work to serve
Belle of the Ball                                                 them in helpful, even better ways. To those customers
                                                                  affected by Hurricane Isabel: You suffered greatly, but
Last year, a prominent financial columnist at The
                                                                  you understood. You were patient and kind. You stood by
Washington Post wrote that Dominion may now be the
                                                                  our employees.
industry's "Belle of the Ball." In the interest of fairness, he
                                                                      A final word to the little boy dressed up as a "bucket
also questioned whether this message had fully gotten
                                                                  truck guy." Give us a call someday, son. There could be
through to investors and analysts.
                                                                  a good job with your name on it.
     As I see it, Dominion is the Belle of the Ball, and I
appreciate your continued investment and support.
                                                                  Sincerely,

Gifted Senior Management
Each day, the company's gifted senior management team
proves the best way to manage is to surround yourself
with smart people, set ambitious but realistic goals --and
then get out of the way. Last December, our board of              Thos. E. Capps
                                                                  Chairman and
directors named Tom Farrell president and chief operating
                                                                  Chief Executive Officer
officer. During his past eight years at Dominion, Tom has
                                    tackled senior manage-
                                                                                                   As I see it, Dominion is
                                    ment assignments at
                                                                                                   the Belle of the Ball,
                                    both our regulated and                                         and I appreciate your
                                                                                                   continued investment
                                    unregulated businesses
                                                                                                   and support.
                                    with competence, high
                                    energy and intellectual




Thomas F. Farrell, II
President and
Chief Operating Officer


