  P%'R:bZghdc'%%-




                                                                       




                                                                            
                                                                      YZhe^iZVX]VaaZc\^c\\adWVaZXdcdb^XZck^gdc"
                                                                      bZci#DjgdeZgVi^c\iZVbZmZXjiZYlZaaVXgdhh
                                                                      i]ZWdVgY!^YZci^[n^c\VcYhdak^c\^bedgiVci
                                                                      egdWaZbh[dg\adWVaXjhidbZgh!XgZVi^c\
                                                                      gZlVgY^c\deedgijc^i^Zh[dgZbeadnZZhVcY
                                                                      YZa^kZg^c\higdc\gZhjaih[dgh]VgZ]daYZgh#>Vb
                                                                      kZgnegdjYd[i]Z:bZghdciZVbVcYl]Vi
                                                                      lZVXXdbea^h]ZY#

                                                                      CZihVaZhgZVX]ZYVgZXdgY')#-W^aa^dc#
                                                                      GZedgiZYhVaZh\gZlWn&'eZgXZciVcY
                                                                      jcYZgan^c\hVaZhl]^X]ZmXajYZi]Z^beVXi
                                                                      d[VXfj^h^i^dch!Y^kZhi^ijgZhVcY[dgZ^\c
                                                                      XjggZcXnigVchaVi^dc\gZl,eZgXZci!^ca^cZ
                                                                      l^i]djg\dVaidYZa^kZg*,eZgXZcijcYZgan^c\
                                                                      hVaZh\gdli]i]gdj\]adc\"iZgbWjh^cZhhXnXaZh#
                                                                      DjgVW^a^inidVeeanY^hX^ea^cZYegdXZhhZhVcY
                                                                      ^cYjhignZmeZgi^hZVXgdhhXjaijgZh^h`Znid
                                                                      :bZghdchhjXXZhh#HVaZhdjih^YZd[i]ZJc^iZY
                                                                      HiViZhXdci^cjZidgZegZhZciVc^cXgZVh^c\an
                                                                      aVg\Zgh]VgZd[idiVahVaZh!*)eZgXZci^c'%%-!
                                                                      l]^X]\^kZhVbdgZWVaVcXZYWjh^cZhhegdaZ#

                                                                      :Vgc^c\heZgh]VgZ:EHgdhZid(#%+!Vcdi]Zg
                                                                      gZXdgYVcYVc^cXgZVhZd[&*eZgXZcidkZghXVa
                                                                      '%%,#I]ZdeZgVi^c\egdibVg\^c^cXgZVhZY
                                                                      ,%WVh^hed^cihid&+#*eZgXZcii]Z]^\]Zhi
                                                                      aZkZa^cbdgZi]Vc(%nZVgh#Dcided[i]Vi!i]Z
                                                                      XdbeVcnYZa^kZgZY''eZgXZciV[iZg"iVmgZijgc
                                                                      dcidiVaXVe^iVaVcY\ZcZgViZY(#(W^aa^dc
                                                                      ^cdeZgVi^c\XVh]#<ZcZgVi^c\h^\c^XVci




9 6 K > 9  C # ; 6 G G
8 = 6 > G B 6 C !  8 = > : ;  : M : 8 J I > K :  D ; ; > 8 : G !   
6C9EG:H>9:CI
                                                               6EdlZg[ja;dgXZ[dg>ccdkVi^dc   P  %(R




                                            DjgdeZgVi^c\iZVb
i]^hbVcV\ZbZciiZVb!l]^X]Vaadlhjhid
^ckZhi[dg[jijgZ\gdli]VcYgZijgcXVh]WVX`
                                            ZmZXjiZYlZaaVXgdhhi]Z
idh]VgZ]daYZgh#>c'%%-!:bZghdcgZijgcZY       WdVgY!^YZci^[n^c\VcY
bdgZi]Vc+%eZgXZcid[deZgVi^c\XVh]dlid
h]VgZ]daYZgh.)%b^aa^dc^cY^k^YZcYhVcY
                                            hdak^c\^bedgiVciegdWaZbh
&#&W^aa^dc^chidX`gZejgX]VhZh#'%%-lVh        [dgXjhidbZgh!XgZVi^c\
i]Z*'cYXdchZXji^kZnZVglZ^cXgZVhZYdjg
                                            gZlVgY^c\deedgijc^i^Zh
Y^k^YZcY!VcYi]ZWdVgYVeegdkZYV&%eZgXZci
^cXgZVhZ^ci]ZfjVgiZganY^k^YZcYid%#((eZg     [dgZbeadnZZhVcY
h]VgZ[dgi]Z9ZXZbWZg'%%-Y^k^YZcYeVnbZci#     YZa^kZg^c\higdc\gZhjaih
LZ[VXZidj\]ZXdcdb^XX]VaaZc\ZhV]ZVY!         [dgh]VgZ]daYZgh#
^cXajY^c\Vhigdc\ZgJ#H#YdaaVgVcY\gZViZg
jcXZgiV^cinVXgdhh\adWVabVg`Zih#:bZghdc^h
edh^i^dcZYlZaaidYZVal^i]i]ZhZX]VaaZc\Zh#
I]ZXdbeVcn^h^c\ddYWjh^cZhhZh!]VhV
higdc\WVaVcXZh]ZZiVcYgZbV^chXdchZgkVi^kZ
^cdjgcVcX^VahigjXijgZ#LZXdchiVcian
bdc^idgVaad[djgWjh^cZhhZhkZgnXVgZ[jaan
VcYbV`ZVY_jhibZcihVhcZZYZY^cVYncVb^X
Zck^gdcbZci#I]VihV^Y!lZVahdZmeZXiid
Xdci^cjZYg^k^c\[jijgZ\gdli]l^i]higViZ\^X
iZX]cdad\nVcYcZlegdYjXi^ckZhibZcihVhi]Z
XdbeVcn]VhYdcZXdch^hiZcianVcYhjXXZhh[jaan
^ci]ZeVhi#



>c'%%-!*)d[hVaZhXVbZ
[gdbdjih^YZi]ZJc^iZYHiViZh#
(%XVbZ[gdbZbZg\^c\bVg`Zih#
   :bZghdc'%%-




            :bZghdc^hVedlZg[ja
            [dgXZ[dg^ccdkVi^dc#
            I]VihdjgXdbeZi^i^kZZY\Z#




                 
            Y^[XjaiZXdcdb^Xi^bZhWZ[dgZ!VcYlZVgZ
            XdcYZcilZ]VkZi]Zg^\]iiZVbVcYi]Zg^\]i
            higViZ\^Zh[dgXdci^cjZYadc\"iZgbhjXXZhh#
            BVcnYZXVYZhd[aZVYZgh]^eVcYXdbeZi^i^kZ
            VYkVciV\ZVgZV]ZVYd[jh#LZ`cdli]^h!^ceVgi!
            WZXVjhZlZ`cdll]VibV`Zh:bZghdcjc^fjZ!
            Vh:bZghdc^hVedlZg[ja[dgXZ[dg^ccdkVi^dc!
            VcYi]VihdjgXdbeZi^i^kZZY\Z#

            Djg\adWValdg`[dgXZ^hgZbVg`VWaniVaZciZY#
            I]ZXdbeVcn]VhVbVcV\ZbZciegdXZhhVcY
            VXjaijgZi]Vi^che^gZVcYgZlVgY^c^i^Vi^kZ!
            ^ccdkVi^dc!Y^hX^ea^cZVcYVXXdbea^h]bZci#
            LZ]VkZYZZe^cYjhignVcYegdYjXiZmeZgi^hZ!
            VcYjcYZghiVcYXjhidbZghWjh^cZhhZhVcY
            i]ZYZbVcYhi]Zn[VXZ#I]ZhZVgZ[dgb^YVWaZ
            higZc\i]h!VcYi]ZiZVbYgVlhdci]Zbid
            XgZViZcZl"id"i]Z"ldgaYhdaji^dch#
                                              6EdlZg[ja;dgXZ[dg>ccdkVi^dc   P  %*R




>ccdkVi^dc
;DGDJG8JHIDB:GH#


:bZghdc^hlZaa"gZheZXiZY[dgdjgiZX]cdad\n
ZmeZgi^hZVcYWjh^cZhheaVi[dgbh#7jii]Z
XdbeVcnhgZVaVYkVciV\ZXdbZh[gdbWg^c\^c\
id\Zi]Zgi]ZeZdeaZVcYegdXZhhZhidjcYZghiVcY
VcYZmeadgZXjhidbZghcZZYh[gdbbVcnVc\aZh#

7nXdaaVWdgVi^c\VXgdhhWdgYZgh!Y^k^h^dch!
^cYjhig^ZhVcYeaVi[dgbh!:bZghdcZc\^cZZgh
cZl"id"i]Z"Wjh^cZhhVcYcZl"id"i]Z"ldgaY
hdaji^dch#Hdaji^dchi]VicdidcanaZVYXjhidbZgh
VcY^cYjhig^Zhi]gdj\]X]Vc\ZWjiVXijVaan
igVch[dgbi]Zb^cjc^fjZVcYjcZmeZXiZYlVnh#

AZVgcbdgZVWdji]dl:bZghdcejih^ccdkVi^dc
idldg`Villl#:bZghdc#Xdb#
P%+R:bZghdc'%%-




                                                           X]VaaZc\^c\egdXZhhZck^gdcbZcih#I]^h^higjan
             ^cVegdXZhhdeZgVi^c\Zck^gdcbZci^hV\gZVi        VcVbVo^c\[ZVid[Zc\^cZZg^c\#:VX]l^gZaZhh
             ZmVbeaZd[cZl"id"i]Z"ldgaYhdaji^dch#:bZghdc    YZk^XZ^hVgdjiZg[dgdi]ZgcZVgWnYZk^XZh!
             EgdXZhhBVcV\ZbZciZc\^cZZghjcYZghiddYi]Vi      eVhh^c\bZhhV\ZhVadc\jci^ai]ZngZVX]
             WZ^c\l^gZaZhh^hcdi_jhiVWdjigZeaVX^c\l^gZh    i]Z^gYZhi^cVi^dc#>[i]ZgZ^hVcdWhigjXi^dc!
             ^i^hhdbZi]^c\bjX]W^\\Zg#                      igVchb^hh^dchVgZVjidbVi^XVaangZgdjiZYjci^a
                                                           VXaZVgeVi]^h[djcY#
             ;gZZY[gdbi]Za^b^iVi^dchVcYXdbeaZm^ind[
             l^gZ!XjhidbZghXVcYZeadn:bZghdchEaVciLZW      :bZghdchHbVgiL^gZaZhhiZX]cdad\n^hV\VbZ"
             XVeVW^a^i^ZhidVhhZihegZk^djhandjid[e]nh^XVa   X]Vc\Zg[dgi]ZegdXZhh^cYjhign!Za^b^cVi^c\
             dgZXdcdb^XgZVX]#IdYVn!:bZghdchHbVgi          e]nh^XVa!ZXdcdb^XVcYiZX]c^XVadWhiVXaZhi]Vi
             L^gZaZhhhdaji^dcd[[Zghi]ZZmXZei^dcVaWZcZih   Zc\^cZZgh]VYZcXdjciZgZYdcVYV^anWVh^h#
             d[hZZ^c\!`cdl^c\VcYXdcigdaa^c\i]^c\heaVci     8jhidbZghVgZhZZ^c\[Vg"gZVX]^c\WZcZih^c
             bVcV\ZghXdjaYcZkZg`cdldgV[[dgYid`cdl          deZgVi^dch!eZg[dgbVcXZVcYhV[Zin!VhlZaa
             WZ[dgZ!hjX]VhYZiZXi^c\aZV`hVadc\b^aZhd[       Vhh^\c^XVciXdhihVk^c\h#>c[VXi!i]ZXdhid[
             e^eZa^cZ!\Vi]Zg^c\YViV[gdbbdkVWaZZfj^e"       VYY^c\dcZl^gZaZhhhZchdg^hdcZ"iZci]i]Vid[V
             bZci^cZm^WaZbVcj[VXijg^c\Zck^gdcbZcih        igVY^i^dcVa]VgY"l^gZYhdaji^dcVcYiV`Zh[VgaZhh
             VcYigVX`^c\VhhZihVcYeZdeaZi]gdj\]dji          i^bZid^beaZbZci#LZVgZZmX^iZYVWdjii]Z
             i]ZeaVci#>cXgZVh^c\i]^hZaY^ciZaa^\ZcXZVcY    a^b^iaZhhediZci^Va[dgi]^hhdaji^dcl^i]^cVcY
             egZY^Xi^kZedlZgbV`ZhXjhidbZghbdgZZ["         WZndcYegdXZhhZck^gdcbZcihVh^iXdci^cjZh
             X^ZciVcYXdbeZi^i^kZ#                          idjcadX`i]Z^bV\^cVi^dcd[Zc\^cZZghVXgdhh
                                                           i]Z\adWZ#
             DjgWgZV`i]gdj\]lVhVcVeea^XVi^dcd[hZa["
             dg\Vc^o^c\bZh]cZildg`hi]ViYZa^kZgVgZa^VWaZ!
             gdWjhiVcYhZXjgZhdaji^dc^cZkZci]Zbdhi




             I]ZXdhid[VYY^c\dcZl^gZaZhhhZchdg
             ^hdcZ"iZci]i]Vid[VigVY^i^dcVa
             ]VgY"l^gZYhdaji^dc#
                                             6EdlZg[ja;dgXZ[dg>ccdkVi^dc   P  %,R




L^gZaZhh
>H67DJI9D>C<L=6I8DJA9CI
7:9DC:7:;DG:#


A^`ZVaaWgZV`i]gdj\]h!:bZghdcHbVgiL^gZaZhh
WZ\VchbVaa#>cgZVY^c\VWdjicZll^gZaZhh
hZchdgiZX]cdad\ni]ZJ#H#b^a^iVgnlVh
YZeadn^c\idcYZcZbnigddeh^cWViiaZ!djg
Zc\^cZZghWZXVbZ^cig^\jZYl^i]i]ZediZci^Va
Veea^XVi^dc^cegdXZhhZck^gdcbZcih#

I]Z^g^bV\^cVi^dcVcY^ch^\]iaZYidi]Z
YZkZadebZcid[iZX]cdad\ni]Viegdk^YZh
XjhidbZghl^i]^c[dgbVi^dcVcYXVeVW^a^i^Zh
i]Vi]VYWZZce]nh^XVaandgZXdcdb^XVaandji
d[gZVX]#Hdaji^dchi]VigZh]VeZi]Z^gWjh^cZhh#
IZX]cdad\ni]ViigVch[dgbh^cYjhign#

AZVgcbdgZVWdji:bZghdchHbVgiL^gZaZhhVi
lll#:bZghdcEgdXZhh#Xdb$HbVgiL^gZaZhh#
     :bZghdc'%%-




              >cYjhign"aZVY^c\^ccdkVi^dcWn:bZghdc8a^bViZ    :bZghdch^cYjhign
              IZX]cdad\^Zh^hZfjVaanXdbeZaa^c\#DcZd[
              i]Zbdhi^bedgiVci^hhjZhd[djgi^bZ[dg
                                                            aZVYZgh]^eegdk^YZhV
              ^cY^k^YjVah!Wjh^cZhhdlcZghVcY\dkZgcbZcih     higdc\[djcYVi^dc[dg
              ^hi]ZZck^gdcbZci!eVgi^XjaVgani]ZgZhedch^WaZ
                                                            \gdli]VhjhZd[cZl
              jhZd[ZcZg\n#:bZghdchVW^a^inide^dcZZg
              XdbegZhhdgiZX]cdad\ndkZgi]ZnZVgh]VhaZYid      gZ[g^\ZgVcihVcYZ[[^X^ZcXn
              hjWhiVci^Va^cXgZVhZh^ci]ZZ[X^ZcXnd[\adWVa
                                                            hiVcYVgYhVgZbVcYViZY
              gZh^YZci^VaVcYXdbbZgX^VaV^gXdcY^i^dc^c\
              hnhiZbh#>cCdgi]6bZg^XV![dgZmVbeaZ!gZh^"       VgdjcYi]ZldgaY^c
              YZci^VahnhiZbhVgZbdgZi]Vc+%eZgXZcibdgZ        i]ZXdb^c\nZVgh#
              Z[X^Zcii]Vci]ZnlZgZildYZXVYZhV\d#I]ZhZ
              ^begdkZbZcihZfjViZidi]ZedlZg\ZcZgViZY
              Wn&,dcZ"\^\VlViiedlZgeaVcih#

              6hlZXdci^cjZidYg^kZ[dglVgY!:bZghdc
              8a^bViZIZX]cdad\^Zh^heVgicZg^c\l^i]gZ[g^\"
              ZgVi^dcVcYV^gXdcY^i^dc^c\bVcj[VXijgZghid
              e]VhZdjidodcZ"YZeaZi^c\!X]adg^cZ"WVhZY
              gZ[g^\ZgVcih[dgcZlhnhiZbh^ci]ZJc^iZYHiViZh
              Wn'%&%#I]ZaViZhi\ZcZgVi^dcd[8deZaVcY




              GZh^YZci^VahnhiZbhVgZbdgZi]Vc+%
              bdgZZ[X^Zcii]Vci]ZnlZgZildYZXVYZh
              V\d#I]ZhZ^begdkZbZcihZfjViZidi]ZedlZg
              \ZcZgViZYWn&,dcZ"\^\VlViiedlZgeaVcih#
     
eZg[dgbVcXZl^i]idYVnhbdgZZck^gdcbZc"
iVaangZhedch^WaZG")&%6gZ[g^\ZgVcihl]^aZVahd
egdk^Y^c\i]ZjcbViX]ZYgZa^VW^a^ini]Vi]Vh
WZXdbZhncdcnbdjhl^i]:bZghdc#

HjeZg^dgiZX]cdad\nVcY^cYjhignaZVYZgh]^e
egdk^YZVhigdc\[djcYVi^dc[dg\adWVa\gdli]
VhlZaa#>c8]^cV!:bZghdc^hldg`^c\XadhZan
l^i]Wdi]\dkZgcbZciVcY^cYjhignidYZkZade
ZcZg\n"Z[X^ZcXnhiVcYVgYh[dgi]ViXdjcign#
LZVgZVahdhjeean^c\i]Z8]^cZhZbVg`Zil^i]
Vl^YZgVc\Zd[ZcZg\n"gZhedch^WaZhdaji^dch#
:bZghdcZc\^cZZgh^cHjo]dj!8]^cV![dg
ZmVbeaZ!VgZYZh^\c^c\VcYWj^aY^c\cZmi"
\ZcZgVi^dc8deZaVcY9^\^iVaHXgdaahdaji^dchid
igVch[dgbi]Z6h^VcV^gXdcY^i^dc^c\bVg`Zi#

6ii]ZhVbZi^bZ!:bZghdc^hldg`^c\XadhZan
l^i]adXVabVcj[VXijgZghidXgZViZbdgZ
Z[[ZXi^kZ!Z[X^ZciVcYZck^gdcbZciVaan[g^ZcYan
]ZVi^c\egdYjXih[dgi]Z]Va["W^aa^dceZdeaZl]d
a^kZ^c8]^cVhcdgi]ZgcgZ\^dc#




                          8a^bViZX]Vc\ZYZbVcYh
                           
                                            6EdlZg[ja;dgXZ[dg>ccdkVi^dc   P  %.R




Hdaji^dch
I=6ILDG@;DG:K:GNDC:#


I]ZgZVgZcdh^beaZVchlZghidi]ZldgaYh
ZcZg\n^hhjZhVcYcZZYh#HdVhi]Z^ccdkVidgh
^c:bZghdc8a^bViZIZX]cdad\^ZhXdci^cjZ
i]Z^gfjZhi[dg]ZVi^c\VcYXdda^c\hdaji^dch
i]VigZfj^gZaZhhZaZXig^X^inVcYgZYjXZ\adWVa
lVgb^c\!i]ZnXdaaVWdgViZl^i]Zc\^cZZgh^c
di]Zg:bZghdcWjh^cZhhZhidjcYZghiVcY]dl
       dlYZk^XZhVcYXdcigdah^beVXii]Z
bdidgh!
idiVahnhiZb#

6ii]ZhVbZi^bZ!:bZghdceVgicZghXadhZan
l^i]XjhidbZgh!^cYjhig^Zh!\dkZgcbZcih
VcYgZ\jaVidghidXgZViZegVXi^XVaVcYk^VWaZ
hiVcYVgYhVcYhdaji^dchi]ViVaaeVgi^ZhXVc
[daadlidgZhedch^WanbVcV\Zi]ZldgaYh
gZhdjgXZh#:bZghdcaZVYZgh]^e#

;dgbdgZ^c[dgbVi^dcVWdji:bZghdc8a^bViZ
IZX]cdad\^Zh!k^h^illl#:bZghdc8a^bViZ#Xdb#
 P    :bZghdc'%%-




               :bZghdchXdbb^ibZciidZcZg\ngZhedch^W^a^in      6gbZYl^i]i]^h^ch^\]i!i]ZiZVbYZkZadeZY
               VahdZmiZcYhidaVg\Z\adWVaYViVXZciZgh#>c         :cZg\nAd\^XVgdVYbVei]ViZcVWaZhYViV
               '%%+!J#H#YViVXZciZghXdchjbZY&#*eZgXZci         XZciZgbVcV\Zghideg^dg^i^oZVcY^beaZbZci
               d[i]ZcVi^dchidiVaZaZXig^XVaZcZg\n#6XXdgY^c\   iZX]cdad\^ZhVagZVYnVii]Z^gY^hedhVaidgZYjXZ
               idi]ZJ#H#:ck^gdcbZciVaEgdiZXi^dc6\ZcXn!        ZcZg\nXdchjbei^dc#;daadl^c\:cZg\nAd\^X
               i]Vih]VgZ^h[dgZXVhiZYidg^hZid'#*eZgXZciWn      higViZ\^ZhXVcXjiVYViVXZciZghXdchjbei^dc
               '%&&#I]^h^hVh^\c^XVci^hhjZ[dgWjh^cZhhVcY      ^c]Va[#>iVahdXVc[gZZjeild"i]^gYhd[kVajVWaZ
               >IaZVYZgh!VcY:bZghdcZc\^cZZghVYYgZhh^i         gV^hZYddgheVXZ!dcZ"i]^gYd[jc^ciZggjei^WaZ
               i]gdj\]^ccdkVi^kZiZX]cdad\^ZhVcYhdaji^dch      edlZghjeeanXVeVX^inVcY)%eZgXZcid[Xdda^c\
               i]ViiVg\ZiWdi]i]ZYViVXZciZgVhVl]daZVcY         XVeVX^inVaa^hhjZhi]ViXjhidbZghXdch^hiZcian
               i]ZbVcnZaZbZcihl^i]^c^i#                       iZaajhVgZXg^i^XVa#

               ;dgZmVbeaZ!gZYjX^c\Xdda^c\Xdhih[dgYViV         :bZghdchVXfj^h^i^dcd[6eZgijgZ^cBVgX]
               XZciZghi]gdj\]^cXgZVhZYZ[X^ZcXn^hVXaZVg       egdk^YZhVcdi]ZgedlZg[jaidda6eZgijgZK>HI6
               VcYXg^i^XVacZZY!VcYA^ZWZgiMigZbZ9Zch^in        hd[ilVgZ!l]^X]egdk^YZhYViVXZciZgbVcV\Zgh
               Xdda^c\hnhiZbhegdk^YZVcZmXZaaZcihdaji^dc#      ^c"YZei]k^h^W^a^in^cidi]Ze]nh^XVahiVijhd[i]Z^g
               7ji:bZghdcCZildg`EdlZgZc\^cZZghhVlZkZc         Zfj^ebZci!heVXZji^a^oVi^dc!edlZg!Xdda^c\VcY
               bdgZ[jcYVbZciVa^hhjZh#I]ZnjcYZghiddY           dkZgVaaXVeVX^in#6h]VhWZZcigjZ^ci]ZeVhi!
               i]Vii]ZYZbVcY[dgXdda^c\XdggZhedcYh             higViZ\^XVXfj^h^i^dchhjX]Vhi]^hZcVWaZjhid
               Y^gZXianidi]ZVbdjcid[ZcZg\nXdchjbZYWn          hdakZXjhidbZgegdWaZbh!Zc]VcX^c\i]ZdkZgVaa
               >IZfj^ebZci!VcYi]ViiVX`a^c\i]^hgddiXVjhZ       :bZghdcedgi[da^dVcYi]ZkVajZegdk^YZY
               XdjaYegdYjXZVYY^i^dcVaYgVbVi^XhVk^c\h#         idh]VgZ]daYZgh#




               >c'%&&!J#H#YViVXZciZghVgZ
               ZmeZXiZYidXdchjbZ'#*d[
               i]ZcVi^dchidiVaZaZXig^XVaZcZg\n#
;daadl^c\:cZg\nAd\^X
higViZ\^ZhXVcXjiV
YViVXZciZghZcZg\n
Xdchjbei^dcWn*%#
>iVahdXVc[gZZje
ild"i]^gYhd[kVajVWaZ
gV^hZYddgheVXZ!dcZ"i]^gY
d[jc^ciZggjei^WaZedlZg
hjeeanXVeVX^inVcY
)%d[Xdda^c\XVeVX^in#




               :bZghdchZc\^cZZgh
                  
                                              6EdlZg[ja;dgXZ[dg>ccdkVi^dc   P  &&R




IZX]cdad\n
EJIHDJG>CCDK6I>DCIDLDG@#


:bZghdcCZildg`EdlZgiZX]cdad\^ZhVgZVi
ldg`i]gdj\]djii]ZldgaYid]ZaeXjhidbZgh
deZgViZi]Z^gYViVXZciZghbdgZZ[X^Zcian
VcYZ[[ZXi^kZan#

>c'%%.!:bZghdcl^aaejii]ZhZhdaji^dchid
ldg`^cdjgdlccZl\adWVaYViVXZciZg#I]Z
(*!%%%"hfjVgZ"[ddi[VX^a^inl^aaZcVWaZ:bZghdc
idXdchda^YViZ&%%\adWVaYViVXZciZgh^cid[djg
adXVi^dch^cXdb^c\nZVgh#

I]ZhZiZX]cdad\^Zh!XdbW^cZYl^i]i]Z
dkZgVaaYZh^\c!l^aaZcVWaZi]ZXdbeVcnidjhZ
(&eZgXZciaZhhZcZg\ni]VcVigVY^i^dcVaYViV
XZciZg#:bZghdcVci^X^eViZhgZXZ^k^c\A::9
H^akZg8Zgi^XVi^dc[gdbi]ZJ#H#<gZZc7j^aY^c\
8djcX^aVcYeaVchidjhZi]ZcZl[VX^a^inVhV
h]dlXVhZ[dgYViV"XZciZgYZkZadeZghVgdjcY
i]ZldgaY#6eean^c\^ccdkVi^dcVi]dbZ#

;dgbdgZ^c[dgbVi^dcVWdji:bZghdcCZildg`
EdlZg!k^h^illl#:bZghdcCZildg`EdlZg#Xdb#
P&'R:bZghdc'%%-




                     
                                                         L]ViYg^kZh:bZghdch
             X]Vgii]Z[jijgZ#>c8]^cV![dgZmVbeaZ!adXVa
             :bZghdcZc\^cZZghaZkZgV\ZYdjgZmeZgi^hZ^c
                                                         hjXXZhh^hi]VidjgeVhh^dc
             jc^ciZggjei^WaZedlZghjeea^ZhVcYkVg^VWaZ     VcYY^hX^ea^cZYegdXZhhZh
             [gZfjZcXnYg^kZhidYZh^\ci]ZedlZgXdckZgidgh
             cZZYZYidbV`Zi]Zegdb^hZd[l^cYZcZg\n
                                                         igVchaViZlZaaVXgdhh
             VgZVa^in#                                   WdgYZghVcYXjaijgZh#
             IdYVn!:bZghdc^hi]Zghi8]^cV"WVhZY
             bVcj[VXijgZgidhjeeani]ZhZXdckZgidgh!VcY
             lZVgZldg`^c\l^i]i]gZZd[i]VicVi^dch
             aVg\Zhil^cYijgW^cZXdbeVc^Zh#L^i]\adWVa"
             ^chiVaaZYl^cYedlZgZmeZXiZYid^cXgZVhZVi
             VcVkZgV\ZVccjVagViZd['%eZgXZcidkZgi]Z
             cZmikZnZVgh!i]ZgZ^hV\gZVideedgijc^in
             idXdaaVWdgViZVXgdhh:bZghdcWjh^cZhhZhid
             egdk^YZVYY^i^dcVahdaji^dch#

             6cYlZVgZcihidee^c\Vil^cYedlZg#:bZghdc
             Xdci^cjZhid^ckZhi^cVl^YZgVc\Zd[iZX]cdad\n
             eaVi[dgbhVcYegdYjXihi]ViZcVWaZXjhidbZgh
             VgdjcYi]ZldgaYidh]^[iZaZXig^XVaedlZg
             \ZcZgVi^dciddi]ZghdjgXZhi]VigZYjXZXVgWdc
             Zb^hh^dch!^cXajY^c\hdaVg!cjXaZVg!]nYgdVcY
             cVijgVa\Vh#




             <adWVa"^chiVaaZYl^cYedlZg^h
             ZmeZXiZYid\gdl'%VnZVg
             dkZgi]ZcZmi*nZVgh#
       
eVhh^dcVcYY^hX^ea^cZYegdXZhhZhigVchaViZlZaa
VXgdhhWdgYZghVcYXjaijgZh#>cZVX]d[i]ZbdgZ
i]Vc&*%Xdjcig^Zhl]ZgZi]ZXdbeVcnYdZh
Wjh^cZhh!lZjcYZghiVcYVcYgZheZXidjg
XjhidbZgh#LZjcYZghiVcYi]Z^gWjh^cZhhZh
VcYi]ZegZhhjgZhi]Zn[VXZ#6cYlZh]VgZi]Z^g
XjaijgZVcYdeedgijc^in#I]^h^hVh^\c^XVci
VYkVciV\Z[dg:bZghdc#

>i]Vc`ZVX]d[djg&)%!%%%ZbeadnZZhVgdjcY
i]ZldgaY[dg[jZa^c\djgegd\gZhhZkZgnYVn#>i^h
i]Z^g`cdlaZY\Z!eVhh^dcVcYXdaaVWdgVi^dci]Vi
ZcVWaZh:bZghdcidVci^X^eViZWgdVYZg^hhjZhVcY
igZcYhidhZZi]ZldgaYi]gdj\]XjhidbZgh
ZnZhVcYidVYkVcXZ\gdjcYWgZV`^c\egdYjXih
VcYhdaji^dch#>i^hi]Z^giVaZciVcYY^hX^ea^cZi]Vi
l^aaZcVWaZ:bZghdcidbVcV\Zi]gdj\]i]Z
XjggZciX]VaaZc\Zh#




                           :bZghdchVYkVciV\Z
                                
                                           6EdlZg[ja;dgXZ[dg>ccdkVi^dc   P  &(R




DJG7DJC9A:HH

EVhh^dc
H:IHJH6E6GI#


L^i]bdgZi]Vc&)%!%%%iVaZciZYeZdeaZ
VgdjcYi]ZldgaY!:bZghdc^hZc\^cZZg^c\i]Z
jcZmeZXiZYcZVganZkZgnYVn^cZkZgni^bZodcZ#

6ii]Z:bZghdc9Zh^\c:c\^cZZg^c\8ZciZg
:9:8!l]^X]:bZghdcdeZcZY^cEjcZ!>cY^V!
^c'%%(!bdgZi]Vc*%%Zc\^cZZghXdaaVWdgViZ
idYZh^\cegdYjXihVcYhdaji^dch[dg:bZghdch
ldgaYl^YZeaVi[dgbhl]^aZVahdXgZVi^c\
iZX]cdad\^ZhidbZZii]Z\gdl^c\YZbVcY[gdb
adXVaXjhidbZgh^c>cY^VVcYi]gdj\]dji6h^V#

I]gdj\]:bZghdch6YkVcXZY9Zh^\c8ZciZg!
lZiVe^cidVk^gijVacZildg`d[aZVY^c\ZmeZgih
idZmeadgZVcYhdakZegdYjXiYZkZadebZci!
bVcj[VXijg^c\VcYbViZg^VahegdWaZbh#>c
VYY^i^dcid:bZghdcZc\^cZZgh!i]^hcZildg`
^cXajYZhidegZhZVgX]Zgh!hX^Zci^hihVcY
Zc\^cZZgh[gdbaZVY^c\jc^kZgh^i^ZhVcY
gZhZVgX]XZciZghVgdjcYi]ZldgaY#

AZVgcbdgZVWdjii]ZeZdeaZVcYegdXZhhZh
i]VibV`Z:bZghdcVedlZg[ja[dgXZ[dg
^ccdkVi^dcVilll#:bZghdc#Xdb#
P&)R:bZghdc'%%-




                     
             iZVb#I]^hdjihiVcY^c\\gdjed[aZVYZgh
             Xdci^cjZhidZmXZa^cVaadXVi^c\djg^ciZaaZXijVa
             VcYcVcX^VaXVe^iVaidYZa^kZg^ci]Zh]dgigjc
             l]^aZh^bjaiVcZdjhanWj^aY^c\[dgi]Zadc\iZgb#

             >VbVahd\gViZ[jaiddjgWdVgYd[Y^gZXidgh!l]^X]
             egdk^YZhkVajVWaZ^ch^\]iVcYhjeedgi#I]^hnZVg!
             lZ]VYi]Zeg^k^aZ\Zd[VYY^c\ildide\adWVaWjh^"
             cZhhaZVYZghid:bZghdchWdVgY7^aa?d]chdc!
             8:Dd[=Z^co!VcY=Vgg^Zi<gZZc!8:Dd[EgZb^Zg
             ;VgcZaaeaX#LZlZaXdbZVYY^c\i]Z^gZmeZg^ZcXZ
             VcY_jY\bZciiddjgiZVb#

             6cYd[XdjghZ!>i]Vc`ZVX]d[djg[Zaadl
             h]VgZ]daYZgh[dgndjgXdci^cjZYhjeedgi#

             :bZghdc^hVedlZg[ja[dgXZ[dg^ccdkVi^dc#
             I]^h]VhegdeZaaZY:bZghdcheVhi\gdli]VcY
             eZg[dgbVcXZ!VcYl^aaYg^kZi]ZXdbeVcnh[jijgZ
             hjXXZhh#>i^hl]ViZcVWaZhjh!V[iZg]ZVg^c\V
             XjhidbZgYZhXg^WZVegdWaZbdgcZZY!idgZhedcY
             l^i]Xdck^Xi^dc/NdjXVcXdch^YZg^ihdakZY#




             9Vk^YC#;Vgg
                                                                                                        P;GDBA:;IR
             8]V^gbVc!8]^Z[:mZXji^kZ
             D[XZg!VcYEgZh^YZci                                                     : 9 L 6 G 9  A #  B D C H : G
                                                                               8=>:;DE:G6I>C<D;;>8:G

                                                                                      8 G 6 > <  L #  6 H = B D G :
                                                                                  H : C > D G  K > 8 :  E G : H > 9 : C I !
                                                                          E A 6 C C > C <  6 C 9  9 : K : A D E B : C I

                                                                                       8 = 6 G A : H  6 #  E : I : G H
                                                                 H:C>DG:M:8JI>K:K>8:EG:H>9:CI

                                                                                               9 6 K > 9  C #  ; 6 G G
                                                           8 = 6 > G B 6 C !  8 = > : ;  : M : 8 J I > K :  D ; ; > 8 : G !
                                                                                                 6 C 9  E G : H > 9 : C I

                                                                                         L 6 A I : G  ? #  < 6 A K > C
                                                                 H : C > D G  : M : 8 J I > K :  K > 8 :  E G : H > 9 : C I
                                                                         6C98=>:;;>C6C8>6AD;;>8:G
