04                                                       2009 ANNUAL REVIEW




                                                To Our Shareholders:
     In another extraordinarily di cult year for the banking         While these are important achievements, this is no time
     industry, BB&T remained strong and pro table because            for complacency. e banking industry, as well as the
     we stayed true to our deeply rooted vision, mission and         national and global economies, are not out of the woods
     values. Your company stood out as a safe and secure haven       yet. We still face risks and challenges. While BB&T has
     when other nancial institutions stumbled and even failed.       fared better than our peers in the amount of problem
     Just as BB&T was the only bank in the Carolinas to keep         assets because of our disciplined lending standards, we
     its doors open during the Great Depression of the 1930s,        must stay vigilant because the real estate markets are still
     we have been one of three regional banks in the nation to       under stress. Our clients are understandably wary of new
     remain pro table during the "Great Recession" of the past       investment and new loans with so many Americans still
     two years.                                                      out of work and so much uncertainty coming out of
                                                                     Washington. ey also are justi ably skeptical after
     We are proud of our accomplishments this year. Among
                                                                     watching so many nancial institutions falter or, worse,
     our most important, your company:
                                                                     abuse their trust. As a result, even though we are ready
                                                                     and eager to lend, would-be borrowers are holding back.
        Became one of three large regional banks to pass the
         federal government's "stress test" for capital strength,
                                                                     We also face increased regulation from Washington that
         and among the rst group of nancial institutions to
                                                                     will hamper the competitiveness of U.S. banks in a global
         exit the government's Troubled Asset Relief Program.
                                                                     marketplace. Despite the political rhetoric blaming the
                                                                     banking industry for both causing the nancial crisis
        Completed the FDIC-assisted acquisition of Colonial
                                                                     and now impeding economic recovery, the truth is most
         Bank, the largest in our history, in a deal that protects
                                                                     traditional U.S. banks have been working very hard to do
         us from Colonial's problem assets while signi cantly
                                                                     our primary job  lending to help businesses grow and
         expanding BB&T's presence in Florida, Alabama and
                                                                     create jobs in the communities they serve. BB&T and
         Georgia  and giving us an important stake in the
                                                                     other healthy banks have paid back government-assistance
         huge Texas market.
                                                                     funds, with a good return for taxpayers. While some banks
        Won recognition by our clients for superior service
                                                                     did contribute to the crisis by o ering risky exotic loans
         despite the challenging market, as evidenced by
                                                                     and investments, the government also shares the blame
         independent surveys measuring our mortgage sales
                                                                     with ill-considered policies encouraging risky unsustainable
         and servicing, mobile banking, wealth management,
                                                                     mortgages. Even though BB&T did not participate in the
         service to small businesses and middle market
                                                                     riskiest subprime mortgages and other investments, and
         companies, and more.
                                                                     would likely bene t from Washington's push to limit the
                                                                     size and activities of large banks because we avoid esoteric
        Touched the lives of 1.6 million people through the
                                                                     practices such as owning hedge funds, the answer is not
         BB&T Lighthouse Project.
                                                                     to have politicians dictate what products are o ered by
        Contributed to the U.S. economy by extending more           private nancial institutions. e better answer is to
         than $75 billion in loans, including a signi cant           require banks to have the capital cushions needed to
         portion to small businesses and middle market               protect their clients. At BB&T, we want the free market
         companies; restructured $3 billion in mortgage loans        to decide who survives and who fails.
         to help homeowners keep their homes; and employed
         more than 32,000 people.
                                                               05
                                                               07




Despite the numerous challenges facing the industry
and BB&T, I have never been more optimistic about the
long-term future of your company. Unlike many of our
competitors, we have the underlying nancial strength
and pro tability to meet our clients' needs as the economy
stabilizes and ultimately begins expanding again. We already
are bene ting from a " ight to quality" in attracting
deposits, purchasing assets and winning clients from
weakened and distracted competitors. Revenue from
our insurance, mortgage banking and other businesses
produced record results in 2009 and we are well-
positioned to expand our corporate banking services.
   e lighthouse on the cover of this report is a meaningful
symbol for BB&T. Since our founding in 1872, we have
managed conservatively and been careful stewards of our
clients' trust. We have been a beacon guiding clients to
safe harbor in turbulent times such as the last two years.
In 2009, our Lighthouse Project focused on helping our
communities that also are struggling economically; BB&T
employees donated 53,000 volunteer hours to more than
1,000 community service projects. In 2010 and beyond,
we believe the BB&T lighthouse also will become another
kind of beacon  one illuminating nancial strategies to
help our clients meet their nancial goals during today's
uncertain times, and during the better times ahead.
For our country and for BB&T, I rmly believe our
best days are ahead.




Kelly S. King
Chairman and
Chief Executive Officer
06                                                       2009 ANNUAL REVIEW




                                                      OUR 2009 RESULTS


     Despite a challenging operating environment for nancial         We are encouraged by signs of stabilization, particularly
     institutions, BB&T's results showed very positive trends in     in BB&T's consumer loan portfolios. We also are pleased
     2009, including strong growth in deposits and mortgage          with a reduction in the rate of increase in nonperforming
     banking, insurance and other non-interest income. While         assets for each quarter of 2009. Despite industry concern
     our bottom-line results re ect continued recessionary           about problem commercial real estate loans, we have
     pressures, including slower loan growth and higher credit       not seen evidence of major deterioration, with a modest
     costs, we are encouraged by a signi cantly slower growth        increase in gross charge-o s from 1.0% to 1.2% in the
     rate in nonperforming assets and more stability in many         fourth quarter. In addition, we are diversifying our loan
     of our lending portfolios as the year came to a close. We       portfolio to decrease our exposure to real estate while
     continue to substantially outperform our peers, demonstrate     focusing more attention on commercial and industrial
     consistent underlying earnings power and are seeing             loans over the next few years. In the fourth quarter of
     meaningful bene ts from our FDIC-assisted acquisition           2009, our commercial and industrial portfolio increased
     of Colonial Bank.                                               by 11.5% on an annualized basis, while we continued to
                                                                     work through our homebuilder portfolio, reducing our
     Net income for the year totaled $877 million, or $1.15 per
                                                                     exposure to this stressed portfolio by $2.2 billion, or 28%,
     diluted share, re ecting decreases of 42.6% and 57.6%,
                                                                     to $5.8 billion, during 2009. e growth in commercial
     respectively. In this environment, the most important
                                                                     and industrial lending re ects our success in attracting
     driver of performance is credit quality. For the second year,
                                                                     companies that moved their business to BB&T in a " ight
     increases in the provision for credit losses were the biggest
                                                                     to quality" because they view BB&T as better equipped to
     cause for our lower earnings. Nonperforming loans, as a
                                                                     meet their nancing needs.
     percentage of total loans, were 2.56% at December 31,
     2009, compared to 1.43% a year earlier. Net charge-o s          BB&T's strong balance sheet also contributed to our
     increased to 1.74% of average loans and leases for 2009,        record net revenues in 2009 as depositors sought safety
     up from .89% the previous year. Even with these higher          and security. Average client deposits, including balances
     levels of nonperforming assets and charge-o s, BB&T             acquired from Colonial, increased by 28.8% to $105.4
     still leads our peer group with the lowest levels of            billion for the fourth quarter of 2009, compared to a year
     nonperforming loans and superior overall credit quality.        earlier; without Colonial, client deposits were up a still-
         e largest concentration of our problem loans continues      strong 7.1%. Our deposit growth during the year re ects
     to be residential properties in Atlanta, Florida and metro      continued improvement in deposit mix in the fourth
     Washington, D.C., where prices fell sharply from highly         quarter, with more of our growth coming in lower-cost
     in ated levels, as well as modest deterioration in the          deposits. In addition, deposit costs have continued to
     coastal areas of the Carolinas.                                 decrease while balances have continued to grow.




     INDUSTRY LEADING RETURNS
     SUPERIOR RETURN ON AVERAGE ASSETS                               SUPERIOR RETURN ON AVERAGE COMMON EQUITY
                                                                     20.0 %
     2.0 %
     1.6
                                                                     15.0
     1.2
                                                                     10.0
                                                        .56%                                                              4.9%
      .8
                                                                      5.0
      .4
                                                                        0
       0
                                                                      -5.0
     -.4
                                                                                                                         -11.5%
                                                        -.92%        -10.0
      -.8
                                                                                BBT       Peers
                BBT         Peers
                                                                     -15.0
     -1.2
                                                                                  `05       `06       `07       `08       `09
                      `05     `06     `07      `08      `09
                                                     BEST BANK IN TOWN SINCE 1872                                                  07




Average loans and leases increased by 7.3% compared to              banking operations, which produced a 139% jump in
2008, including loans acquired from Colonial. Excluding             income from record production revenue and increased
Colonial, average loan growth was up 2.6% from 2008.                servicing income from a larger servicing portfolio.
Our loan growth compares very favorably with the                    Checkcard, wealth management and other non-deposit
industry, where average loan balances are generally down.           fees and commissions also contributed to this growth.
Banks have been criticized for reluctance to make loans
                                                                    For 2009, BB&T's return on average assets was .56%
due to concerns about credit quality, but the main reason
                                                                    while the return on common shareholders' equity was
for sluggish loan growth is soft demand from borrowers
                                                                    4.93%. While these ratios are signi cantly lower than we
still anxious about an uncertain economy. I assure you
                                                                    experience in a "normalized" credit environment, they
that BB&T remains eager to make every good loan we
                                                                    do re ect positive earnings. An average of our peers'
can nd.
                                                                    performance re ects a return on average assets of
Net interest income totaled $4.8 billion for 2009, up               -.92% and a return on average common shareholders'
14.3% from a year earlier. Our net interest margin                 equity of -11.5%.
basically the di erence between the interest received on
                                                                    Finally, we are encouraged by what we regard as one of
loans and investments and the interest paid on deposits
                                                                    the most important measures of our normalized earnings
and other funding, expressed as a percentage of average
                                                                    power: pre-tax pre-provision income. During a credit
earning assets  improved to 3.66% from 3.58% in 2008.
                                                                    cycle, all nancial institutions experience heightened credit
Importantly, in the fourth quarter of 2009, our margin
                                                                    costs. Pre-tax pre-provision income re ects the underlying
improved to 3.80%, the strongest level in years.
                                                                    earnings power of a company. is measure increased
Revenue from BB&T's fee income-producing businesses,                5.9% to $3.7 billion in 2009 from a year earlier, which we
which represent 42.8% of total revenue, increased during            consider a very positive number in a di cult environment.
2009 by 23.1% to $3.9 billion, underscoring the bene t              While our results are certainly lower than BB&T's historical
of our diversi ed businesses. e biggest contributor was             numbers  and we are never satis ed with lower results
BB&T's insurance operations, which exceeded $1 billion               they are among the strongest results in the nancial
in noninterest income for the rst time, and mortgage                services industry.




FLIGHT TO QUALITY AND COLONIAL ACQUISITION DRIVE LOAN AND DEPOSIT GROWTH
AVERAGE LOANS                                                      AVERAGE DEPOSITS
     $108                                                                  $120
                    8.9% Growth                                                         23.5% Growth
              106                                    $105.9
                                                                                                                         $113.6
              104
                                                                                  110
                                            $103.3
                                                                                                                $107.3
              102

              100
                            $99.7   $99.6
                                                                                  100
              98
                    $97.2
                                                                                                        $94.4
              96                                                                                $93.9
                                                                                        $92.0
                                                                                  90
              94
($ billion)




              92
                                                                    ($ billion)




              90                                                                  80
                    4Q08    1Q09    2Q09    3Q09     4Q09                               4Q08    1Q09    2Q09    3Q09     4Q09
08




                          Faye Bordeaux, LCSW, Chief Executive Officer, Cambridge Behavioral Health Services, PLLC, Greenville, N.C.




     With a mission of serving individuals with emotional and behavioral challenges, Faye and Frankie Bordeaux dreamed of
     opening a behavioral health practice and needed a strong financial institution to finance the building purchase. BB&T
     responded with a loan for the new facility, and have since financed the construction of two more facilities. Today, the
     Bordeauxes have a multi-million-dollar practice in two locations, offering counseling, medication management, case
     management and other services. BB&T's consultative approach has yielded a long-lasting relationship, now managed by
     Business Services Officer Tommy Price. The relationship includes providing deposit accounts, employee benefit plans, wealth
     management, cash management and merchant and payroll services. "Because BB&T is our one-stop shop for banking, we
     can focus our energy on helping patients and building our practice," says Chief Operating Officer Frankie Bordeaux.




     LEFT TO RIGHT: Faye Bordeaux, Cambridge Behavioral Health Services, LCSW, Chief Executive Officer; Dennis Alexander, BB&T Senior Vice President/City Executive;
     Tommy Price, BB&T Vice President/Business Services Officer; Frankie Bordeaux, Cambridge Behavioral Health Services, Chief Operating Officer
                                                BEST BANK IN TOWN SINCE 1872                                                    09




                                            OUR STOCK PERFORMANCE


   e bottom line in BB&T's mission is to optimize the            day in my 37-year banking career  was having to reduce
long-term return to our shareholders, while providing a          BB&T's annual dividend to $.60 per share. I believe it
safe and sound investment.                                       was a prudent and necessary decision to help us maintain
                                                                 a strong capital position throughout this economic
As investors know too well, the last decade has been a
                                                                 downturn, and, considering our levels of earnings in recent
di cult period for stock prices. In fact, the last 10 years
                                                                 quarters, the reduction was required by banking regulations.
is the rst time since the 1930s when there was a negative
                                                                 I also believe the dividend reduction is a temporary
return on stocks. But in this very volatile environment
                                                                 measure. I know how much many of our shareholders
for stock prices, particularly shares of nancial services
                                                                 depend on our dividends. I promise you that I and our
companies, your company has been a hallmark of steady
                                                                 leadership team are working as hard as we possibly can to
performance. While our 10-year performance certainly is
                                                                 improve earnings. When economic conditions improve
not as good as we would like, BB&T did post a modest
                                                                 and our earnings levels permit an increase in the dividend,
gain while the banking industry and the S&P both
                                                                 we are committed to increasing the dividend to an
su ered declines. For the periods ended December 31,
                                                                 appropriate level. We continue to target a 40% to 60%
2009, we outperformed an average of our peers over the
                                                                 payout of our earnings to our shareholders. For example,
last 1, 2, 3, 5, 7, 10, 15 and 20 years. Even considering
                                                                 in the fourth quarter of 2009, we earned $.27 per share
the erosion of stock prices that began in 2007, a $100
                                                                 and paid out $.15 per share, or a 56% payout. Finally, like
investment in BB&T shares in 1995 was worth $315
                                                                 our stock price, our current dividend still compares very
on December 31, 2009  signi cantly better than the
                                                                 favorably with our peers. We were the last large bank to
S&P 500.
                                                                 reduce our dividend, and we continue to pay a premium
                                                                 compared to other large banks and all but one of our
Dividends also are very important to our shareholders, and
                                                                 peers. While it was a painful decision in the short term,
a very important responsibility for BB&T. Your company
                                                                 I believe it will prove to be in the best interest of our
has paid a cash dividend every year since 1903. By far the
                                                                 shareholders and the company over the long term.
most di cult decision for me in 2009  and the worst




                 DIVIDEND YIELD
                 AS OF DECEMBER 31, 2009



                 4.0



                 3.0

                                2.36%

                 2.0



                 1.0



                 0.0
                                BBT HBAN USB          RF   WFC    MI   KEY CMA COF FITB ZION BAC
                                                PNC                                                     STI
                          MTB
10                                                      2009 ANNUAL REVIEW




                                                 OUR CAPITAL STRENGTH


     In the midst of the nation's most severe nancial crisis       In June, BB&T received regulatory approval and bought
     since the 1930s, BB&T demonstrated that its capital           back the preferred stock it sold to the U.S. Treasury in
     levels are among the strongest in the industry. Capital,      November 2008. In addition to $3.1 billion to repurchase
     a key measure of a bank's nancial health, is the margin       the stock, BB&T paid the government a total of $92.7
     by which creditors are covered if the bank's assets are       million in dividend payments and paid $67 million to
     liquidated. In the fourth quarter of 2008, the federal        repurchase the warrant from the government  amounting
     government's concern about bank failures prompted the         to an 8.4% rate of return, an excellent investment for
     Treasury Department and banking regulators to strongly        the American taxpayer. At the same time, BB&T has
     encourage even well-capitalized institutions such as BB&T     remained committed to helping meet the TARP's original
     to accept government investment to increase capital levels    spirit of thawing frozen credit markets. As we proudly
     as part of its Troubled Asset Relief Program, or TARP.        proclaim with the "Still Strong, Still Lending" banners in
                                                                   front of our branches, we continue to actively pursue and
     As I said in last year's report, we were determined to exit
                                                                   make every good loan we can nd. Our loan originations
     TARP as soon as possible because the accompanying
                                                                   exceeded $75 billion in 2009.
     excessive government regulations are inconsistent with
     our free-market principles and harmful to shareholders.       At December 31, 2009, our Tier 1 risk-based capital ratio
     I am pleased to report that your company was among the        and total risk-based capital ratio were 11.5% and 15.8%,
       rst nancial institutions in the country to meet the         respectively, compared with 11.1% and 15.6%, respectively,
     government's standards to exit the program. In May,           at September 30, 2009. Our Tier 1 common ratio, a
     BB&T exceeded the government's minimum "stress test"          measure of tangible capital, was 8.5% at December 31,
     requirements under a "more adverse" economic scenario         2009, ranking second in our peer group. ese ratios
     that projected a prolonged and deepening recession           all remain well above regulatory standards for well-
     assumptions more severe than BB&T's estimates. e test,        capitalized banks.
     conducted by federal regulatory o cials using rigorous
                                                                   Our strong capital position both bolsters your company
     forward-looking criteria, showed that BB&T surpassed
                                                                   during the current credit cycle and gives us the exibility
     minimum requirements for regulatory and tangible capital.
                                                                   to take advantage of opportunities as we emerge from the
     In the year since the stress test, BB&T has outperformed
                                                                   economic downturn.
     the government's projections for earnings by $576 million
     and outperformed expectations for losses by $2.4 billion.




     SUPERIOR CAPITAL LEVELS VS. PEERS 1
                                                                   TOTAL CAPITAL RATIO
     TIER 1 COMMON EQUITY RATIO

     10.0%                                                         20.9%



                                                       8.5%        17.7
                                                                                                                                       The 2009 decrease
     8.0                                                                                                               15.8%
                                                                                                                                       in total capital
                                                       7.4%
                                                                                                                                       reflects BB&T's
                                                                   14.4                                                15.4%
                                                                                                                                       repayment of TARP.

     6.0
                                                                   11.2

                                                                                                                                 (1)
                                                                                                                                       These are Non-GAAP
                                                                                                                                       measures. Refer to
                                                BBT       Peers                                                 BBT      Peers
     4.0                                                            8.0                                                                page 1 for discussion.
             `04      `05     `06      `07     `08      `09                  `04     `05     `06      `07      `08     `09
                                                                                                                                                                                        11




To build on their 100-year history in the construction industry, the Murphy family was eager to consolidate their corporate investment,
debt and treasury management requirements. The family also valued their 14-year relationship and accounts with Colonial Bank. When
BB&T purchased Colonial's Florida operations, BB&T City Executive Robert Bowlby and Business Deposits Officer Lina Macki, who
had long handled the family's corporate accounts at Colonial, quickly offered a solution that met the family's needs and preserved the
relationship. With its solid capital base, BB&T offered a secure place for the multi-million-dollar cash-investment balance of the family's
company, Coastal Construction, along with business loans and financing that were previously managed by Colonial. The builder also
turned to BB&T for treasury management tools that now help Coastal efficiently handle thousands of transactions, including checks,
wires, investments and payments, on a secure and timely basis. Among Coastal's many projects is this expansion and renovation of
Miami's Southside Elementary Museums Magnet School.




                                            Tom Murphy, Jr., Chairman and CEO, Coastal Construction Company, Miami, Fla.




LEFT TO RIGHT: Michael S. Goldberg, BB&T Vice President/Sales and Service Leader; Maria A. Paulsen, BB&T Vice President/Financial Center Leader; Sean M. Murphy, Coastal Construction
Company, Executive Vice President; Lina Macki, BB&T Vice President/Business Deposits Officer; Tom C. Murphy, Coastal Construction Company, Executive Vice President; Robert Bowlby,
BB&T City Executive; Tom Murphy Jr., Coastal Construction Company, Chairman & CEO
                                                           2009 ANNUAL REVIEW
12




                                            OUR COLONIAL BANK ACQUISITION


     Our acquisition of Colonial Bank in August 2009 was             Protects BB&T from losses from substantially all acquired
     a strategically compelling and nancially attractive             loans and securities
     transaction that has exceeded all of our rigorous criteria      BB&T emerged as a top candidate to take over Colonial,
     for acquisitions. e transaction has four key bene ts:           the largest of 140 U.S. bank failures in 2009, because of
                                                                     our ongoing strength during the nancial crisis. Under an
     Expands and enhances BB&T's franchise in key markets
                                                                     agreement with the Federal Deposit Insurance Corporation,
     BB&T's goal is to be in the top ve in deposit market
                                                                     BB&T assumed all of Colonial's $19.2 billion in deposit
     share in all of our markets. e transaction propelled us to
                                                                     accounts, but did not acquire any of the assets or assume
     No. 5 in Florida (from No. 11) and opened new markets
                                                                     any obligations from Colonial's holding company. BB&T
     in the burgeoning South Florida communities. We moved
                                                                     purchased $19.6 billion of assets, with essentially all either
     up dramatically in Alabama to No. 4 (from No. 55) and
                                                                     covered by FDIC loss-sharing protection or risk-free assets
     are well-positioned to bene t from market turmoil caused
                                                                     like cash. e FDIC will cover 80% of losses and share
     by several bank failures and takeovers in that state. We
                                                                     some of our upside if losses are less than $5 billion, and
     bolstered our No. 5 ranking in Georgia, with notable
                                                                     assumes 95% of losses above $5 billion. BB&T's
     gains in Atlanta and Columbus.
                                                                     responsibility for the 20% of the rst $5 billion has
        e acquisition also gave us a foothold in the important       already been recorded. If the entire covered portfolio were
     Texas market, with its huge population (24.8 million in         charged o , BB&T's maximum exposure would be less
     Texas versus 18.5 million in Florida and 9.4 million in         than $500 million before taxes. One of our most important
     North Carolina) and diverse economy. Our 22 nancial             requirements for acquisitions in this credit environment
     centers in the Dallas and Austin markets  while representing   is to protect our balance sheet from additional credit risk.
     a small share of the market  complement our existing               e Colonial deal meets that goal very well.
     commercial insurance and mortgage businesses in Texas.
     We are committed to expanding our presence in the state
     over time.
        ough larger size is not a goal of our acquisitions, it is
     worth noting that the Colonial transaction is the largest
     acquisition in BB&T's 138-year history and makes us
     the nation's 10th largest nancial holding company by
     deposits. e Colonial acquisition also was ranked No. 3
     in Time magazine's top 10 business deals of 2009.




          Headquarters
          BB&T
          Colonial
                                                                                                                                                                                   13




                                                         Dr. Marc Bendickson, Dynetics Inc., Chairman & CEO, Huntsville, Ala.



A leader in engineering, scientific and information technology for the U.S. government and other business sectors, Dynetics was on the verge
of closing its deposit account with the failing Colonial Bank. After BB&T announced its acquisition of Colonial's banking operations, Alabama
State President Dont L. Wilson and Commercial Lending Officer Herman Stubbs swiftly arranged to meet with company leaders to rescue the
relationship. Wilson and Stubbs personally assured Dynetics of BB&T's strength, commitment to helping clients and knowledge of government
contracts and services. As a result, Dynetics chose to continue its services and immediately moved a money-market account worth several
million dollars to BB&T from a competing bank. The key reasons for the decision: BB&T's long tradition of conservative management, ability to
offer a seamless transition and attractive services including wealth management and insurance. "We were impressed with BB&T and its strong
state leadership, and felt comfortable putting our business in their hands," says Dr. Bendickson.


LEFT TO RIGHT: Eddie Hoff, BB&T Huntsville City Executive; Tom Baumbach, Dynetics Inc., President, Board of Directors; Randy Reynolds, Dynetics Inc., Vice President of Finance;
Herman Stubbs, BB&T Commercial Lending; Dont L. Wilson, BB&T Alabama State President & North Alabama Regional President; Dr. Marc Bendickson, Dynetics Inc., Chairman & CEO
                                                              2009 ANNUAL REVIEW
14




     Provides immediate earnings contribution                               Creates opportunities for growth
     Using conservative assumptions, the transaction exceeds                Colonial's franchise, widely coveted in the banking
     BB&T's merger criteria. is immediate positive e ect on                 industry, was not performing up to its potential because
     earnings includes the impact of issuing 38.5 million shares            of the bank's nancial problems. We have created new
     of common stock at $26 per share to raise proceeds of $963             community bank regions, which allow decision-making
     million in connection with the acquisition. We have a                  close to the client, and introduced BB&T's broader array
     proven track record of achieving cost-savings targets in               of products and services. Already, Colonial and BB&T
     acquisitions. In this transaction, we anticipate reducing              employees, working seamlessly side-by-side, have retained
     30% of the Colonial cost base, or $170 million pre-tax                 and expanded our relationship with many of Colonial's
     annually, o setting an estimated $185 million pre-tax                  clients. In Alabama, for example, we have won deposits
     in one-time merger and integration costs.                              and loans from competitors because of BB&T's long
                                                                            record of nancial strength. Amazingly, employees in the
                                                                            former Colonial branches have grown deposits by $1.5
                                                                            billion since the August 14 acquisition date and have
                                                                            originated $334 million in loans.




     Texas Regional President Kay St. John sees exciting prospects for BB&T's growing presence in one of the nation's largest
     states. With nearly three decades of financial services leadership experience in Texas, St. John is enthusiastic about the
     state's robust business climate, particularly in the commercial, industrial and real estate markets. In addition to leading the
     bank's regional business, retail and mortgage operations, her goal is to provide the resources needed to build awareness and
     meet the needs of clients and local communities. "Our team is hitting the ground running and we have the right suite of
     products and services to help existing and new Texas clients," says Ms. St. John.




                           Kay St. John, BB&T Texas Regional President, Dallas, Texas
                                                BEST BANK IN TOWN SINCE 1872                                                                               09
                                                                                                                                                            15




                                                MARKET COVERAGE




                    BB&T Headquarters             Equipment Finance                                 Regional Acceptance
                    BB&T Community                                                                  SBA Group
                                                  Governmental Finance
                    BB&T Capital Markets          Grandbridge Real Estate Capital                   Scott & Stringfellow
                    AFCO/CAFO/Prime Rate          Insurance                                         Sheffield Financial
                    Commercial Finance            Lendmark Financial Services                       Sterling Capital

             Map generated by SpatiaLogic




BB&T DEPOSIT MARKET SHARE AND BRANCH LOCATIONS BY STATE

                               BRANCHES     MARKET SHARE 1   % OF BB&T DEPOSITS 1
Virginia                        392             3rd                   19 %
North Carolina(2)               360             2nd                   21
Florida                         307             5th                   16
Georgia                         178             5th                   11
Maryland                        130             6th                    6
South Carolina                  116             3rd                    6
Alabama                          91             4th                    6
Kentucky                         90             3rd                    4
West Virginia                    78              1st                   5
Tennessee                        57             6th                    3
Texas                            22            48th                    1
                                                                                      Based on FDIC.gov data as of June 30, 2009. Includes effect of the
                                                                                (1)
DC                               12             7th                    1              Colonial acquisition. BB&T has an incidental presence in Indiana.
Indiana                           2               --                  --              Excludes home office deposits.
                                                                                (2)
                                                        2009 ANNUAL REVIEW
16




                                                         OUR VALUES


     We believe our values are the underlying reason for our           e rst part of our mission is to help our clients achieve
     success. at has never been more true than during the           economic success and nancial security. It is worthwhile
     di cult times of the last two years.                           work and one of the most important relationship
                                                                    responsibilities in the world because nances are crucial
     People are disillusioned and skeptical about the nancial
                                                                    in helping people achieve their dreams and goals in life.
     sector, causing some banks to seek to rede ne themselves.
                                                                    We achieve that mission by o ering products that
     At BB&T, we have never had to rede ne ourselves. We
                                                                    meet their needs, and service that is reliable, responsive,
       gured out who we were long before this nancial crisis,
                                                                    empathetic and competent. e second part of our
     and the last one. By remaining true to fundamental values
                                                                    mission is to create a place where employees can learn,
     that are deeply rooted in our history and culture, we are
                                                                    grow and be ful lled in their work. We achieve that with
     not distracted by trends that come and go. We did not
                                                                    continuous training that instills our values. Our mission
     rush in to embrace the exotic mortgages and other ashy
                                                                    also requires that we support our communities, and
     products that have haunted some other nancial institutions,
                                                                    we achieve that by contributing our money and more
     largely because such products would not be bene cial to
                                                                    importantly our time, as you'll see when you read about
     our clients, and therefore would be inconsistent with
                                                                    our Lighthouse Project in the next section of this report.
     our mission.
                                                                    Finally, by living our mission, we achieve our bottom line
                                                                    as a company: optimizing the long-term return to our
     Our values are the "heart and soul" of how we choose to
                                                                    shareholders, while providing a safe and sound investment.
     live our organizational life, and how we make our everyday
     decisions. Our values are our beliefs. People behave in a
                                                                    Of course, our values, vision and mission are just words on
     manner that is consistent with their beliefs. Honesty is our
                                                                    a page unless all of the individuals who make up BB&T
     bedrock value, as you see depicted in the accompanying
                                                                    both believe and practice them. at's why we also stress
     illustration. Without honesty, there can be no trust.
                                                                    in our employee training programs what I call the
     Without trust, there can be no meaningful relationships.
                                                                    characteristics of outstanding achievers. ey include
     And without relationships, there can be no advancement
                                                                    believing absolutely that BB&T will become the best
     as an organization or a society. Particularly now, after
                                                                      nancial institution possible, committing the time, energy,
     so many nancial scandals and other violations of trust,
                                                                    resources and training to get the job done, and enjoying
     people form relationships only with individuals and
                                                                    the journey. But the most important characteristic is an
     institutions they trust.
                                                                    Enthusiastic Positive Attitude about work and life  an
                                                                    attitude that we believe our clients and communities share
     Our values help us achieve our vision of creating the
                                                                    with our employees.
     best nancial institution possible. ey also help us
     "live" our mission of serving our clients, nurturing our
     employees, supporting our communities and rewarding
     our shareholders.
                                     BEST BANK IN TOWN SINCE 1872                                     17




                                           OUR VISION
                           To Create the Best Financial Institution Possible
                                        "The Best of The Best"




                                         OUR MISSION
                           To Make the World a Better Place to Live, By:
                Helping our Clients Achieve Economic Success and Financial Security;
        Creating a Place where our Employees can Learn, Grow and be Fulfilled in their Work;
            Making the Communities in which we Work Better Places to be; and thereby:
 Optimizing the Long-Term Return to our Shareholders, while Providing a Safe and Sound Investment.
                                                                     2009 ANNUAL REVIEW
18




                                                         OUR LIGHTHOUSE PROJECT


        My proudest moment in 2009 was watching our employees                  Many employees told me it was a life-changing experience
        live our mission by helping  on a very personal level                for them, and almost half of those who responded to a
        the communities we serve. In our Lighthouse Project, we                company survey said they gave additional time to the
        sponsored more than 1,000 hands-on community service                   organization they chose for the Lighthouse Project.
        projects that touched the lives of more than 1.6 million               Employees also said they've noticed improved teamwork in
        people in 25 states. BB&T distributed approximately                    the o ce as a result of rolling up their sleeves together for
        $3 million, based on a $100 contribution for each of our               their communities. ey've shared their excitement with
        30,000 employees. But much more important than the                     their clients. And, based on the overwhelmingly positive
        money was the time BB&T employees contributed to                       response, we have committed to sponsor the Lighthouse
        personally select and then complete a project that would               Project again in 2010.
        give a boost to their communities during these tough
                                                                               To quote one employee in our survey: "I'm proud to be
        economic times. We renovated daycare centers and school
                                                                               part of an organization that is big enough to meet the
        playgrounds, painted Habitat for Humanity houses,
                                                                               needs of even the most sophisticated investors, but not too
        assembled toys, packaged school supplies, stocked food
                                                                               big to kneel to help a child or other individual in need."
        pantries, taught children to swim, conducted museum
        tours, prepared care packages for overseas troops and
        much, much more.




     RONALD MCDONALD HOUSE                                                                                UNITED SERVICE ORGANIZATIONS
                                                         STANDUP FOR KIDS
     Roanoke, Virginia                                                                                    Atlanta, Georgia
                                                         Orange County, California

     The Ronald McDonald House in Roanoke,                                                                Two dozen BB&T employees showed their
                                                         Staff from BB&T Insurance Services teamed
     Virginia, had limited resources to make needed                                                       appreciation for military personnel and their
                                                         with STANDUP FOR KIDS, a nonprofit
     improvements in its housing for families of                                                          families by volunteering at the United Services
                                                         organization that benefits at-risk children,
     pediatric patients. More than 300 BB&T                                                               Organizations (USO) Center in Atlanta. In
                                                         to address the needs of homeless youth in
     volunteers pitched in, replacing the home's                                                          addition to donating funds, employees served
                                                         Orange County, California. Employees donated
     blinds and lighting, installing new picnic tables                                                    as greeters, assembled 500 USO care packages
                                                         200 backpacks stuffed with school supplies,
     and benches and supplying the playground                                                             and distributed lunches. The USO Center
                                                         as well as 56 sleeping bags and 100 survival
     with 1,400 square feet of mulch, making it                                                           serves as a coordination point for incoming
                                                         kits containing food and hygiene products. "We
     safer for children to use. "Thanks to BB&T,                                                          and outgoing members of the U.S. armed
                                                         were overwhelmed by BB&T's generosity," said
     we are able to give our families a house that                                                        forces. "The heart of the USO is its volunteers.
                                                         Executive Director Justine Madison. "The
     feels more like home," said Executive Director                                                       BB&T's presence and help lifted the spirits of
                                                         donation came at the perfect time."
     Laney Mofield.                                                                                       our troops," said Executive Director Mary
                                                                                                          Lou Austin.
                                                  BEST BANK IN TOWN SINCE 1872                                                              19




                                OUR KEY STRATEGIC OBJECTIVES FOR 2010


Clear, consistent long-term goals are essential for the          Effectively Manage through the Credit Cycle
success of any organization, especially during the volatile      For the third consecutive year, the ability to manage
and uncertain times we've been experiencing. e penalty           credit costs will be the number one driver of BB&T's
for ill-prepared banks is heavy: In 2009, 140 banks failed,      performance. We are encouraged by signs of stabilization.
up from 25 in 2008 and three in 2007. Even though the            In Florida, where we experienced the highest loss rates due
economy is showing signs of recovery, more failures are          to the substantial drop in home values, delinquency rates
forecast for 2010.                                                attened out in the fourth quarter. For BB&T as a whole,
                                                                 the rate of growth in nonperforming assets declined
   e banking industry's challenges are daunting: the
                                                                 throughout 2009, to 7% in the fourth quarter from
aftermath of the deepest global economic recession in
                                                                 35.5% in the rst quarter. For 2010, we expect that trend
decades, increased risk in the nancial and real estate
                                                                 to continue and currently believe charge-o s will be at
markets, intense competition, increasing regulatory cost,
                                                                 for the full year compared to 2009.
and overcapacity in the nancial services industry. e
winners over the long term will be those nancial services           at said, the economy remains uncertain, so we must
companies with strong cultures, rational strategies,             maintain our intensive risk-management focus, including
superior processes and exceptional executional abilities.        early identi cation of problems, reducing our real estate
                                                                 exposure and allocating more resources to collections
To assure BB&T is one of the winners, we have never
                                                                 and risk management. We have reassigned 500 employees
wavered from our long-term goal of creating a superior
                                                                 from loan production to loan administration as we
earnings-per-share growth rate without sacri cing the
                                                                 aggressively work through credit problems. Our commercial
fundamental quality and long-term competitiveness of
                                                                 real estate portfolio is diversi ed and we follow a strict
our business, nor taking unreasonable risk. Strategies and
                                                                 project limit of $25 million, which e ectively prohibits
tactics may vary, but four principles form the foundation
                                                                 BB&T's involvement in high-rise o ces, condos and
for our goal:
                                                                 hotels, large retail centers and other projects that have
   Client-driven service with a passion for consistently        shown the most distress.
    providing better value, based on higher service
                                                                 Consistent with BB&T's mission, we seek solutions that
    quality relative to price
                                                                 are in the best interest of our clients, communities and
   Rational risk taking and exceptional risk management         shareholders. We work cooperatively with our borrowers,
                                                                 o ering loan-modi cation programs when appropriate,
   Superior earnings growth
                                                                 during these di cult economic times. When foreclosure
                                                                 on real estate is necessary, our goal is to both maximize the
   Targeted and consistent investments for the future
                                                                 return on BB&T's investment in the property while
BB&T's strategic objectives for 2010 are consistent with
                                                                 avoiding bulk sales at depressed prices that undermine
our long-term goals and these principles.
                                                                 property values in the communities we serve.



BB&T LEADS PEERS IN CREDIT QUALITY*
                                                                 GROWTH RATE IN NONPERFORMING ASSETS IS SLOWING**
NONPERFORMING LOANS AS A PERCENTAGE OF LOANS
                                                                40.0%
BB&T                    2.56 %
                                                                                          35.5%
M&T Bank                2.56
U.S. Bancorp            2.78                                    30.0
Comerica                2.80                                            25.9%
KeyCorp                 3.54
                                                                                                                18.3%
                                                                20.0
PNC                     3.60                                                     23.9%
                                                                                                    21.5%
Fifth Third             4.13
Regions                 4.20
                                                                 10.0
Marshall & Ilsley       4.62
                                                                                                                         7.0%
SunTrust                4.75
Zions                   4.96                                      0.0                                                            **
                                   *As of December 31, 2009                                                                       Excludes
Huntington              5.21                                             3Q08     4Q08     1Q09      2Q09      3Q09     4Q09
                                    SOURCE: Company reports                                                                       covered assets
                                                              2009 ANNUAL REVIEW
20




                                                                              20 out of 20 national categories  more than any other
     Achieve Superior Revenue Growth
                                                                               nancial institution  in small business and middle-
     During di cult times, organizations often focus all of
                                                                              market banking. In addition, at a time many small and
     their energy on damage control and forget about growth.
                                                                              mid-sized businesses have negative opinions about most
     During 2009, many nancial services rms were faced
                                                                               nancial institutions, BB&T was accorded the highest
     with that dilemma because of problem-plagued loan
                                                                              positive reputation score by executives of those businesses
     portfolios and increased federal government involvement
                                                                              among banks surveyed by Greenwich, a leading global
     in their businesses. BB&T has fared much better than
                                                                               nancial services research and consulting rm.
     most of our peers, in large part because of our disciplined
     lending standards, and remains focused on both growth
                                                                              At the same time, we are expanding our fee-income
     and credit quality. A " ight to quality" to BB&T by clients
                                                                              businesses on a national scale. Our retail mortgage banking,
     from weakened competitors, aided by our FDIC-assisted
                                                                              insurance agency and wealth management businesses,
     acquisition of Colonial Bank, contributed to our record
                                                                              as well as Scott & Stringfellow, our full-service regional
     net revenues in 2009. roughout the credit crisis, your
                                                                              brokerage rm, all posted record results. BB&T Insurance
     company has posted industry-leading revenue growth,
                                                                              Services, the nation's seventh-largest insurance broker,
     with a 25.6% increase during the last two years. is is
                                                                              surpassed $1 billion in revenue. In a move complemented
     due in large part to our ability to continue to invest in our
                                                                              by our acquisition of Colonial Bank, BB&T Insurance
     revenue engine during the credit downturn. We will again
                                                                              Services also increased its presence in southwest Florida
     invest in 2010 by hiring top producers, pursuing strategic
                                                                              with the acquisition of Oswald Trippe and Company Inc.
     acquisitions like Colonial, adding branches and developing
                                                                              of Fort Myers. Grandbridge Real Estate Capital LLC,
     systems and infrastructure.
                                                                              BB&T's commercial and multifamily mortgage banking
                                                                                rm, expanded with acquisitions in Dallas and Louisville,
     Our diversi ed business model  balanced approximately
                                                                              Kentucky. We will pursue other non-bank acquisitions in
     50-50 between retail and commercial revenue  produces
                                                                              insurance, mortgage, consumer nance and commercial nance.
     a less volatile, more predictable revenue and earnings
     stream. We will continue to build our core banking business
                                                                              We believe the "reintermediation" trend of this past year
     in a 12-state footprint that extends from Maryland to
                                                                              will continue as investors' funds ow into banks from
     Florida, west to Kentucky, and now into Texas with the
                                                                              non-banking investments. Loans that left the traditional
     Colonial acquisition. We are aggressively expanding our
                                                                              banking system and owed to the "shadow" banking
     small business lending and rank as one of the most active
                                                                              system in the past 20 years will return because of
     banks in SBA nancing. We are expanding our Capital
                                                                              the demise of that system, and loan prices will be more
     Markets team to serve the nancing needs of middle-
                                                                              rational. At the same time, Wall Street rms that
     market companies. BB&T was recognized in 2009 by
                                                                              previously enjoyed an advantage over traditional banks
     Greenwich Associates as an Excellence Award winner in




     INDUSTRY LEADING REVENUE                                                 2009 SUCCESSFUL ACQUISTIONS
     GROWTH THROUGH THE CYCLE 1                   2



     BB&T                 25.6    %                                           Colonial Bank
     U.S. Bancorp         21.6                                                Cananwill, Inc.
     PNC                  16.4                                                Oswald Trippe and Company, Inc.
     Fifth Third          13.0                                                BFG Realty Advisors
     M&T                   4.8                                                Quantum First Capital
     Zions                 4.3
     SunTrust              3.3
     Marshall & Ilsley    (0.9)
     Huntington           (2.4)
     Regions              (4.5)     (1)
                                     Increase from 2007-2009
     KeyCorp             (11.4)     (2)
                                     Revenue growth adjusted to exclude
                                     estimated impact of acquisitions or
     Capital One         (13.9)      unusual gains.
     Comerica            (16.8)     SOURCE: Company reports; SNL Financial.
                                                                                       BEST BANK IN TOWN SINCE 1872                                                                                                         21




             will be encumbered by increased government oversight.                                            Deliver the BB&T Value Promise (...Thereby Creating the
             As the economy stabilizes and ultimately recovers, we                                            Perfect Client Experience)
             believe BB&T's tested core banking services are well                                             BB&T's value promise starts with a simple greeting to
             positioned for accelerated growth.                                                               our clients: "You've made an excellent choice by selecting
                                                                                                              BB&T. Let me tell you why." Our employees then explain
                                                                                                              their job and training, describe BB&T and our values
      "Highest in Customer Satisfaction                                                                        and most importantly show how they will meet their
        with Primary Mortgage Sales."                                                                         clients' needs better than anyone else.
                                                                                                              While price is always important in any business
                                                                                                              environment, we believe our simple promise of delivering
                                                                                                              the greatest value  the highest quality service  distinguishes
                                                                                                              BB&T from our competitors. Our value promise is also at
                                                                                                              the heart of delivering BB&T's Perfect Client Experience:
                                                                                                              service that is reliable, responsive, empathetic and
                                                                                                              competent. Particularly after the nancial crisis of the last
                                                                                                              two years, consumers rightfully are demanding to know
                                                                                                              what they are receiving for their hard-earned money and
                                                                                                              life-long savings.
                                                                                                              We could not deliver on our promise without another
                                                                                                              BB&T hallmark: our community banking structure.
                                                                                                              While we have grown tremendously in recent years, we
                                                                                                              have retained a hometown banking approach with 37
                                                                                                              community banking regions  each headed by a regional
                                                                                                              president empowered to o er all of the advantages and
                                                                                                              services of a major nancial institution as well as the
                                                                                                              specialized attention that our clients expect from a
                                                                                                              hometown bank.




  Branch Banking and Trust received the highest numerical score in the proprietary J.D. Power and Associates 2009 Primary Mortgage Origination StudySM. Study based on 3,406 total responses measuring 22 lenders and
measures opinions of consumers who originated a new mortgage. Proprietary study results are based on experiences and perceptions of consumers surveyed in July-August 2009. Your experiences may vary. Visit jdpower.com.




             OVERALL BANK SATISFACTION*                                                                       LIKELIHOOD TO REMAIN*


              BB&T                                                                                                    BB&T                                                                               84.3%
                                                                                          62.2%

         Wachovia                                                                                                 Wachovia

          SunTrust                                                                                                 SunTrust

  Bank of America                                                                                          Bank of America

                                                                                                                            65                 70                 75                 80                 85
                    40             45             50              55            60              65




             * In percentage
               From Maritz Research Retail Client Satisfaction Survey, represents percentage of "top box" scores, indicating a 9 or 10 rating on a 10-point scale.
                                                                        2009 ANNUAL REVIEW
 22




                                                                                   Control Costs
                     Of course, it is easy to promise great service and hometown
                                                                                   In a slow-growth environment, we must be relentless in
                     values. Everyone does it. At BB&T, we have independent
                                                                                   controlling costs. We have done that with lean budgets
                     validation of our client service record. Maritz Research's
                                                                                   and increased productivity. BB&T's e ciency ratio 
                     survey of clients of BB&T and of our in-market competitors
                                                                                   basically, the cost required to generate each dollar of
                     showed we again ranked No. 1 in overall retail and
                                                                                   revenue  improved to 50.4% from 51.4% two years ago.
                     commercial client satisfaction and likelihood to remain a
                                                                                   In contrast, our peers' e ciency ratio has deteriorated
                     client, among other categories. J.D. Power and Associates,
                                                                                   to 60.6% from 56.0% in 2007. At the same time, while
                     which awarded BB&T its top national ranking for mortgage
                                                                                   many of our competitors announced major layo s and
                     servicing two years in a row, added another accolade in
                                                                                   cuts in employee bene t programs, BB&T has been able
                     2009: the highest ranking in mortgage loan origination
                                                                                   to largely retain our talented workforce and continue
                     client satisfaction.
                                                                                   investing in vital employee development and training
                     We are also proud that our recognition for superior           programs.
                     service extends into many of our lines of business,
                                                                                   Cost control remains crucial in an environment with
                     including wealth management, small business lending,
                                                                                   higher FDIC insurance and other regulatory costs, more
                     401(k) retirement plan sponsorship, sales nance and
                                                                                   resources devoted to mitigating credit problems and other
                     stock research. e excellent client service behind all of
                                                                                     nancial pressures. We will continue intense scrutiny
                     these awards is possible because of an underlying service
                                                                                   on full-time-equivalent positions, needlessly complex
                     we provide our own employees: BB&T training. Our
                                                                                   programs and projects that have inordinately long payback
                     training programs again won national recognition from
                                                                                   periods. Our resources will be allocated based on their
                     Training Magazine and the American Society for
                                                                                   potential to maximize pro ts.
                     Training and Development.




                     DELIVERING ALL COMPONENTS OF PROFITABILITY 1
                     STRONG EFFICIENCY RATIO                                       STRONG FEE INCOME RATIO
                                                                                   44.0 %
                     61.0 %

                                                                        60.6%
                                                                                                                                    42.8%
                     57.0                                                          42.0



                                                                                                                                    40.0%
                                                                                   40.0
                     53.0


                                                                        50.4%
The efficiency
ratio measures
                     49.0                                                          38.0
the cost required
to generate each
                                                                                                                                             (1)
dollar of revenue;                                                                                                                                 These are Non-GAAP
a lower percentage                                                                                                                                 measures. Refer to
                                                                                              BBT         Peers
                                 BBT       Peers
                                                                                   36.0
                     45.0
indicates superior                                                                                                                                 page 31 for GAAP
                                                                                                    `05     `06   `07      `08      `09
                                    `05      `06     `07      `08      `09
performance.                                                                                                                                       equivalents.
                                                BEST BANK IN TOWN SINCE 1872                                                   23




                                                      THANK YOU


In closing, I want to express my profound appreciation to      I also want to take this opportunity to thank my
John Allison, who stepped down as chairman of BB&T at          colleagues on BB&T's Executive Management team.
the end of 2009. I am looking forward to his continued            e team has come together quickly over the past year
counsel as a member of our corporate board of directors.       and is highly committed to the success of BB&T.
In a tting tribute to his two decades of leadership of
                                                               For the last 138 years, BB&T has survived and thrived
BB&T and in our industry, American Banker awarded
                                                               through all sorts of market cycles. e current cycle has
John its Lifetime Achievement Award for 2009, citing his
                                                               been the most challenging in my career, and I'm proud
"career full of conviction."
                                                               that your company again is emerging as one of the
I also want to salute Nelle Chilton and Tom E rd, who          strongest in the nancial services industry. We have
retired as members of the corporate board of directors,        unwavering values that guide us. We have an experienced
for their years of dedication and board leadership. ey         and highly motivated team; the average age of our
contributed mightily to BB&T's success with their strong       executive management team is 50, with an average of 28
personal values, business acumen and intellectual insight.     years experience with BB&T. We have a diversi ed, stable
                                                               business mix that is resilient in all operating environments.
In addition, I want to welcome three new members of the
                                                               We have a community banking model that produces the
corporate board, who joined in 2009:
                                                               best value proposition in the industry. We have great
                                                               markets and a great franchise. We have a proven track
   K. David Boyer, Jr., Co-Founder and Chief Executive
                                                               record in managing our credit portfolio and integrating
    O cer of GlobalWatch Technologies, Inc., an
                                                               mergers with discipline.
    information-services company based in metro
    Washington, D.C. He also is a member of the
                                                               In 2010 and beyond, we have the best opportunity in
    Commonwealth of Virginia's Treasury Board, which
                                                               our history to achieve our goal of building the best
    supervises the investment of state funds, among
                                                                 nancial institution possible. e challenges are not
    other responsibilities.
                                                               going to disappear, but with the continued support of our
                                                               talented employees, loyal clients and steadfast shareholders,
   J. Littleton "Litt" Glover, Jr., a metro Atlanta lawyer
                                                               I am con dent we will be successful. I truly believe our
    who also is President and Chief Executive O cer
                                                               best days are ahead!
    of Batson-Cook Development Company, which
    develops commercial real estate throughout the
    southeastern U.S. For the last 10 years, he has been
    a director of Branch Banking and Trust Company,
    our principal subsidiary.
   Tom Skains, Chairman, President and Chief
                                                               Kelly S. King
    Executive O cer of Piedmont Natural Gas, a
                                                               Chairman and Chief Executive O cer
    Charlotte-based company serving one million
                                                               February 23, 2010
    residential, commercial and industrial utility clients
    in the Carolinas and Tennessee. A leader in the
    natural gas industry for 30 years, Tom was chairman
    of the American Gas Association in 2009.
