

DEAR INVESTORS,


The year 2010 will be remembered as one of significant       reduction from 2009, and 77 percent from 2003. In
change -- at Dominion as well as throughout the na-          fact, all three of our operating units demonstrated
tion and world. The U.S. economy took only modest            superior safety performance in 2010. Dominion
steps toward recovery, while the U.S. stock markets          consistently ranked in the top quartile of companies
traded up and down and the unemployment rate                 in the Southeast Electric Exchange in employee safety
remained at near double-digit levels.                        performance during 2010.
    Despite this turbulence, the people at Dominion             Our customer value and satisfaction rankings at
remained true to our four core values -- safety, ethics,     Dominion Transmission show without a doubt what
excellence and teamwork. These principles are the            our people can do. For the fifth year, our gas pipeline
backbone of our corporate structure and culture. Man-        business unit was ranked first in customer value and
agement and employees alike strictly adhere to them.         customer satisfaction among its primary Northeast
    Never forget that the daily tasks of many of our em-     competitors, according to a 2010 study by Missouri-
ployees are dangerous -- from repairing power and gas        based consultant Mastio & Co. Nationwide, Domin-
lines to operating power stations and gas compressors.       ion Transmission ranked third in customer value and
That is why safety ranks first on our list. We are proud     fifth in customer satisfaction among pipelines with at
that our U.S. Occupational Safety and Health Admin-          least 3,500 miles of transmission pipeline and deliveries
istration's recordable incident rate of 0.95 incidents per   of at least 1 trillion cubic feet of gas.
100 employees in 2010 represented a 17 percent                  Thanks to dedicated employees throughout
                                                             Dominion, your company has substantially completed
                                                                                  



its five-year transition to a company whose operating                                In 2010, our total shareholder return -- that is, our
earnings are more firmly tied to regulated operations.                          stock's price change over a given year, plus dividends
This transition has positioned us to embark on a five-                          -- amounted to 14.8 percent. Our return to investors
year, $10-plus billion growth plan to meet the long-                            bested that of the Dow Jones Utility Average, a group
term energy needs of our customers.                                             of 15 utility stocks including Dominion, which re-
                                                                                turned 6.5 percent. Your company's total return edged
     2010 FINANCIAL PERFORMANCE
                                                                                that of the Dow Jones Industrial Average, a major gen-
In 2010, Dominion earned $3.34 per share in operating
                                                                                eral market index, which posted a 14.1 percent return,
earnings, up from $3.27 per share in 2009, well above
                                                                                and slightly trailed that of the S&P 500, another major
the midpoint of our original 2010 guidance range of
                                                                                general market index, which produced a 15.1 percent
$3.20 per share to $3.40 per share.* Because of strong
                                                                                total return.
financial performance, the bottom end of that range in-
                                                                                     Last year, Dominion returned $1.83 per share in
creased twice during the year to $3.30 per share. Earn-
                                                                                dividends to shareholders, a 4.6 percent increase over
ings under Generally Accepted Accounting Principles
                                                                                2009. That increase followed 11 percent dividend rate
(GAAP) in 2010 were $4.76, up from $2.17 per share
                                                                                hikes in both 2008 and 2009.
in 2009. The difference between operating and GAAP
                                                                                     We have accomplished the key elements we wanted
earnings for 2010 was attributable primarily to the sale
                                                                                to achieve when we started our transformation in
of our Appalachian natural gas exploration and produc-
                                                                                2006. Our credit ratings are stable at the three major
tion operations, which I will discuss later.






rating agencies, and we are positioned to report future                   electricity into non-regulated markets. That percentage
dividend and earnings growth from our ongoing                             was expected to increase.
infrastructure investments. Here is a summary of our                         Investors asked, Is Dominion a utility? An E&P
progress, our operating achievements in 2010, and our                     company? An independent power producer? Our price-
outlook for the future.                                                   to-earnings ratio -- a common metric to value a stock
                                                                          -- reflected those concerns. Back then our P/E valu-
    A FIVE-YEAR TRANSFORMATION: 2006 - 2010
                                                                          ation was at a 12 percent discount to the average P/E
In 2006, senior management and the Board of Direc-
                                                                          ratio of the 14 companies we identified as representing
tors decided on a new direction for Dominion. At the
                                                                          our peer group.*
time, there was a growing gap in our Virginia franchise
area between demand and available generation -- and                          THE 2006 PLAN

uncertainty in putting vast amounts of capital into                       Seeking to alleviate investor concerns, senior manage-
new infrastructure projects. We were producing large                      ment unveiled a plan whose philosophy was simple:
amounts of natural gas and oil in wells across the U.S.,                  Reduce risk by shifting the operating earnings mix to
the Gulf of Mexico and Canada, adding commodity                           focus on regulated businesses and decreasing earnings
price exposure and volatility to our earnings and the                     sensitivity to commodity prices.
need for significant credit capacity and cash to cover                       We developed a strategy to grow federal- and state-
hedging programs. Three-fifths of Dominion's oper-                        regulated assets. In the Virginia General Assembly,
ating earnings were derived from commodity-based                          Dominion supported a regulatory model that allowed
businesses, such as gas and oil exploration and produc-                   the State Corporation Commission to set customers'
tion (E&P) and power stations in the Northeast selling                    rates while providing forward-looking cost-recovery
                                                                          mechanisms and performance incentives for new infra-
                                                                          structure to meet rising demand. We considered selling


                                                                             Dominion donated $15 million through The Dominion
    We do our best to support
                                                                             Foundation to more than 1,300 organizations in 2010.
    education, the environment,                                              Our employees volunteered 150,000 hours of their
    human services, the arts and                                             time to improve their communities.
    many other philanthropic                                                 We donated $4.5 million to EnergyShare in 2010.
                                                                             We contributed more than $2 million to support
    endeavors in the communities                                             environmental organizations, housing organizations
    we serve.                                                                and homeless shelters in 14 states.
                                                                             We launched a new competitive higher education
                                                                             grants program in Virginia with a $500,000 donation
                                                                             from the foundation.
                                                                   



assets that did not or were not expected to produce ad-      and instead renew our focus on energy infrastructure.
equate returns on invested capital (ROIC). This would        Shareholder capital, we concluded, had more value in
support a strong balance sheet, stable credit ratings,       improving existing infrastructure and building new
and the ability to provide investors with competitive        products extraction facilities, gathering, storage, and
utility dividends.                                           transmission pipelines -- infrastructure that would
                                                             help producers more effectively and efficiently get
   EXECUTING THE PLAN
                                                             natural gas to demand centers.
To execute our plan, the company in 2007 divested
                                                                The Appalachian E&P transaction reduced our
our non-Appalachian E&P assets for nearly $14 bil-
                                                             overall, companywide commodity exposure by an ad-
lion. The after-tax proceeds reduced outstanding debt
                                                             ditional 20 percent and annual capital expenditures by
by $3.3 billion and also allowed us to repurchase more
                                                             $250 million. We used the after-tax proceeds to offset
than $5.8 billion of common stock, more than 18
                                                             2010 and 2011 equity needs, buy back common stock,
percent of the total shares outstanding as of December
                                                             pay down debt and make a contribution to our pen-
31, 2006. Further, as the Virginia General Assembly
                                                             sion plan.
passed legislation in 2007 to reregulate the state's elec-
                                                                Based on ROIC considerations, we also closed on
tric utilities and provide premium returns on equity
                                                             the sale of Dominion Peoples, a gas local distribution
for critical infrastructure investments, the company
                                                             company serving parts of Pennsylvania, for $780 mil-
focused its efforts on a build-out to serve our
                                                             lion and reduced debt with the proceeds. Dominion
customers' needs.
                                                             also divested its interest in Rumford and Morgantown,
   Management continued to reduce commodity and
                                                             two small merchant coal-fired power stations in Maine
merchant risk and evaluate remaining business lines to
                                                             and West Virginia, respectively.
ensure that they met our targets for actual and poten-
tial ROIC.                                                      RESULTS OF OUR REPOSITIONING

                                                             We have been pleased with the success of our trans-
   As a result, last year we sold the remainder of our
                                                             formation to date. I must admit, however, that timing
E&P operations in the Appalachian region for nearly
                                                             and, to some extent, luck have played their part. Back
$3.5 billion, including hundreds of thousands of acres
                                                             in 2006, when we decided to market our non-Appala-
holding Marcellus Shale, one of the largest recoverable
                                                             chian E&P business, we did not know that natural gas
gas discoveries in recent years. Because of our pipeline
                                                             and oil prices would plummet or that the Gulf of Mex-
and storage system's strong presence throughout the
                                                             ico would be home to history's largest oil spill. And at
Marcellus Shale region, we believed it made better
business sense to sell our production interests there



that time, when we decided to keep our E&P assets in                             over the 2006 rating of BBB. These rating agencies
Appalachia, we had little knowledge of the deep and                              rate Virginia Electric and Power Company senior
rich gas reserves in the region's Marcellus Shale.                               unsecured debt A-minus, A3 and A-minus,
     The execution of our plan has resulted in:                                  respectively -- an improvement from BBB, Baa1
                                                                                 and BBB-plus, respectively; and
     71 percent of our operating earnings coming
     from regulated operations in 2010, up from                                  A P/E ratio of an 8 percent premium to that of our
     42 percent in 2006;*                                                        peer average, as compared with a previous 12
                                                                                 percent discount.
     Operating earnings per share growth of 35 percent
     from 2006 to 2010;
                                                                                 REGULATED GROWTH KEY TO SUCCESS
     Dividend increases of 33 percent from 2006
                                                                              Expectation of future success is predicated on the con-
     to 2010;
                                                                              tinuation of our regulated infrastructure growth plan,
     Dominion total shareholder return from January 1,                        which was first introduced in 2006.
     2006, through December 31, 2010, of 35.9                                    Our electric utility franchise in Virginia and North
     percent, compared to 21.1 percent for the Dow                            Carolina, which includes approximately 18,400 mega-
     Jones Utilities, 23.5 percent for the Dow Jones                          watts of generating capacity, 6,100 miles of electric
     Industrial Average, and 12.0 percent for                                 transmission lines and 56,800 miles of electric distri-
     the S&P 500;                                                             bution lines, serves 2.4 million customer accounts.
     Stable or improved credit ratings from S&P,                              We also serve 1.3 million gas distribution customer
     Moody's and Fitch. They rate Dominion's senior                           accounts in Ohio and West Virginia and operate a gas
     unsecured debt A-minus, Baa2 and BBB-plus,                               transmission pipeline and storage system that serves
     respectively. S&P's rating marks an improvement                          much of the mid-Atlantic and Northeast.


                                                                               Expectation of future success is
    
                                                                               predicated on the continuation of
                                                                               our regulated infrastructure growth plan,
                                                                      
                                                                       which was first introduced in 2006.
                   



In 2006, Dominion decided to change direction and
unveiled a plan whose philosophy was simple: Reduce risk
by shifting the operating earnings mix to focus on regulat-
ed businesses and decreasing earnings sensitivity to com-
modity prices. This transition has positioned your company
to embark on a new, five-year, $10-plus billion growth plan
to meet the long-term energy needs of our customers.



                                                                                Between 2006 and 2010, operating earnings per share grew 35 percent and
                                                                   our shareholders saw growth in the dividend rate of 33 percent. Dominion's
                                                              five-year transformation and the projects listed below are the principal reasons
                                                              for higher operating earnings per share and dividends. We expect that our
                                                                                2011-2015 growth plan will fuel additional EPS and dividend growth.







Between 2011 and 2015, we have plans for $10-plus              Third, gas and electric distribution systems in Vir-
billion in growth capital expenditures, not including       ginia, North Carolina, Ohio and West Virginia need
potential environmental spending of nearly $2 billion       to be upgraded and modernized. These aging wires
for power stations serving Virginia and North Carolina.     and pipes must continue to serve customers without
   Of the planned growth capital expenditures, 99           interruption and to connect new customers as energy
percent is budgeted for regulated infrastructure in our     demand grows.
electric service area and in regulated gas businesses.
                                                               POWERING VIRGINIA
Dominion must invest in such infrastructure for three
                                                            As I have stated in previous letters, Virginia is one
principal reasons.
                                                            of the best states for business, according to both
   First, we are anticipating demand growth at our
                                                            CNBC and Forbes.com. The state is home to many of
electric utility. Although new connects dropped to
                                                            America's largest military installations, and serves half
about 27,000 in 2010, the utility has historically con-
                                                            the nation's Internet flow. Because of its proximity to
nected 48,000 new customer accounts each year. PJM
                                                            Washington, D.C., Virginia continues to be largely
Interconnection, a transmission grid operator serving
                                                            recession-resistant. Its economy continues to grow.
all or parts of 13 states and the District of Columbia,
                                                               Three-quarters of our anticipated growth capital
reports that the Dominion Zone has the highest ex-
                                                            expenditures from 2011 to 2015 -- or approximately
pected electric load growth rate -- 2.1 percent per year
                                                            $7.4 billion -- is slated for generation, transmission
-- of the 20 zones it operates. It further forecasts that
                                                            and distribution in the electric utility service area. That
over the next decade peak demand growth in Virginia
                                                            figure excludes the more than $5.5 billion already
will be the equivalent of adding 1.1 million additional
                                                            spent from 2006 to 2010 to satisfy demand growth in
homes to our system.
                                                            Virginia and North Carolina.
   Second, enormous gas deposit finds in the Mar-
                                                               The list of major projects currently in development
cellus Shale have started a production rush in West
                                                            or under construction follows. All of these qualify for
Virginia and Pennsylvania. Although we sold our
                                                            enhanced returns on generation, transmission and
E&P business, we plan to help producers by investing
                                                            distribution investments either as part of the regula-
at least $850 million in infrastructure to bring their
Marcellus gas to market.
                                                                                                                                                                      
                                                                                    




tory compact in Virginia or from the Federal Energy                                 closed its coal-fired North Branch facility, a 74-mega-
Regulatory Commission:                                                              watt station in West Virginia.

                                                              in Southwest                                                    including solar, onshore and
    Virginia City Hybrid Energy Center                                                   Renewable generation,

Virginia, a $1.8 billion, 585-megawatt coal- and                                    offshore wind and biomass. Dominion is in the early
biomass-fired station. As of January 2011, it was 79                                stages of developing a 4-megawatt solar facility in Hali-
percent complete and expected to be operational in                                  fax County and is evaluating biomass, onshore wind
summer 2012. Virginia City construction is on time                                  farms in Virginia and offshore wind farms.
and on budget.
                                                                                                                                              -- the Meadow
                                                                                         Major electric transmission lines

                           a $619 million, 580-megawatt natural                     Brook to Loudoun line and Carson to Suffolk line --
    Bear Garden,

gas-fired combined cycle facility. As of January 2011,                              which are on schedule to be in service mid-year 2011.
it was 94 percent complete and is expected to be in                                 Two phases of the former are complete and operation-
service in the second quarter of this year. It too is on                            al. Work continues on the third phase. As of January
time and on budget.                                                                 2011, the latter was 60 percent complete. Combined,
                                                                                    the two 500-kilovolt lines cost $479 million. Both
                              a natural gas-fired combined-cycle
    Warren County,
                                                                                    projects are on time and on budget.
facility that could supply more than 1,300 megawatts.
Dominion received the required air permit in Decem-                                                                            a project to rebuild an aging
                                                                                         Mount Storm to Doubs,

ber 2010. During the air permit process, the company                                500-kilovolt line running through Northern Virginia,
reached an accord with the National Park Service                                    West Virginia and Maryland. PJM has recommended
by addressing environmental considerations for the                                  that the line be rebuilt to alleviate transmission conges-
nearby Shenandoah National Park. By the time War-                                   tion. We filed an application with the State Corpora-
ren County enters service in late 2014 or early 2015, as                            tion Commission in January 2011. The line is expected
part of the air permit process, Dominion plans to have                              to be completed in 2015.






                                                                              and planning activities. A decision to proceed with a
   Smart metering technology, which is being tested in
                                                                              construction schedule at North Anna will not come
three demonstration areas of Virginia. It lays the ground-
                                                                              until we approach receipt of the COL.
work for long-term reliability and infrastructure improve-
ments and for an evolution of programs that are expected
                                                                                 GROWTH IN GAS TRANSMISSION, DISTRIBUTION
to provide additional benefits to our customers, the
                                                                              Over the next five years, your company intends to
environment and our company. Pending the successful
                                                                              spend $2.8 billion on regulated gas operations.
completion of testing in the demonstration areas, Domin-
                                                                                 To help move larger volumes of conventional and
ion anticipates a future filing for full-scale deployment
                                                                              liquefied natural gas, Dominion already has completed
across our Virginia and North Carolina service area.
                                                                              projects such as the expansion at Cove Point -- Do-
                                                                              minion's liquefied natural gas facility in Maryland --
   Excluded from the list above is North Anna 3, a
                                                                              and the HUB and Rural Valley projects. All were on
proposed 1,500-megawatt nuclear reactor. Dominion
                                                                              time and on budget.
believes new nuclear power should be a major part of
                                                                                 As the price of natural gas has waned, the demand
the nation's energy mix because it is safe, reliable, de-
                                                                              for its use as a fuel for electric production has grown.
pendable and efficient -- and does not emit pollutants
                                                                              Prospects for new products extraction, gathering, stor-
that may contribute to climate change. In addition,
                                                                              age and transmission appear great, both for conven-
fuel diversity in electric generation is vital to counter-
                                                                              tional and, as mentioned previously, Marcellus Shale
ing price volatility of other fuels.
                                                                              gas. Over the next five years, we will be investing in
   While we have not yet committed to construct-
                                                                              infrastructure to meet the needs of the producer com-
ing the new unit, we have selected Mitsubishi Heavy
                                                                              munity and the marketplace.
Industries' reactor design. Your company will con-
                                                                                 Four projects are planned for transporting Marcel-
tinue to seek a combined construction and operating
                                                                              lus Shale gas -- the Northeast Expansion, Marcellus
license (COL) from the Nuclear Regulatory Commis-
                                                                              404, Ellisburg to Craigs, and Sabinsville to Morrisville.
sion, which we expect to obtain in 2013. And we are
                                                                              The Northeast Expansion, Ellisburg to Craigs, and Sa-
proceeding with preliminary site work, engineering






binsville to Morrisville projects have executed contracts                           improves. The U.S. Environmental Protection Agency,
for service, and are in the implementation phase. The                               on the other hand, has issued several new greenhouse
Marcellus 404 project is under development, and we                                  gas regulations and is in the process of issuing addi-
are in the process of securing customers. Dominion                                  tional regulations.
has identified an additional $1.5 billion in potential                                 Dominion has spent, or is planning to spend, more
growth capital for gas transmission projects not in-                                than $3.1 billion on environmental improvements at
cluded in the 2011-2015 growth plan.                                                our merchant and utility generating fleet between 1998
   To bolster Dominion East Ohio's system safety and                                and 2015. Already, as a result of these improvements,
reliability, we launched a $2.6 billion, 25-year bare steel                         our mercury, sulfur dioxide and nitrogen oxides emis-
pipeline replacement program in 2008. The program                                   sions in the mid-Atlantic and New England regions
plans to replace nearly 20 percent of the distribution                              have steadily -- and dramatically -- fallen.
company's 21,000-mile pipeline system.                                                 Additional new EPA regulations are likely to set
                                                                                    new emissions standards for nitrogen oxides and sulfur
   INVESTING TO PROTECT THE ENVIRONMENT
                                                                                    dioxide, new standards for handling and disposal of
There are environmental effects associated with the
                                                                                    coal combustion byproducts such as fly ash, new air
production of electricity on a large scale. About 70
                                                                                    toxic standards for mercury and other hazardous air
percent of the nation's electricity comes from burning
                                                                                    pollutants, new emissions standards for carbon dioxide
fossil fuels and combustion of those fossil fuels emits
                                                                                    and other greenhouse gases, and new standards for
gases into the atmosphere that contribute to air pollu-
                                                                                    cooling water. They could add $2 billion or more in
tion. In addition, many stations use a large amount of
                                                                                    additional environmental spending in the next five
water for cooling the turbines that create electricity.
                                                                                    years for Dominion.
   The combustion of fossil fuels also creates green-
                                                                                       As the environmental regulatory landscape evolves,
house gas emissions. While climate change laws appear
                                                                                    we will continue to assess all options to meet both
less certain to come from Congress, debate at the U.S.
                                                                                    environmental and customer obligations in a way
Capitol could return when our nation's economy





that serves the best interests of our shareholders and      year-over-year operating earnings per share decline
customers. This may involve installation of additional      since 2005.
control equipment, potential early retirement of units,         At this time, your company expects from 5 to 6
and/or new build or fuel-conversion options.                percent earnings growth in 2012 and beyond as a result
   One example of our environmental spending will           of fewer merchant outages, commodity price increases,
be on display this year, when the 500-foot tall cooling     rising energy demand, and construction and operation
towers at the Brayton Point Power Station in Massa-         of new infrastructure in regulated businesses, such as
chusetts begin to become operational. The closed-loop       electric utility generation, transmission and distribu-
cooling towers are designed to reduce water usage in        tion and gas transmission and distribution.
the Mount Hope Bay by more than 90 percent. Unlike
                                                                FOCUS ON DIVIDENDS
at many power stations across the country, we had the
                                                            In October 2007, the board set a goal of achieving a
flexibility -- and the land -- to add cooling towers
                                                            55 percent dividend payout ratio by 2010. Dominion's
and other environmental equipment, such as scrubbers,
                                                            dividend payout ratio in 2010, based on operating
at Brayton.
                                                            earnings, was 55 percent.**
                                                                With the continued transition to a regulated model
   OUTLOOK FOR 2011, 2012

Considering all these factors, our guidance for 2011        and the greater predictability that comes from a higher
anticipates operating earnings in the range of $3.00 per    proportion of cash flow and earnings from regulated
share to $3.30 per share.*                                  operations, in December 2010 the board set a new
   Principal reasons for lower earnings per share guid-     dividend policy to pay out 60 to 65 percent of operat-
ance in 2011 as compared to 2010 include several            ing earnings per share to shareholders. The board also
major merchant power stations being taken offline for       increased the annual dividend rate by 14 cents per
maintenance, refueling and environmental equipment          share -- from $1.83 per share in 2010 to $1.97 per
tie-ins and historically low commodity prices. Indeed,      share in 2011 -- subject to quarterly approval by the
it is possible that 2011 could result in Dominion's first   directors. As investors view our company as more of a








regulated company, our dividend payout ratio should            THANK YOU

more closely track that of our regulated peer utilities.    In what has been a year of change -- and for Domin-
   While all dividend declarations are subject to board     ion, five years of change -- your company continued
approval, in light of the 60 to 65 percent payout policy    its transformation into a more regulated company, a
and our earnings growth expectations, you should            company whose earnings are less tied to the vagaries
expect dividend increases to remain consistent with 5       of the commodity markets and more to constructive
to 6 percent earnings growth in 2012 and beyond.            regulatory structures that recognize the need to build
   We strongly believe that growth in our core regu-        infrastructure now to meet future demand. We have
lated businesses fuels the need for a dividend increase     met earnings targets and increased the dividend. We
-- even in a year in which operating earnings per share     have sold operations that did not fit what we see as
could fall from the previous year. Among the reasons:       part of the Dominion of tomorrow.
   First, remember that the company views 2011 as              While last year was a great year, 2011 could be a
an anomaly. We expect commodity prices -- and,              tough one. But our employees and shareholders have
consequently, New England power prices -- to hit a          confidence that Dominion will rise to the challenge.
bottom. We expect to refuel all three of our merchant          During the five years of Dominion's transforma-
nuclear reactors, tie in two cooling towers to two units    tion, we did what we said we would do, and did it
at Brayton, and perform maintenance on turbines at          well -- thanks in large part to our 16,000 employees
the gas-fired Fairless Energy facility near Philadelphia,   and your confidence in our transformation and growth
which has operated more than expected because of low        plan. You have good reason to remain confident in
natural gas costs. Second, consistent with the 2006         your company's direction.
plan to transform Dominion, we are changing the                In 2011, this new Dominion will build on five
profile of investment in our company.                       years of stable, predictable earnings, a solid dividend,
   Dominion believes that rewarding those who               and promises fulfilled. We are poised to grow, and do
own our company and are a large part of its success is      so holding steadfast to our core values.
important. In sum, our board agrees that increasing the
                                                            Sincerely,
dividend is the right thing to do.



                                                            Thomas F. Farrell II

                                                            Chairman, President and CEO
