DEAR SHAREHOLDER:
                                                   In today's more connected and dynamic global economy
                                                   there is a growing need for the benchmarks, research,
                                                   analytics and data of McGraw Hill Financial. Our unique
                                                   products and services facilitate the flow of capital and
                                                   commerce through global markets, promoting growth,
                                                   development and higher standards of living.

                                                   Harold McGraw III
                                                   Chairman of the Board




The evolution of financial markets and             As announced on February 25, 2015, I
economies all over the world today is              informed the Board of Directors of my deci-
shaping the future. Exciting developments          sion not to stand for re-election as a Director    A LIFETIME OF SERVICE
include a sea change in investment                 at the next Annual Meeting of Shareholders
management, from the rise of private               scheduled to take place on April 29, 2015.
                                                                                                      AND ACHIEVEMENT
wealth in Asia Pacific to the ongoing              I want to thank our outstanding Board for
                                                                                                      LEADERSHIP AT THE COMPANY...
movement of financial flows, from actively         their guidance and counsel over the years
managed funds to passive investments.              and I am deeply touched by their awarding           President and CEO, 1998-2013
                                                   me the title of Chairman Emeritus.                  Chairman, 2000-2015
Another area demanding attention is                                                                    Director, 1987-2015
global trade. Policy makers recognize              I want to thank you, our shareholders,              Chairman Emeritus, 2015
that opening new markets is an economic            for your support and confidence in our
imperative. According to a report by the           ability to drive growth and to create superior     ... AND RESPECTED LEADER OF
United Nations, "almost all countries              shareholder value. In addition, I want to          THE GLOBAL BUSINESS COMMUNITY
with substantial improvement in human              wish every success to Doug Peterson,
development over the past two decades              President and CEO, and Ed Haldeman                  Chairman, International Chamber of Commerce
have also become more integrated with              whom the Board will propose as Chairman             Chairman, U.S. Trade Representative's Advisory
the world economy."                                following the Annual Meeting. Both these               Committee for Trade Policy and Negotiations
                                                   individuals are world-class leaders and             Chairman, U.S. Council for International Business
Recent policy developments offer good                                                                  Chairman, Emergency Committee for
news. Toward the end of last year the United       highly respected for their achievements.
                                                                                                          American Trade
States and India, together with the WTO,           McGraw Hill Financial is an outstanding             Director, Phillips 66
salvaged the multilateral deal known as the        company with a bright future and a proud            Director, United Technologies Corporation
Trade Facilitation Agreement (TFA) to cut          legacy of providing essential intelligence to       Former Chairman, Business Roundtable
red tape at border crossings. Now, the G20         customers. I am so very grateful to all the         Former Chairman, U.S.-India Business Council
must work to ensure all 160 nations of the         people who have contributed to the success          Director, Committee Encouraging
WTO ratify and implement the TFA.                  of our businesses over many generations.               Corporate Philanthropy
An increase in cross border capital flows          Since our founding by James H. McGraw               Director, The New York Public Library
and the liberalization of trade policies are       in 1888, the McGraw Hill teams have                 Vice Chairman, Asia Society
welcome developments as McGraw Hill                continually met the transformative needs
Financial looks to international markets           of our customers and markets, and will
for growth. For details of what the                continue to do so in the future.
company is doing to serve international            Sincerely,
markets, I encourage you to read about
the ways the company is creating growth
and driving performance throughout
the pages of this Annual Report.
                                                   Harold McGraw III
                                                   Chairman of the Board



                                                                 CHAIRMAN HAROLD MCGRAW III, X
           who serves as chairman of the International Chamber of Commerce, was in Turkey last year
       in advance of the country hosting leaders of the business community and G20 nations in 2015.

                                                                                                      McGRAW HILL FINANCIAL 2014 ANNUAL REPORT     1
    DEAR SHAREHOLDER:
    I am pleased to report McGraw Hill Financial has made great progress serving
    global capital, commodity and commercial markets with our compelling
    benchmarks, analytics, research and data. We generated 7% revenue growth
    and 20% adjusted diluted earnings per share (EPS) from continuing operations.
    We also resolved significant legal and regulatory matters, completed our
    portfolio rationalization of media assets and built excellent momentum to
    create growth and deliver shareholder value.


                                               Douglas L. Peterson
                                               President and Chief Executive Officer




                                                                                  "One of our top priorities is
                                                                                        to expand in markets
                                                                                               outside the U.S."




    PROFILES
      IN        LEADERSHIP                                                                Beth Ann Bovino
                                                                                          Beth Ann Bovino is the U.S. chief economist
                                                                                          at Standard & Poor's Ratings Services. In
    Our mission is to promote sustainable growth in the
    global capital, commodity and corporate markets by providing                          her research, Bovino has raised the issue
                                                                                          of addressing income inequality before it
    customers with essential intelligence and superior service.
                                                                                          dampens economic growth and has written
    Throughout these pages we share stories of the people of
                                                                                          extensively on the positive impact of infra-
    this company who are helping achieve this goal.                                       structure investment on the economy and
                                                                                          job creation. In 2013, The Wall Street Journal
                                                                                          named her the most accurate forecaster of
                                                                                          the U.S. economy.
2   McGRAW HILL FINANCIAL 2014 ANNUAL REPORT
These achievements demonstrate our
progress in reaching the objectives we                 Growth & Performance in 2014
set in March of last year in the Growth
and Performance Goals 2014-16. These
include the following annual targets:                  S&P RATINGS SERVICES
  Mid to high single-digit revenue growth;             REVENUE                                               ADJUSTED OPERATING PROFIT
  Mid-teens adjusted EPS growth;
  Sustained margin expansion; and
                                                       $2.45 BILLION                                         $1.07 BILLION
  Over $1 billion of free cash flow.
                                                       S 8%                                                  S 13%
A review of last year's operating results
from continuing operations shows we
achieved all four goals for 2014:                      S&P CAPITAL IQ
  Revenue grew 7% to $5 billion;                       REVENUE                                               ADJUSTED OPERATING PROFIT
  Adjusted diluted EPS increased 20%.
  This marks the third consecutive year of
                                                       $1.24 BILLION                                         $237 MILLION
  double-digit adjusted earnings growth;               S 6%                                                  S 18%
  Adjusted operating margins expanded
  to 36% from 33%; and we
  Generated over $1 billion of free cash flow.
                                                       S&P DOW JONES INDICES
We also said last year we would deliver at
                                                       REVENUE                                               ADJUSTED NET OPERATING PROFIT*
least $100 million in cost savings over the
next three years. In fact, we have initiatives         $552 MILLION                                          $259 MILLION
in place to deliver approximately $140
million in productivity over three years.              S 12%                                                 S 35%
In addition, we said we were evaluating
strategic alternatives for our final
media business and, in November 2014
completed the sale of McGraw Hill
                                                       PLATTS AND J.D. POWER**
Construction for $320 million in cash.                 REVENUE                                               ADJUSTED OPERATING PROFIT

                                                       $893 MILLION                                          $306 MILLION
                                                       S 6%                                                  S 10%

                                                 * Net of results from noncontrolling interests.
                                                 ** The Company's reportable segment, Commodities & Commercial Markets, is comprised of J.D. Power and Platts.




Cynthia Rojas Sejas                              John Kingston                                            Andrew Goodwin
Cynthia Rojas Sejas is a vice president at       John Kingston is the president of the                    Andrew Goodwin is a vice president and
S&P Capital IQ and market development            McGraw Hill Financial Global Institute                   general manager of agriculture, metals and
head for Latin America. Cynthia develops the     and MHFI's director of market insight.                   petrochemicals at Platts. Goodwin, based
regional growth strategy, including strategic    He assumed those roles in early 2015                     in London, is responsible for the strategic
relationships, product development and           after almost 30 years with Platts, where                 direction, commercial priorities and financial
marketing initiatives in partnership with the    most recently he was global director of                  results of these businesses. In 2014, Platts
sales organization and other MHFI business       news. As president, Kingston advances                    expanded its position in emerging sectors with
units. Her client centric approach resulted      the mission of the Institute, which                      new products including Platts Agriculture Alert,
in S&P Capital IQ's 2014 introduction of the     includes supporting global economic                      a news, data and benchmark price service
first robust source of financial data and        growth and job creation.                                 for the global sugar and grains markets.
analytics on private companies in Brazil.
                                                                                                               McGRAW HILL FINANCIAL 2014 ANNUAL REPORT          3
                                                     The key to our success is the intellectual     We are pleased that all of these matters
                                                     capital and expertise of our colleagues,       have been resolved. We take compliance
                                                     some of whom we highlight in this year's       with policies, procedures and regulatory
                                                     Annual Report. These leaders embody            obligations very seriously, and we
                                                     our mission of promoting sustainable           will continue to invest in people and
                                                     growth in the global capital, commodity        technology to strengthen our controls
                                                     and corporate markets by providing             across the company.
                                                     customers with essential intelligence and
                                                     exceptional service.                           BUILDING SUPERIOR RETURNS
                                                                                                    FOR SHAREHOLDERS
                                                     RESOLVING SIGNIFICANT LEGAL
                                                                                                    The results we achieved in 2014 and our
                                                     AND REGULATORY MATTERS
                                                                                                    growth objectives for 2015 are driving
                                                     Earlier this year, the company and Standard    shareholder value. Notably:
                                                     & Poor's Ratings Services entered into           We have returned $3.3 billion to share-
                                                     a settlement agreement with the U.S.             owners in the last three years through
                                                     Department of Justice, the Attorneys             share repurchases and dividend
                                                     General of 19 States and the District            payments.
                                                     of Columbia. Announced in February,
                                                     the settlement contains no findings of           Our total shareholder return of 15.3%
                                                     violations of law by the company, Standard       in 2014 outperformed the S&P 500's
    S&P DOW JONES INDICES CEO ALEX MATTURRI          &Poor's Financial Services or S&P Ratings.       return of 13.5% and we have beat the
    rings the bell of the Bolsa de Valores de Lima   All parties agreed to settle the claims "to      S&P 500 over the last 10-, 5- and
    (BVL) in Lima, Peru, commemorating an                                                             3-year periods.
                                                     avoid the delay, uncertainty, inconvenience
    agreement for S&P DJI to license, distribute,
    and govern all of the BVL indices, including a   and expense of further litigation."              In 2015, our Board of Directors raised
    new version of their flagship index, IGBVL.      The company reached a separate settle-           the regular cash dividend to an
                                                     ment with the California Public Employees'       annualized rate of $1.32, marking the
                                                     Retirement System to resolve its claims          42nd annual increase in the dividend.
                                                     against the company regarding ratings            Fewer than 25 companies in the
                                                     on three structured investment vehicles,         S&P 500 can claim such a long record.
                                                     which was also announced in February.
                                                     In addition, Standard & Poor's Ratings         DRIVING GLOBAL GROWTH
                                                     Services reached settlement agreements
                                                                                                    Looking ahead, one of our top priorities
                                                     with the U.S. Securities and Exchange
                                                                                                    is to expand in markets outside the U.S.
                                                     Commission and the Attorneys General
                                                                                                    as GDP growth in developing economies
                                                     of New York and Massachusetts, which
                                                                                                    is expected to continue outpacing the
                                                     were announced in January.
                                                                                                    economic expansion of developed nations.




                                                                                                             OUR KEY LEADERS
                                                                                                             ON ISSUES SHAPING
                                                                                                             GLOBAL MARKETS

                                                                                                             BUILDING TOMORROW'S
                                                                                                             INFRASTRUCTURE
                                                                                                             Funding / Financing Gap
                                                                                                               Steve Dreyer, S&P Ratings
                                                                                                               Mike Wilkins, S&P Ratings
    Deirdre Borrego                                  Jodie Gunzberg
                                                                                                             Public-Private Partnerships
    Deirdre Borrego is vice president and general    Jodie Gunzberg is global head of commodities
                                                                                                               Steve Dreyer, S&P Ratings
    manager of U.S. automotive operations            at S&P Dow Jones Indices. Gunzberg is
                                                                                                               Mike Wilkins, S&P Ratings
    at J.D. Power. Borrego's California-based        responsible for the product management
                                                                                                               Jim Corridore, S&P Capital IQ
    division provides clients with voice-of-the-     of S&P DJI's widely followed family of
    customer feedback through its automotive         commodity indices. Gunzberg is known for                Technology and Information
    research and real-time retail vehicle            her insightful analysis. Under her guidance,            Platforms
    transaction information, analysis and            S&P DJI is revolutionizing the commodity                  Neil Smith, S&P Capital IQ
    decision-support tools to help reduce risk       markets with new, innovative benchmarks                 Infrastructure Indices
    exposure, improve marketing effectiveness        and changing the way investors utilize                     Alka Banerjee,
    and improve profitability.                       commodity indices in their portfolios.                        S&P Dow Jones Indices

4   McGRAW HILL FINANCIAL 2014 ANNUAL REPORT
     McGraw Hill Financial's Role in Financing the World's Infrastructure

                                        IT IS WELL DOCUMENTED developed countries need to improve a wide range of
                                        infrastructure projects while emerging nations face increasing demand to build new roads,
                                        bridges, rail systems and power grids to grow their economies. Solutions remain elusive,
                                        however, for financing these projects.
                                                 The needs are great. Some $57 trillion of infrastructure investment is needed
                                                 through 2030, according to research from Standard & Poor's Ratings Services.
     INVESTING 1% OF                             With traditional lenders such as banks and governments facing constrained balance
     REAL GDP WOULD                              sheets, S&P projects an annual gap of $500 billion between available funds and
                                                 needed investment.
     CREATE 700,000 JOBS
                                                 The benefits of infrastructure are clear. In 2014, the International Monetary Fund
     IN THE U.S. AND                             said that increased infrastructure investment could provide a much-needed boost
     ABOUT 1 MILLION IN                          to demand in advanced economies--and called it "one of the few remaining policy
     THE EUROPEAN UNION.                         levers available to support growth, given already accommodative monetary policy."
                                                 In the U.S., S&P research suggests that investing 1% of real GDP would create
                                                 700,000 jobs and about 1 million in the European Union.
                                        In many instances, the private sector could step in to fill the financing gap. Institutional investors
                                        have the cash, the expertise and often can bring efficiencies that are unavailable on publicly
                                        financed projects. Infrastructure projects are often a stable and predictable long-term invest-
                                        ment, offering the right mix of risk and reward for cash-flush pension funds, insurers, and others.
                                        Despite this attractiveness, there are obstacles keeping the private sector away. In the U.S.
                                        some states have not authorized the use of public private partnerships. In addition, there are
                                        red tape, an information gap and in many countries insufficient legal and regulatory systems.
                                        In the U.S., McGraw Hill Financial and the federal government have entered into an
                                        agreement that would allow the company to access data on a select, non-confidential
                                        portion of Department of Agriculture's multibillion-dollar portfolio of water, energy, and
                                        telecommunications loans. This information, with data from other public and private sources,
                                        will enable McGraw Hill Financial to create a pre-commercial prototype of an information
                                        platform as a first step to build market standards such as infrastructure benchmarks,
                                        indices, and standardized documents--a tool investors say is needed to turn infrastructure
                                        into an asset class and help finance these projects.




Energy Grid                          Market Data and Analytics           Balanced Monetary Policy           Equity Valuation, Volatility
  John Kingston,                       J.R. Rieger,                      and Regulation                     and Liquidity
    MHFI Global Institute                 S&P Dow Jones Indices            Paul Sheard, S&P Ratings           Alka Banerjee,
  Jorge Montepeque, Platts             Robert Keiser, S&P Capital IQ       Beth Ann Bovino, S&P Ratings          S&P Dow Jones Indices
  Christopher Muir, S&P Capital IQ     Steven Miller, S&P Capital IQ       Jean-Michel Six, S&P Ratings       Michael Orzano,
Automotive                             Scott Kessler, S&P Capital IQ       Paul Gruenwald, S&P Ratings           S&P Dow Jones Indices
  Efraim Levy, S&P Capital IQ          Kenneth Leon, S&P Capital IQ      Sovereign Debt                       Michael  Thompson, S&P Capital IQ
                                       Erik Oja, S&P Capital IQ            John Chambers, S&P Ratings         Erin Gibbs, S&P Capital IQ
FINANCIAL GLOBALIZATION                Cathy Seifert, S&P Capital IQ                                          Sam Stovall, S&P Capital IQ
                                                                           Moritz Kraemer, S&P Ratings
AND THE CAPITAL MARKETS                                                                                       Tuna Amobi, S&P Capital IQ
                                     The Housing Market                  Corporate Debt and Refunding
Global, Regional and                   David Blitzer,                                                         Jim Corridore, S&P Capital IQ
                                                                           Gareth Williams, S&P Ratings       Stewart Glickman,
National Economic Outlooks                S&P Dow Jones Indices            Diane Vazza, S&P Ratings              S&P Capital IQ
   Paul Sheard, S&P Ratings            Erkan Erturk, S&P Ratings           Jay Dhru, S&P Ratings              Scott Kessler, S&P Capital IQ
   Beth Ann Bovino, S&P Ratings        Valerie White, S&P Ratings
   Jean-Michel Six, S&P Ratings                                          Growth of Capital Markets            Kenneth Leon, S&P Capital IQ
                                     The Automobile Market                 Paul Sheard, S&P Ratings           Efraim Levy, S&P Capital IQ
   Paul Gruenwald, S&P Ratings
                                       John Humphrey, J.D. Power           Richard Peterson, S&P Capital IQ   Jeffrey Loo, S&P Capital IQ
   Alka Banerjee,
      S&P Dow Jones Indices                                                                                   Christopher Muir, S&P Capital IQ
                                                                         Growth of Green Bond Markets
   Robert Keiser, S&P Capital IQ                                                                              Erik Oja, S&P Capital IQ
                                                                           J.R. Rieger,
                                                                                                                                   (continued)
                                                                              S&P Dow Jones Indices

                                                                                                       McGRAW HILL FINANCIAL 2014 ANNUAL REPORT   5
                                                       Developing economies are eager to create             Colombia credit ratings company BRC
                                                       deeper capital markets to fund their                 Ratings Services, based in Bogota, and
                                                       growth and our ratings, benchmarks,                  increased its minority equity investment
                                                       research and analytics play a major role             in Rating Agency of Malaysia (RAM).
                                                       in capital market formation. We have thus
                                                       made a number of investments around            FOCUSING ON CUSTOMERS
                                                       the world to capture these growth              AND INNOVATION
                                                       opportunities including:
                                                                                                      In 2014 into 2015 we underscored our
                                                         S&P Dow Jones Indices signed
                                                                                                      commitment to innovation and deepening
                                                         partnership agreements with stock
                                                                                                      relationships with customers by investing
                                                         exchanges in Brazil, Korea, Mexico,
                                                                                                      in people and resources in new products
                                                         Peru and Taiwan and launched a series
                                                                                                      to meet the changing needs of the
                                                         of new indices to cover the equity
                                                                                                      marketplace. Two examples include:
                                                         market in South Africa.
                                                                                                            Launching the S&P Dow Jones Indices
                                                         We opened a new office at the Dubai
                                                                                                            Aggregate Bond Index Family to meet
                                                         International Financial Center to
                                                                                                            growing global demand for fixed income
                                                         enhance collaboration among our
                                                                                                            indices for use in both passive invest-
                                                         employees in the city. We are also
                                                                                                            ment strategies and as benchmarks for
                                                         expanding our offices in Beijing,
                                                                                                            actively managed portfolios. In 2014
                                                         Johannesburg and So Paulo to
                                                                                                            alone, S&P DJI launched more than
                                                         accommodate the growing needs of
                                                                                                            400 new indices.
                                                         these markets.
    S&P CAPITAL IQ PRESIDENT IMOGEN                                                                         Introducing S&P Capital IQ's Credit
    DILLON HATCHER, center, joins colleagues in          Platts, our most global business with
                                                                                                            Analytics suite of credit risk models,
    Dubai. In 2014, McGraw Hill Financial opened         more than 60% of its revenue coming
    new office space there.                                                                                 which includes market-driven and
                                                         from outside the U.S., acquired Eclipse
                                                                                                            fundamental-based tools paired with
    J.D. POWER'S MIKE BATTAGLIA speaks about             Energy Group, a privately owned provider
                                                                                                            an expanded set of global private
    the Canadian automotive industry at J.D. Power's     of data and analysis on European gas,
                                                                                                            company data. This offering allows
    TalkAuto Conference, cohosted by Canadian            power and global liquefied natural gas
    Black Book, in Toronto.                                                                                 holistic risk management for clients.
                                                         markets. Platts moved its headquarters
                                                         to London, a major energy trading hub,
                                                         where we have more Platts employees          BOOSTING PERFORMANCE
                                                         than anywhere else in the world.             At J.D. Power, we launched what we call the
                                                         J.D. Power launched financial services       NextGen project. This initiative standardized
                                                         products in Southeast Asia and Australia.    and automated research processes to
                                                                                                      improve quality, created a central repository
                                                         To serve the growing bond markets
                                                                                                      for data storage, integration and analysis
                                                         of Latin America and Asia, Standard
                                                                                                      and provided a single user experience for
                                                         & Poor's Ratings Services acquired
                                                                                                      all product delivery.




      Cathy Seifert, S&P Capital IQ       GLOBAL ENERGY MIX                    Jorge Montepeque, Platts            CHANGING GLOBAL
      Pavle Sabic, S&P Capital IQ                                              Stewart Glickman,                   DEMOGRAPHICS
                                          Oil Flows, Pricing and
      Dave Pope, S&P Capital IQ           Production Shifts                      S&P Capital IQ                    Global Aging
      Lindsey Bell, S&P Capital IQ           Dave Ernsberger, Platts                                                  Marko Mrsnik, S&P Ratings
                                                                             CLIMATE CHANGE
    Bank Disintermediation                   John Kingston,                                                        Retirement Security
                                                                             Climate Change
      Jean-Michel Six, S&P Ratings              MHFI Global Institute                                                Beth Ann Bovino, S&P Ratings
                                                                                John Kingston,
    International Trade                      Jorge Montepeque, Platts
                                                                                  MHFI Global Institute            Millennials and the Economy
       Paul Sheard, S&P Ratings              Howard Silverblatt,
                                                                                Mike Wilkins, S&P Ratings            Beth Ann Bovino, S&P Ratings
       Jean-Michel Six, S&P Ratings             S&P Dow Jones Indices
                                             Sam Stovall, S&P Capital IQ     Carbon Trading & Regulation             Rocky Clancy, J.D. Power
       Jim Corridore, S&P Capital IQ                                                                                 Thomas King, J.D. Power
                                             Stewart Glickman,                 John Kingston,
       Stewart Glickman,
                                                S&P Capital IQ                   MHFI Global Institute             Healthcare
         S&P Capital IQ
                                             Tom Watters, S&P Ratings        Green Investing                         Rick Johnson, J.D. Power
    COMMODITIES MARKETS                      Thomas Yagel, S&P Capital IQ      John Kingston,                        Jeffrey Loo, S&P Capital IQ
    Commodities Market Maturation         Shale Energy Production                MHFI Global Institute             Insurance
    and Development                         Dave Ernsberger, Platts            Michael Orzano,                        Jeremy Bowler, J.D. Power
      Jodie Gunzberg,                       John Kingston,                       S&P Dow Jones Indices
         S&P Dow Jones Indices                 MHFI Global Institute
      Joe Innace, Platts


6   McGRAW HILL FINANCIAL 2014 ANNUAL REPORT
While expanding our offices in certain
areas we are streamlining our real estate
portfolio in others. This has been an
important component of our productivity
initiative. Later this year, we will complete
a big step toward creating more oppor-
tunities for our employees in New York
City to collaborate when we finish moving
colleagues from Rockefeller Center, which
has served as our global headquarters,
to our longstanding offices in Lower
Manhattan's financial district. We also
                                                     A Commitment to Good Corporate Citizenship
sold a data center in East Windsor,
New Jersey, last year to leverage the scale
and capability of world-class IT partners.

ATTRACTING AND
DEVELOPING TALENT
The Board of Directors and senior
management team are committed to
building McGraw Hill Financial into an
organization with the very best people
in their fields. In 2014, we elevated and                WHAT MAKES A COMPANY RESPONSIBLE? At McGraw Hill Financial
brought in talented leaders throughout                   it is an ongoing commitment to fairness, integrity and transparency.
the company. We named Imogen Dillon                      These core values inform the decisions our employees make every day
Hatcher as President of S&P Capital                      and also drive our new corporate responsibility strategy.
IQ, recruited Lucy Fato as our General
Counsel and appointed Martina Cheung                     Launched in 2014, this strategy is built on the twin pillars of Financial
                                                         Essentials and Community Essentials. The goal is to create economic
                                                         growth and thriving communities by maximizing our business competencies
EMPLOYEES VOLUNTEERED IN MEXICO CITY X                   and contribution to global society.
  by painting the outdoor facilities of Aqui Nadie
Se Rinde, a nonprofit organization that provides                               Based on MHFI's unique business capabilities,
   comprehensive care for children with cancer.                                Financial Essentials puts the company's
                                                     IN 2014                   commitment into practice by providing financial
                                                                               knowledge, tools and insights particularly related
                                                     4,500                     to the credit and capital needs of female entre-
                                                     EMPLOYEES                 preneurs globally. In Mexico, for example, with our
                                                     VOLUNTEERED               support, the non-profit Women's World Banking
                                                                               conducted in-depth research to provide answers
                                                     FOR 170                   to why microenterprise lending to low-income
                                                     PROJECTS                  entrepreneurs has been slower to take off. The
                                                     GLOBALLY.                 subsequent report and roundtable discussions
INCOME AND THE LABOR FORCE                                                     are providing leaders in Mexico with the findings
                                                                               and ideas for a path forward.
Income Inequality
   Beth Ann Bovino, S&P Ratings                          Community Essentials is designed to build thriving communities by
Homeownership Trends                                     strengthening organizations, societies and the natural environment.
  Beth Ann Bovino, S&P Ratings                           The approach rests on our employees and is reflected in a variety of ways
  Rocky Clancy, J.D. Power                               including a network of vibrant Employee Resource Groups. In 2014, the
  Jeremy Bowler, J.D. Power                              company launched VALOR (Veterans and Allies Leading for Organizational
                                                         Results), which matches newly hired veterans to a veteran employee
Immigration Policy
  Beth Ann Bovino, S&P Ratings
                                                         mentor and other professional development services. Volunteering is
                                                         a hallmark of MHFI's new CR strategy and commitment to stronger
Rise of the Global Middle Class                          communities. In May of last year, 4,500 employees around the globe
   Paul Sheard, S&P Ratings                              participated in the company's inaugural Community Impact Month,
   Beth Ann Bovino, S&P Ratings                          which featured 170 volunteer projects from Hyderabad to Mexico City.
Wealth Distribution
                                                         For more information about MHFI's corporate responsibility programs
  Paul Sheard, S&P Ratings
  Beth Ann Bovino, S&P Ratings
                                                         and policies, visit www.mhfi.com/corporate-responsibility.

Education / Skills Gap / Labor Shortages
  Beth Ann Bovino, S&P Ratings



                                                                                             McGRAW HILL FINANCIAL 2014 ANNUAL REPORT   7
                                                      as Chief Strategy Officer. Lucy steps into    Many people are responsible for our
                                                      the role previously held by Ken Vittor, who   accomplishments. I thank the 17,000
                                                      retired last year pursuant to the company's   analysts, data specialists, economists,
                                                      longstanding retirement policies for          editors, researchers, software engineers
                                                      senior executives. I want to thank Ken        and all our people who create the essential
                                                      for his extraordinary contributions over      intelligence that our customers value
                                                      many years.                                   so much.
                                                                                                    As we go forward, the entire organization
                                                      SINCERE THANKS                                is aligned around the following key goals:
                                                      As previously announced, Terry McGraw            Providing superior customer service;
                                                      has decided not to stand for re-election         Extending our global capabilities;
                                                      as a Director at the next Annual Meeting.
                                                      Speaking on behalf of the Board of               Delivering on our financial targets;
                                                      Directors, our Presiding Director Ed Rust        Ensuring our resources are deployed
                                                      said on February 25, 2015, "Terry has been       wisely; and
                                                      a visionary and dedicated leader of this
                                                                                                       Operating with integrity, independence
                                                      company since he became President and
                                                                                                       and a robust control and compliance
                                                      CEO in 1998 and he has earned the respect
                                                                                                       environment.
                                                      of the global business community for his
                                                      many achievements. He has always been         In closing, I thank our shareholders for the
                                                      focused on serving customers and giving       trust you place in McGraw Hill Financial as
                                                      employees the best possible training and      we maintain our focus on creating growth
                                                      resources to provide superior service."       and driving performance by bringing
                                                                                                    transparency and independent insights
                                                      I know that I speak for all our employees
                                                                                                    to our customers and the global markets.
                                                      and you, our shareholders, when I thank
                                                      Terry for his outstanding leadership and      Sincerely,
                                                      his consistent dedication to our values of
                                                      fairness, integrity and transparency since
                                                      he joined the company in 1980.
    PRESIDENT AND CEO DOUG PETERSON                   I also want to welcome a new Director,        Douglas L. Peterson
    joined leaders for the World Economic Forum       Rebecca Jacoby, Chief Information Officer     President and Chief Executive Officer
    in Davos, Switzerland in January 2014.            of Cisco Systems, Inc., who joined the
    He moderated a panel geared toward the
                                                      Board in October. Rebecca is a global
    financial services industry entitled "Preparing
    for Prosperous Longevity" and spoke about         business leader whose expertise in cutting
    the imperative of financing the world's           edge technologies and data practices is
    infrastructure.                                   a great benefit to the company given the
                                                      critically important role technology plays
                                                      in the creation and effective distribution
                                                      of our benchmarks and analyses.




        "I thank the 17,000 analysts, data specialists,
        economists, editors, researchers, software engineers
        and all our people who create the essential intelligence
        that our customers value so much."




8   McGRAW HILL FINANCIAL 2014 ANNUAL REPORT
