\relax 
\providecommand*\new@tpo@label[2]{}
\babel@aux{english}{}
\@writefile{toc}{\contentsline {section}{\numberline {1.1}Assignment: Reuse}{1}\protected@file@percent }
\@writefile{toc}{\contentsline {section}{\numberline {1.2}Assignment: Design by Contract}{2}\protected@file@percent }
\@writefile{toc}{\contentsline {section}{\numberline {1.3}Assignment: Design by Contract with Inheritance}{3}\protected@file@percent }
