# Fdb version 3
["pdflatex"] 1572863437 "/home/coanda/Projects/uni/19ws-oosc/1-Assignment/exercise1_1/assignment1.tex" "/home/coanda/Projects/uni/19ws-oosc/1-Assignment/exercise1_1/assignment1.pdf" "assignment1" 1572863438
  "/home/coanda/Projects/uni/19ws-oosc/1-Assignment/exercise1_1/assignment1.aux" 1572863438 424 e76d10c3dd31479b0a162872a7dc60cd ""
  "/home/coanda/Projects/uni/19ws-oosc/1-Assignment/exercise1_1/assignment1.tex" 1572863437 7887 f15d2dfa8ff80e3494f5adbd96882861 ""
  "/usr/share/texmf-dist/fonts/enc/dvips/base/8r.enc" 1557554374 4850 80dc9bab7f31fb78a000ccfed0e27cab ""
  "/usr/share/texmf-dist/fonts/map/fontname/texfonts.map" 1557554374 3332 103109f5612ad95229751940c61aada0 ""
  "/usr/share/texmf-dist/fonts/tfm/adobe/helvetic/phvb8r.tfm" 1557554374 4484 b828043cbd581d289d955903c1339981 ""
  "/usr/share/texmf-dist/fonts/tfm/adobe/helvetic/phvb8t.tfm" 1557554374 6628 34c39492c0adc454c1c199922bba8363 ""
  "/usr/share/texmf-dist/fonts/tfm/adobe/helvetic/phvr8r.tfm" 1557554374 4712 9ef4d7d106579d4b136e1529e1a4533c ""
  "/usr/share/texmf-dist/fonts/tfm/adobe/helvetic/phvr8t.tfm" 1557554374 7040 b2bd27e2bfe6f6948cbc3239cae7444f ""
  "/usr/share/texmf-dist/fonts/tfm/jknappen/ec/ecrm1200.tfm" 1557554374 3584 f80ddd985bd00e29e9a6047ebd9d4781 ""
  "/usr/share/texmf-dist/fonts/tfm/public/ae/aer12.tfm" 1557554374 6084 8180e586f034a9866b6c5554cc5644fe ""
  "/usr/share/texmf-dist/fonts/tfm/public/amsfonts/cmextra/cmex7.tfm" 1557554374 1004 54797486969f23fa377b128694d548df ""
  "/usr/share/texmf-dist/fonts/tfm/public/amsfonts/cmextra/cmex8.tfm" 1557554374 988 bdf658c3bfc2d96d3c8b02cfc1c94c20 ""
  "/usr/share/texmf-dist/fonts/tfm/public/amsfonts/symbols/msam10.tfm" 1557554374 916 f87d7c45f9c908e672703b83b72241a3 ""
  "/usr/share/texmf-dist/fonts/tfm/public/amsfonts/symbols/msam7.tfm" 1557554374 928 2dc8d444221b7a635bb58038579b861a ""
  "/usr/share/texmf-dist/fonts/tfm/public/amsfonts/symbols/msbm10.tfm" 1557554374 908 2921f8a10601f252058503cc6570e581 ""
  "/usr/share/texmf-dist/fonts/tfm/public/amsfonts/symbols/msbm7.tfm" 1557554374 940 228d6584342e91276bf566bcf9716b83 ""
  "/usr/share/texmf-dist/fonts/tfm/public/cm/cmex10.tfm" 1557554374 992 662f679a0b3d2d53c1b94050fdaa3f50 ""
  "/usr/share/texmf-dist/fonts/tfm/public/cm/cmmi12.tfm" 1557554374 1524 4414a8315f39513458b80dfc63bff03a ""
  "/usr/share/texmf-dist/fonts/tfm/public/cm/cmmi6.tfm" 1557554374 1512 f21f83efb36853c0b70002322c1ab3ad ""
  "/usr/share/texmf-dist/fonts/tfm/public/cm/cmmi8.tfm" 1557554374 1520 eccf95517727cb11801f4f1aee3a21b4 ""
  "/usr/share/texmf-dist/fonts/tfm/public/cm/cmr12.tfm" 1557554374 1288 655e228510b4c2a1abe905c368440826 ""
  "/usr/share/texmf-dist/fonts/tfm/public/cm/cmr6.tfm" 1557554374 1300 b62933e007d01cfd073f79b963c01526 ""
  "/usr/share/texmf-dist/fonts/tfm/public/cm/cmr8.tfm" 1557554374 1292 21c1c5bfeaebccffdb478fd231a0997d ""
  "/usr/share/texmf-dist/fonts/tfm/public/cm/cmsy10.tfm" 1557554374 1124 6c73e740cf17375f03eec0ee63599741 ""
  "/usr/share/texmf-dist/fonts/tfm/public/cm/cmsy6.tfm" 1557554374 1116 933a60c408fc0a863a92debe84b2d294 ""
  "/usr/share/texmf-dist/fonts/tfm/public/cm/cmsy8.tfm" 1557554374 1120 8b7d695260f3cff42e636090a8002094 ""
  "/usr/share/texmf-dist/fonts/tfm/public/eurosym/feymr10.tfm" 1557554374 564 4473b3a7796d55e24866e7d8c333bf96 ""
  "/usr/share/texmf-dist/fonts/tfm/public/latex-fonts/lasy6.tfm" 1557554374 520 4889cce2180234b97cad636b6039c722 ""
  "/usr/share/texmf-dist/fonts/type1/public/amsfonts/cm/cmmi12.pfb" 1557554374 36741 fa121aac0049305630cf160b86157ee4 ""
  "/usr/share/texmf-dist/fonts/type1/public/amsfonts/cm/cmmi8.pfb" 1557554374 35469 70d41d2b9ea31d5d813066df7c99281c ""
  "/usr/share/texmf-dist/fonts/type1/public/amsfonts/cm/cmr12.pfb" 1557554374 32722 d7379af29a190c3f453aba36302ff5a9 ""
  "/usr/share/texmf-dist/fonts/type1/public/amsfonts/cm/cmsy10.pfb" 1557554374 32569 5e5ddc8df908dea60932f3c484a54c0d ""
  "/usr/share/texmf-dist/fonts/type1/public/amsfonts/cm/cmsy8.pfb" 1557554374 32626 4f5c1b83753b1dd3a97d1b399a005b4b ""
  "/usr/share/texmf-dist/fonts/type1/public/eurosym/feymr10.pfb" 1557554374 20847 cc0ded7ca5f7a3cdcc6ec70b56da93d5 ""
  "/usr/share/texmf-dist/fonts/type1/urw/helvetic/uhvb8a.pfb" 1557554374 35941 f27169cc74234d5bd5e4cca5abafaabb ""
  "/usr/share/texmf-dist/fonts/type1/urw/helvetic/uhvr8a.pfb" 1557554374 44648 23115b2a545ebfe2c526c3ca99db8b95 ""
  "/usr/share/texmf-dist/fonts/vf/adobe/helvetic/phvb8t.vf" 1557554374 2340 0efed6a948c3c37d870e4e7ddb85c7c3 ""
  "/usr/share/texmf-dist/fonts/vf/adobe/helvetic/phvr8t.vf" 1557554374 2344 44ff28c9ef2fc97180cd884f900fee71 ""
  "/usr/share/texmf-dist/tex/context/base/mkii/supp-pdf.mkii" 1557554374 71627 94eb9990bed73c364d7f53f960cc8c5b ""
  "/usr/share/texmf-dist/tex/generic/babel-english/english.ldf" 1557554374 7008 9ff5fdcc865b01beca2b0fe4a46231d4 ""
  "/usr/share/texmf-dist/tex/generic/babel/babel.def" 1557554374 74954 c1d5e73fef972276308f149f1e33bdd6 ""
  "/usr/share/texmf-dist/tex/generic/babel/babel.sty" 1557554374 16684 ae52bcf6432ee858f790e89b0a752277 ""
  "/usr/share/texmf-dist/tex/generic/babel/switch.def" 1557554374 13874 e38d974000bbdedc4c7e8a75b42c2112 ""
  "/usr/share/texmf-dist/tex/generic/babel/txtbabel.def" 1557554374 7435 ef73091c345c1e2e85b0f9a441eb1f7d ""
  "/usr/share/texmf-dist/tex/generic/ifxetex/ifxetex.sty" 1557554374 1458 43ab4710dc82f3edeabecd0d099626b2 ""
  "/usr/share/texmf-dist/tex/generic/oberdiek/etexcmds.sty" 1557554374 7612 729a8cc22a1ee0029997c7f74717ae05 ""
  "/usr/share/texmf-dist/tex/generic/oberdiek/ifluatex.sty" 1557554374 7324 2310d1247db0114eb4726807c8837a0e ""
  "/usr/share/texmf-dist/tex/generic/oberdiek/ifpdf.sty" 1557554374 1300 96620a7d94bc0ceb261d968770ce8315 ""
  "/usr/share/texmf-dist/tex/generic/oberdiek/ifvtex.sty" 1557554374 6797 90b7f83b0ad46826bc16058b1e3d48df ""
  "/usr/share/texmf-dist/tex/generic/oberdiek/infwarerr.sty" 1557554374 8253 473e0e41f9adadb1977e8631b8f72ea6 ""
  "/usr/share/texmf-dist/tex/generic/oberdiek/kvdefinekeys.sty" 1557554374 5152 b67a3a964ad9851e095110c854a1d461 ""
  "/usr/share/texmf-dist/tex/generic/oberdiek/kvsetkeys.sty" 1557554374 14040 ac8866aac45982ac84021584b0abb252 ""
  "/usr/share/texmf-dist/tex/generic/oberdiek/ltxcmds.sty" 1557554374 18425 5b3c0c59d76fac78978b5558e83c1f36 ""
  "/usr/share/texmf-dist/tex/generic/oberdiek/pdftexcmds.sty" 1557554374 20457 0d2e642faacbb41c9d72690f8cc529cd ""
  "/usr/share/texmf-dist/tex/generic/ulem/ulem.sty" 1557554374 23756 854c01b779030ff5b2aad88ba7a119f2 ""
  "/usr/share/texmf-dist/tex/latex/ae/ae.sty" 1557554374 1225 5aef800ba6cda7885d41428e026f49e3 ""
  "/usr/share/texmf-dist/tex/latex/ae/aecompl.sty" 1557554374 1338 d60c03fa26e0ef681e85d0811bcc2388 ""
  "/usr/share/texmf-dist/tex/latex/ae/t1aer.fd" 1557554374 1844 da911cbbb4e7e5dc2776545b8b9cbc06 ""
  "/usr/share/texmf-dist/tex/latex/amscls/amsthm.sty" 1557554374 12604 3dec726c041422879dc3268237f09026 ""
  "/usr/share/texmf-dist/tex/latex/amsfonts/amsfonts.sty" 1557554374 5949 3f3fd50a8cc94c3d4cbf4fc66cd3df1c ""
  "/usr/share/texmf-dist/tex/latex/amsfonts/amssymb.sty" 1557554374 13829 94730e64147574077f8ecfea9bb69af4 ""
  "/usr/share/texmf-dist/tex/latex/amsfonts/umsa.fd" 1557554374 961 6518c6525a34feb5e8250ffa91731cff ""
  "/usr/share/texmf-dist/tex/latex/amsfonts/umsb.fd" 1557554374 961 d02606146ba5601b5645f987c92e6193 ""
  "/usr/share/texmf-dist/tex/latex/amsmath/amsbsy.sty" 1557554374 2211 ca7ce284ab93c8eecdc6029dc5ccbd73 ""
  "/usr/share/texmf-dist/tex/latex/amsmath/amsgen.sty" 1557554374 4161 7f6eb9092061a11f87d08ed13515b48d ""
  "/usr/share/texmf-dist/tex/latex/amsmath/amsmath.sty" 1557554374 85093 77cfa18ddbae4d9b74ade33d843686d3 ""
  "/usr/share/texmf-dist/tex/latex/amsmath/amsopn.sty" 1557554374 4116 32e6abd27229755a83a8b7f18e583890 ""
  "/usr/share/texmf-dist/tex/latex/amsmath/amstext.sty" 1557554374 2432 8ff93b1137020e8f21930562a874ae66 ""
  "/usr/share/texmf-dist/tex/latex/base/fontenc.sty" 1557554374 4573 e9e01f5b11821a77b916dad378cb86b8 ""
  "/usr/share/texmf-dist/tex/latex/base/inputenc.sty" 1557554374 5052 b64c57f4a38aae0d2745f8298fa50814 ""
  "/usr/share/texmf-dist/tex/latex/base/latin1.def" 1557554374 5679 7bd3029ea9aed93e5c7975d66608ed9e ""
  "/usr/share/texmf-dist/tex/latex/base/t1enc.def" 1557554374 10689 ce0f2353f9a1f42b29f591f3fe8e040a ""
  "/usr/share/texmf-dist/tex/latex/base/textcomp.sty" 1557554374 16156 a293f9cfd4f8552bb5d1028389f53e72 ""
  "/usr/share/texmf-dist/tex/latex/base/ts1cmr.fd" 1557554374 2433 cdefd2509a12ba58001f2024f63aae9a ""
  "/usr/share/texmf-dist/tex/latex/base/ts1enc.def" 1557554374 7769 97b639552068544f7c98d557abb19f41 ""
  "/usr/share/texmf-dist/tex/latex/base/ts1enc.dfu" 1557554374 4973 923be56c54607ca99f7cc085a8c7e52b ""
  "/usr/share/texmf-dist/tex/latex/booktabs/booktabs.sty" 1557554374 5869 94335281ffcab47f341cf07ea8220e30 ""
  "/usr/share/texmf-dist/tex/latex/cancel/cancel.sty" 1557556602 7592 dd751af313a16a0308545d5bfd7aaaa2 ""
  "/usr/share/texmf-dist/tex/latex/eurosym/eurosym.sty" 1557554374 3028 8faeef64adee9b964b5e7f5e45921024 ""
  "/usr/share/texmf-dist/tex/latex/float/float.sty" 1557554374 6749 16d2656a1984957e674b149555f1ea1d ""
  "/usr/share/texmf-dist/tex/latex/geometry/geometry.sty" 1557554374 41645 0653033a985e06c69a2a9cea9a95e31a ""
  "/usr/share/texmf-dist/tex/latex/graphics-cfg/color.cfg" 1557554374 1213 620bba36b25224fa9b7e1ccb4ecb76fd ""
  "/usr/share/texmf-dist/tex/latex/graphics-cfg/graphics.cfg" 1557554374 1224 978390e9c2234eab29404bc21b268d1e ""
  "/usr/share/texmf-dist/tex/latex/graphics-def/pdftex.def" 1557554374 17334 520b9b85ad8a2a48eda3f643e27a5179 ""
  "/usr/share/texmf-dist/tex/latex/graphics/color.sty" 1557554374 7028 112f909feb676788e7ea1c5b0b76320f ""
  "/usr/share/texmf-dist/tex/latex/graphics/graphics.sty" 1557554374 15272 5a97061616e0c8b2aa79c6615ff769f4 ""
  "/usr/share/texmf-dist/tex/latex/graphics/graphicx.sty" 1557554374 9063 d0a305975932762117cd1f06a582f896 ""
  "/usr/share/texmf-dist/tex/latex/graphics/keyval.sty" 1557554374 2591 6404d0c7d28505fb38ce0d86c2e28ae7 ""
  "/usr/share/texmf-dist/tex/latex/graphics/trig.sty" 1557554374 3977 cb9221976ed8a183afad65b59aa8629a ""
  "/usr/share/texmf-dist/tex/latex/koma-script/scrbase.sty" 1557554374 81085 17c6bc778d65581878b7ff0b0753fb77 ""
  "/usr/share/texmf-dist/tex/latex/koma-script/scrkbase.sty" 1557554374 22023 79a694d8a1bcff7a7bc417d04572bae5 ""
  "/usr/share/texmf-dist/tex/latex/koma-script/scrlfile.sty" 1557554374 15778 6cd4024c756f36926e3648af5491b355 ""
  "/usr/share/texmf-dist/tex/latex/koma-script/scrreprt.cls" 1557554374 250219 5921b182dce30e19fc1d80a5c44210d4 ""
  "/usr/share/texmf-dist/tex/latex/koma-script/scrsize12pt.clo" 1557554374 6367 8c4cbc661c01bc277f8f3e5667413f26 ""
  "/usr/share/texmf-dist/tex/latex/koma-script/tocbasic.sty" 1557554374 81976 8b9a8578993190cef03de666387a190a ""
  "/usr/share/texmf-dist/tex/latex/koma-script/typearea.sty" 1557554374 55196 016cf9f6a6c58ce9e573af1072da1623 ""
  "/usr/share/texmf-dist/tex/latex/latexconfig/epstopdf-sys.cfg" 1557554374 678 4792914a8f45be57bb98413425e4c7af ""
  "/usr/share/texmf-dist/tex/latex/oberdiek/epstopdf-base.sty" 1557554374 12095 5337833c991d80788a43d3ce26bd1c46 ""
  "/usr/share/texmf-dist/tex/latex/oberdiek/grfext.sty" 1557554374 7075 2fe3d848bba95f139de11ded085e74aa ""
  "/usr/share/texmf-dist/tex/latex/oberdiek/kvoptions.sty" 1557554374 22417 1d9df1eb66848aa31b18a593099cf45c ""
  "/usr/share/texmf-dist/tex/latex/paralist/paralist.sty" 1557556602 14857 82c76ebe8f06becf69ab309565b2a0cb ""
  "/usr/share/texmf-dist/tex/latex/psnfss/t1phv.fd" 1557554374 1488 9a55ac1cde6b4798a7f56844bb75a553 ""
  "/usr/share/texmf-dist/tex/latex/titlesec/titlesec.sty" 1557556602 37387 afa86533e532701faf233f3f592c61e0 ""
  "/usr/share/texmf-dist/tex/latex/tools/array.sty" 1557554374 12527 31ab547f6520657998ecf91709f950ac ""
  "/usr/share/texmf-dist/tex/latex/tools/tabularx.sty" 1557554374 7145 01b7b53bf69f5c0f63803657eb51217f ""
  "/usr/share/texmf-dist/tex/latex/wrapfig/wrapfig.sty" 1557556602 26220 3701aebf80ccdef248c0c20dd062fea9 ""
  "/usr/share/texmf-dist/web2c/texmf.cnf" 1557554374 33301 a3134070eacafb10b1f371612ce2650d ""
  "/var/lib/texmf/fonts/map/pdftex/updmap/pdftex.map" 1572863171 3106380 436fef8c2e0ca660ce1dd89198cfa583 ""
  "/var/lib/texmf/web2c/pdftex/pdflatex.fmt" 1572863164 7979416 67a28989a5131e04d58d12e55cd781df ""
  "assignment1.aux" 1572863438 424 e76d10c3dd31479b0a162872a7dc60cd "pdflatex"
  "assignment1.tex" 1572863437 7887 f15d2dfa8ff80e3494f5adbd96882861 ""
  "logoswc.png" 1572819857 14016 ecf7fa93c8d1c55d721ff13a0fcd230c ""
  (generated)
  "assignment1.pdf"
  "/home/coanda/Projects/uni/19ws-oosc/1-Assignment/exercise1_1/assignment1.log"
  "assignment1.log"
  "/home/coanda/Projects/uni/19ws-oosc/1-Assignment/exercise1_1/assignment1.pdf"
  "assignment1.aux"
