<?xml version="1.0" encoding="UTF-8" standalone="no"?>
<svg
   width="65"
   height="65"
   id="screenshot-4a8add3e-3708-8010-8005-5f95f88e1d3b"
   viewBox="0 0 65 65"
   fill="none"
   version="1.1"
   sodipodi:docname="favicon.svg"
   inkscape:version="1.4 (e7c3feb100, 2024-10-09)"
   xmlns:inkscape="http://www.inkscape.org/namespaces/inkscape"
   xmlns:sodipodi="http://sodipodi.sourceforge.net/DTD/sodipodi-0.dtd"
   xmlns="http://www.w3.org/2000/svg"
   xmlns:svg="http://www.w3.org/2000/svg">
  <defs
     id="defs1" />
  <sodipodi:namedview
     id="namedview1"
     pagecolor="#ffffff"
     bordercolor="#000000"
     borderopacity="0.25"
     inkscape:showpageshadow="2"
     inkscape:pageopacity="0.0"
     inkscape:pagecheckerboard="0"
     inkscape:deskcolor="#d1d1d1"
     inkscape:zoom="9.2063492"
     inkscape:cx="47.956034"
     inkscape:cy="47.358621"
     inkscape:window-width="2560"
     inkscape:window-height="1368"
     inkscape:window-x="0"
     inkscape:window-y="0"
     inkscape:window-maximized="1"
     inkscape:current-layer="screenshot-4a8add3e-3708-8010-8005-5f95f88e1d3b" />
  <g
     id="shape-4a8add3e-3708-8010-8005-5f95f88e1d3b"
     width="168px"
     height="63px"
     version="1.1"
     rx="0"
     ry="0"
     style="fill:#000000"
     transform="matrix(1.4965625,0,0,1.4358318,-17.612428,-12.098713)">
    <g
       id="shape-4a8add3e-3708-8010-8005-5f95f88e1d3c"
       style="display:none">
      <g
         class="fills"
         id="fills-4a8add3e-3708-8010-8005-5f95f88e1d3c">
        <rect
           width="69"
           height="63"
           x="0"
           style="fill:none"
           ry="0"
           fill="none"
           rx="0"
           y="0"
           id="rect1" />
      </g>
    </g>
    <g
       id="shape-4a8add3e-3708-8010-8005-5f95f88e1d3d"
       rx="0"
       ry="0"
       style="fill:#000000">
      <g
         id="shape-4a8add3e-3708-8010-8005-5f95f88e1d3e"
         rx="0"
         ry="0"
         style="fill:#000000">
        <g
           id="shape-4a8add3e-3708-8010-8005-5f95f88e1d40">
          <g
             class="fills"
             id="fills-4a8add3e-3708-8010-8005-5f95f88e1d40">
            <path
               d="M 55,31 C 55,25.257 52.764,19.858 48.703,15.797 44.642,11.736 39.243,9.5 33.5,9.5 c -3.561,0 -6.989,0.861 -10.048,2.482 -4.15,-1.652 -7.346,-1.612 -9.105,0.147 -1.792,1.792 -1.822,4.992 -0.088,9.255 C 12.781,24.333 12,27.606 12,31 c 0,5.743 2.236,11.142 6.297,15.203 4.061,4.061 9.46,6.297 15.203,6.297 3.498,0 6.869,-0.831 9.887,-2.398 1.992,0.786 3.764,1.182 5.259,1.182 1.597,0 2.88,-0.45 3.784,-1.354 1.762,-1.762 1.819,-4.886 0.173,-9.044 C 54.169,37.868 55,34.498 55,31 Z M 15.743,13.351 c 0.922,-1.059 2.805,-1.12 5.257,-0.237 -1.006,0.796 -1.956,1.702 -2.838,2.716 -0.984,1.132 -1.852,2.362 -2.6,3.67 -0.803,-2.882 -0.749,-5.079 0.181,-6.149 z m 35.503,35.398 c -0.924,0.924 -2.8,0.987 -5.246,0.236 1.066,-0.722 2.071,-1.55 3.002,-2.48 0.931,-0.931 1.76,-1.938 2.483,-3.005 0.756,2.455 0.683,4.327 -0.239,5.249 z M 43.217,47.902 C 42.923,47.773 42.624,47.636 42.32,47.49 37.806,45.315 32.701,41.499 27.946,36.744 25.613,34.411 23.458,31.933 21.625,29.485 l 3.484,0.898 c 0.509,0.131 1.027,-0.176 1.158,-0.684 0.131,-0.509 -0.175,-1.027 -0.684,-1.159 l -6.002,-1.546 c -0.28,-0.072 -0.579,-0.013 -0.81,0.161 -0.231,0.174 -0.371,0.445 -0.378,0.734 l -0.168,6.196 c -0.014,0.526 0.4,0.963 0.925,0.977 0.009,0 0.018,0.001 0.026,0.001 0.514,0 0.937,-0.41 0.951,-0.926 l 0.091,-3.359 c 1.862,2.471 4.036,4.964 6.383,7.311 4.746,4.746 9.854,8.597 14.441,10.893 C 38.721,49.959 36.173,50.5 33.5,50.5 22.748,50.5 14,41.752 14,31 c 0,-7.154 3.873,-13.419 9.631,-16.812 0.272,0.12 0.547,0.246 0.827,0.381 4.514,2.175 9.619,5.991 14.374,10.746 2.333,2.333 4.488,4.811 6.321,7.259 l -3.484,-0.898 c -0.509,-0.131 -1.027,0.175 -1.158,0.684 -0.131,0.509 0.175,1.027 0.684,1.159 l 6.002,1.546 c 0.078,0.02 0.158,0.03 0.237,0.03 0.205,0 0.406,-0.065 0.573,-0.191 0.231,-0.174 0.371,-0.445 0.378,-0.734 l 0.168,-6.197 c 0.014,-0.525 -0.4,-0.962 -0.925,-0.976 -0.009,0 -0.018,-0.001 -0.026,-0.001 -0.514,0 -0.937,0.41 -0.951,0.926 L 46.56,31.281 C 44.698,28.81 42.524,26.317 40.177,23.969 35.445,19.237 30.352,15.395 25.774,13.097 28.145,12.07 30.757,11.5 33.5,11.5 44.252,11.5 53,20.248 53,31 c 0,7.217 -3.941,13.53 -9.783,16.902 z"
               fill-rule="nonzero"
               stroke="none"
               stroke-width="1"
               style="fill:#612158"
               id="path1" />
          </g>
        </g>
      </g>
    </g>
  </g>
</svg>
